{"text_format":"1","workbook":"xlsx","n_sheets":12,"sheets":["Registro de cambios","configuracion","DIGITADOR","DATOS","REFERENTES","OTRAS REFERENCIAS","Resumen","AGD_MUESTREOS","AGD_PARAMETRO","AGD_MUESTRAS","AGD_MUESTRAS_VARIABLES","AGD_AUTORIAS"],"not_rendered":{"charts":0,"images":0,"macros":1,"external_links":1,"defined_names":30,"comments":1,"pivot_tables":1},"unopened":[],"bounds":{"document_bytes":16777216,"sheet_cells":100000,"rows_first":2000,"rows_last":500,"rows_between":2000,"halvings":0,"cell_chars":16384,"cell_head_chars":4096},"cells_cut":0,"cells_raw":0,"read":"whole","date_system":"1900"}

{"sheet":"Registro de cambios","index":0,"n_rows":9,"n_cols":7,"rows_kept":9,"cut":false,"hidden":true,"merged":[[1,3,1,6]]}
[]
[null,null,null,"REGISTRO DE CAMBIOS"]
[null,null,null,"VERSIÓN No.","CAMBIO REALIZADO","AUTOR","VIGENTE DESDE"]
[null,null,null,"20241113i","Actualización del código de la macro.\n\nSe eliminó la URL de la antigua API de portete:\n       http://portete.invemar.org.co:7003/ArgosWebServices-RESTWebService-context-root/rest/1.0\n\nFue reemplazada por la URL de la API de ARGOS:\n       https://argos.invemar.org.co/api/\n\nLa API contiene End Points que permiten tener mayor control, facilitan la descarga de referentes (listas de usuarios, estaciones, especies, etc.) que corresponden a criterios específicos como el proyecto usado en la plantilla para evitar descargar data innecesaria.\n\nDel mismo modo, también permite la carga de información a la BDD del INVEMAR.\n\nLa macro toma los Endpoints desde la hoja configuracion de una tabla llamada \"Configuración referentes\", a la que se le puede modificar las rutas de la API o agregar nuevas. cabe resaltar que se puede \"quemar\" directamente en la macro los Endpoints que lo requieran","Juan Palomino","2024-11-13"]
[null,null,null,"20200130i","Para trazabilididad la hoja se incluye el nombre del archivo fuente y la posibilidad de anotar el DOI principal del metadato\nPor usabilidad las pestañas que son de interes para el usuario son las verdes\nSi se define mas de un proyecto los referentes de estaciones e investigadores se descargan consecutivo en las mismas columnas\nSe controla la versión para la plantilla mediante comparación dato en AGLOV de la BD.\n***CATEGORIA DE VIDA:Esta asignada como unica para la especie en la lista AG_ESPECIE 1480 27. Si es asi no se ingresa a la plantilla, aunque una especie de coral puede tener mas de una categoria de vida. Si se decide ingresar la categoria, se debe definir en agm_campos.\n",null,"2020-01-30"]
[null,null,null,"20180413i","Se modifica la generación de los ID de muestreo y se agrega macro que genera número aleatorio en la hoja DIGITADOR.",null,"2018-04-13"]
[null,null,null,"20180525m","Se corrige bug al seleccionar la región en la hoja DIGITADOR (la hoja se encontraba bloqueada desde el inicio y no se dejaba manipular).",null,"2018-05-25"]
[null,null,null,"20180724m","Se corrige la hoja de configuración. Valores mal asignados.",null,"2018-07-24"]
[null,null,null,"20180926m","Se bloquea el campo de consecutivo con el que se arma el ID_MUESTRA para que la macro no lo modifique",null,"2018-09-26"]

{"sheet":"configuracion","index":1,"n_rows":71,"n_cols":8,"rows_kept":71,"cut":false,"hidden":true,"merged":[[61,0,61,2],[28,0,35,0],[37,0,42,0],[45,0,45,1],[0,0,2,0],[3,0,5,0],[7,0,8,0],[9,0,15,0],[17,0,21,0],[23,0,26,0]]}
["general","urlServicio","https://argos.invemar.org.co/api/"]
[null,"fila de inicio",5]
[null,"fila de fin",104]
["metodologias","Metodologias",25]
[null,"Referentes",104]
[null,"Cantidad maxima de referentes ",104]
["estaciones/investigadores","proyectos",{"$f":"DIGITADOR!B9","v":1480}]
["Lista especies","metodologias",25]
[null,"proyectos",{"$f":"DIGITADOR!B9","v":1480}]
["MUESTREOS","ID_MUESTREO","DATOS,D"]
{"$rows_left_out":62}
{"sheet":"DIGITADOR","index":2,"n_rows":29,"n_cols":4,"rows_kept":29,"cut":false,"hidden":false,"merged":[[20,0,20,1],[14,3,16,9],[5,0,6,0],[0,0,0,1],[0,3,5,9],[14,0,14,1],[6,3,11,9],[12,3,13,9]]}
["Plantilla para la Recolección de Datos Salud Coralina",null,null,"Recomendaciones generales: \n¡Precaución! No inserte Filas o Columnas.\nEn los casos en que falte un valor a ingresar que provenga de la hoja de referencias, informe para que el administrador del sistema haga las adiciones necesarias.\nEsta es una plantilla programada. Las columnas de color oscuro se llenan automaticamente, principalmente a partir de los contenidos de la hoja de referencias. \nNO UTILICE PUNTO Y COMA (;) en ningun campo, por ser el separador de variables (columnas). Tampoco escriba las unidades de medida, no son necesarias.\nPara el correcto funcionamiento de la hoja debe estar activa la opcion de Excel de ejecutar macros (al abrir la hoja acepte la opcion habilitar macros, mensaje de Excel que aparece en la parte superior de la hoja en un recuadro amarillo). La extensión del archivo debe ser .xlsm\nSe recomienda renombrar el archivo de la siguiente manera: SIMAC_Salud_NombreEstacion_FechaMonitoreo.xlsm"]
["Código investigador",{"$f":"IF(B3=\"\",\"\",INDEX(REFERENTES!Y:Z,MATCH(B3,REFERENTES!Z:Z,0),1))","v":""}]
["Nombre del investigador"]
["Entidad","INVEMAR"]
["Versión plantilla",{"$f":"'Registro de cambios'!$D$4","v":"20241113i"}]
["Fecha en la que ingresa los datos en esta hoja","DD/MM/AAAA"]
[null,"3000-12-12",null,"Previamente a iniciar el llenado de la plantilla, debe presionar el botón \"Descargar referentes\" para que los referentes de ésta plantilla sean actualizados. \nLuego de llenar completamente la plantilla, haga clic sobre el botón \"Generar tablas\" para que los datos sean organizados antes de cargarlos al Sistema de Información.\nAntes de presionar el botón \"Generar tablas\" verifique que:\na. No haya celdas con valores como \"#N/A\" o \"#¡REF!\"\nb. No se esten aplicando filtros en la hoja de datos \nPara finalizar, presione el botón \"Cargar datos\"."]
[]
["Código proyecto",1480]
["Nombre proyecto","Sistema de Monitoreo de los Arrecifes Coralinos en Colombia"]
{"$rows_left_out":20}
{"sheet":"DATOS","index":3,"n_rows":104,"n_cols":35,"rows_kept":104,"cut":false,"hidden":false,"merged":[[1,33,1,34],[1,2,3,2],[0,3,1,6],[1,9,1,10],[1,22,1,25],[1,28,1,32],[1,14,1,19],[3,20,3,21]]}
[{"$f":"DIGITADOR!B7+F5","v":"3000-12-12"},null,null,"Fecha"]
[{"$f":"TEXT(A1,\"yyyymmdd\")","v":"30001212"},null,"CODIGO",null,null,null,null,null,null,null,null,null,null,null,null,null,null,null,null,null,null,null,null,null,null,null,null,null,null,null,null,null,null,"NUMERO DE COLONIAS"]
[null,null,null,null,null,null,"DATE","MES","TEMPO",null,null,"UNIKE_KEY",null,null,null,null,null,null,null,null,null,null,null,null,null,null,null,null,null,null,null,null,null,"NC"]
[null,null,null,"CODMUESTREO","FECHA","HORA","DATE",null,"Temporada","DATOS TOMADOS POR","COD USUARIO","UNIKE_KEY","ENTIDAD","OBSERVACIONES MUESTREO","CONSECUTIVO","ID_MUESTRA","ID_MUESTREO (AGD_MUESTREOS)",null,"ESTACION","ID ESTACION",null,null,"PROF","COD","TRANSECTO","UBICACION","CUADRANTE","REPLICA","CAT_VIDA","ESPECIE","DESCRIPCION - ESPECIE","CAT\nSALUD","DESCRIPCION_SALUD","VALOR","OBSERVACIONES MUESTRA"]
[null,null,{"$f":"IF(L5=L4,C4,C4+1)","v":1},{"$f":"IF(Q5=\"\",\"\",IF(COUNTIF($Q5:Q5, Q5)>1, \"\", Q5))","v":""},null,null,{"$f":"IF(E5=\"\",\"\",E5+F5)","v":""},{"$f":"IF(G5<>\"\",MONTH(G5),\"\")","v":""},{"$f":"IF(D5=\"\",\"\",1)","v":""},null,{"$f":"IF(J5=\"\",\"\",INDEX(REFERENTES!$Y:$Z,MATCH(J5,REFERENTES!$Z:$Z,0),1))","v":""},{"$f":"IF(G5=\"\",\"\",CONCATENATE(G5,T5,K5,AB5))","v":""},null,null,1,{"$f":"IF(Q5=\"\",\"\",CONCATENATE(Q5,ROW()-2))","v":""},{"$f":"IF(E5<>\"\",CONCATENATE($A$2,DIGITADOR!$B$2,DIGITADOR!$M$1,ROW()-4),\"\")","v":""},null,null,{"$f":"IF(S5=\"\",\"\",INDEX('OTRAS REFERENCIAS'!$L$5:$M$150,MATCH(S5,'OTRAS REFERENCIAS'!$L$5:$L$150,0),2))","v":""},null,null,null,{"$f":"IF(W5=\"\",\"\",VLOOKUP(W5,'OTRAS REFERENCIAS'!$A$7:$B$9,2,FALSE))","v":""},null,{"$f":"CONCATENATE(X5,Y5)","v":""},null,null,{"$f":"IF(AD5=\"\",\"\",INDEX(REFERENTES!$J:$K,MATCH(AD5,REFERENTES!$K:$K,0),2))","v":""},null,{"$f":"IF(AD5=\"\",\"\",INDEX(REFERENTES!$J:$L,MATCH(AD5,REFERENTES!$K:$K,0),1))","v":""},null,{"$f":"IF(AF5=\"\",\"\",INDEX(REFERENTES!$D:$E,MATCH(AF5,REFERENTES!$E:$E,0),1))","v":""}]
[null,null,1,{"$f":"IF(Q6=\"\",\"\",IF(COUNTIF($Q6:Q6, Q6)>1, \"\", Q6))","v":""},null,null,{"$f":"IF(E6=\"\",\"\",E6+F6)","v":""},{"$f":"IF(G6<>\"\",MONTH(G6),\"\")","v":""},{"$f":"IF(D6=\"\",\"\",1)","v":""},null,{"$f":"IF(J6=\"\",\"\",INDEX(REFERENTES!$Y:$Z,MATCH(J6,REFERENTES!$Z:$Z,0),1))","v":""},{"$f":"IF(G6=\"\",\"\",CONCATENATE(G6,T6,K6,AB6))","v":""},null,null,2,{"$f":"IF(Q6=\"\",\"\",CONCATENATE(Q6,ROW()-2))","v":""},{"$f":"IF(E6<>\"\",CONCATENATE($A$2,DIGITADOR!$B$2,DIGITADOR!$M$1,ROW()-4),\"\")","v":""},null,null,{"$f":"IF(S6=\"\",\"\",INDEX('OTRAS REFERENCIAS'!$L$5:$M$150,MATCH(S6,'OTRAS REFERENCIAS'!$L$5:$L$150,0),2))","v":""},null,null,null,{"$f":"IF(W6=\"\",\"\",VLOOKUP(W6,'OTRAS REFERENCIAS'!$A$7:$B$9,2,FALSE))","v":""},null,{"$f":"CONCATENATE(X6,Y6)","v":""},null,null,{"$f":"IF(AD6=\"\",\"\",INDEX(REFERENTES!$J:$K,MATCH(AD6,REFERENTES!$K:$K,0),2))","v":""},null,{"$f":"IF(AD6=\"\",\"\",INDEX(REFERENTES!$J:$L,MATCH(AD6,REFERENTES!$K:$K,0),1))","v":""},null,{"$f":"IF(AF6=\"\",\"\",INDEX(REFERENTES!$D:$E,MATCH(AF6,REFERENTES!$E:$E,0),1))","v":""}]
[null,null,1,{"$f":"IF(Q7=\"\",\"\",IF(COUNTIF($Q7:Q7, Q7)>1, \"\", Q7))","v":""},null,null,"","",{"$f":"IF(D7=\"\",\"\",1)","v":""},null,{"$f":"IF(J7=\"\",\"\",INDEX(REFERENTES!$Y:$Z,MATCH(J7,REFERENTES!$Z:$Z,0),1))","v":""},{"$f":"IF(G7=\"\",\"\",CONCATENATE(G7,T7,K7,AB7))","v":""},null,null,3,"",{"$f":"IF(E7<>\"\",CONCATENATE($A$2,DIGITADOR!$B$2,DIGITADOR!$M$1,ROW()-4),\"\")","v":""},null,null,{"$f":"IF(S7=\"\",\"\",INDEX('OTRAS REFERENCIAS'!$L$5:$M$150,MATCH(S7,'OTRAS REFERENCIAS'!$L$5:$L$150,0),2))","v":""},null,null,null,{"$f":"IF(W7=\"\",\"\",VLOOKUP(W7,'OTRAS REFERENCIAS'!$A$7:$B$9,2,FALSE))","v":""},null,"",null,null,{"$f":"IF(AD7=\"\",\"\",INDEX(REFERENTES!$J:$K,MATCH(AD7,REFERENTES!$K:$K,0),2))","v":""},null,{"$f":"IF(AD7=\"\",\"\",INDEX(REFERENTES!$J:$L,MATCH(AD7,REFERENTES!$K:$K,0),1))","v":""},null,{"$f":"IF(AF7=\"\",\"\",INDEX(REFERENTES!$D:$E,MATCH(AF7,REFERENTES!$E:$E,0),1))","v":""}]
[null,null,1,{"$f":"IF(Q8=\"\",\"\",IF(COUNTIF($Q8:Q8, Q8)>1, \"\", Q8))","v":""},null,null,"","",{"$f":"IF(D8=\"\",\"\",1)","v":""},null,{"$f":"IF(J8=\"\",\"\",INDEX(REFERENTES!$Y:$Z,MATCH(J8,REFERENTES!$Z:$Z,0),1))","v":""},{"$f":"IF(G8=\"\",\"\",CONCATENATE(G8,T8,K8,AB8))","v":""},null,null,4,"",{"$f":"IF(E8<>\"\",CONCATENATE($A$2,DIGITADOR!$B$2,DIGITADOR!$M$1,ROW()-4),\"\")","v":""},null,null,{"$f":"IF(S8=\"\",\"\",INDEX('OTRAS REFERENCIAS'!$L$5:$M$150,MATCH(S8,'OTRAS REFERENCIAS'!$L$5:$L$150,0),2))","v":""},null,null,null,{"$f":"IF(W8=\"\",\"\",VLOOKUP(W8,'OTRAS REFERENCIAS'!$A$7:$B$9,2,FALSE))","v":""},null,"",null,null,{"$f":"IF(AD8=\"\",\"\",INDEX(REFERENTES!$J:$K,MATCH(AD8,REFERENTES!$K:$K,0),2))","v":""},null,{"$f":"IF(AD8=\"\",\"\",INDEX(REFERENTES!$J:$L,MATCH(AD8,REFERENTES!$K:$K,0),1))","v":""},null,{"$f":"IF(AF8=\"\",\"\",INDEX(REFERENTES!$D:$E,MATCH(AF8,REFERENTES!$E:$E,0),1))","v":""}]
[null,null,1,{"$f":"IF(Q9=\"\",\"\",IF(COUNTIF($Q9:Q9, Q9)>1, \"\", Q9))","v":""},null,null,"","",{"$f":"IF(D9=\"\",\"\",1)","v":""},null,{"$f":"IF(J9=\"\",\"\",INDEX(REFERENTES!$Y:$Z,MATCH(J9,REFERENTES!$Z:$Z,0),1))","v":""},"",null,null,5,"",{"$f":"IF(E9<>\"\",CONCATENATE($A$2,DIGITADOR!$B$2,DIGITADOR!$M$1,ROW()-4),\"\")","v":""},null,null,{"$f":"IF(S9=\"\",\"\",INDEX('OTRAS REFERENCIAS'!$L$5:$M$150,MATCH(S9,'OTRAS REFERENCIAS'!$L$5:$L$150,0),2))","v":""},null,null,null,{"$f":"IF(W9=\"\",\"\",VLOOKUP(W9,'OTRAS REFERENCIAS'!$A$7:$B$9,2,FALSE))","v":""},null,"",null,null,{"$f":"IF(AD9=\"\",\"\",INDEX(REFERENTES!$J:$K,MATCH(AD9,REFERENTES!$K:$K,0),2))","v":""},null,{"$f":"IF(AD9=\"\",\"\",INDEX(REFERENTES!$J:$L,MATCH(AD9,REFERENTES!$K:$K,0),1))","v":""},null,{"$f":"IF(AF9=\"\",\"\",INDEX(REFERENTES!$D:$E,MATCH(AF9,REFERENTES!$E:$E,0),1))","v":""}]
[null,null,1,{"$f":"IF(Q10=\"\",\"\",IF(COUNTIF($Q10:Q10, Q10)>1, \"\", Q10))","v":""},null,null,"","","",null,{"$f":"IF(J10=\"\",\"\",INDEX(REFERENTES!$Y:$Z,MATCH(J10,REFERENTES!$Z:$Z,0),1))","v":""},"",null,null,6,"",{"$f":"IF(E10<>\"\",CONCATENATE($A$2,DIGITADOR!$B$2,DIGITADOR!$M$1,ROW()-4),\"\")","v":""},null,null,{"$f":"IF(S10=\"\",\"\",INDEX('OTRAS REFERENCIAS'!$L$5:$M$150,MATCH(S10,'OTRAS REFERENCIAS'!$L$5:$L$150,0),2))","v":""},null,null,null,{"$f":"IF(W10=\"\",\"\",VLOOKUP(W10,'OTRAS REFERENCIAS'!$A$7:$B$9,2,FALSE))","v":""},null,"",null,null,{"$f":"IF(AD10=\"\",\"\",INDEX(REFERENTES!$J:$K,MATCH(AD10,REFERENTES!$K:$K,0),2))","v":""},null,{"$f":"IF(AD10=\"\",\"\",INDEX(REFERENTES!$J:$L,MATCH(AD10,REFERENTES!$K:$K,0),1))","v":""},null,{"$f":"IF(AF10=\"\",\"\",INDEX(REFERENTES!$D:$E,MATCH(AF10,REFERENTES!$E:$E,0),1))","v":""}]
{"$rows_left_out":95}
{"sheet":"REFERENTES","index":4,"n_rows":363,"n_cols":26,"rows_kept":363,"cut":false,"hidden":false,"merged":[]}
["AG_ESPECIES",148025,null,"AG_LOV",1036,null,"AG_LOV",1030,null,"descripcion","cod_letras",null,null,null,null,null,null,null,"secuencia_loc","prefijo_cdg_est_loc","codigo_estacion_loc","descripcion_estacion_loc","lugar"]
["Pterogorgia anceps","Panc",null,"Sana","SAN",null,"CORALINA","CORALINA",null,"Agaricia agaricites","Aaga","8.55.2460","CNIDARIA",null,null,null,null,null,14311,"ACU",1,null,"Acuario 1",null,3907,"Ameth  Vargas Campo"]
["Parazoanthus sp.","Para",null,"Pálida","PAL",null,"F. Malpelo","Fundacion Malpelo",null,"Antipathes atlantica","Aatl","8.55.1300","CNIDARIA",null,null,null,null,null,14312,"ACU",2,null,"Acuario 2",null,593,"Andrea Polanco"]
["Porites astreoides","Past",null,"Blanqueamiento","BLA",null,"INVEMAR","Instituto de Investigaciones Marinas y Costeras",null,"Antipathes barbadensis","Abar","8.55.6730","CNIDARIA",null,null,null,null,null,14338,"AGU",1,"se encuentra localizada bien al fondo de la ensenada","Aguacate S",null,4408,"Andres Felipe Acosta Chaparro"]
["Pavona sp.","Pavo",null,"Plaga Blanca","WPD",null,"UNIVALLE","Universidad del Valle",null,"Actinia bermudensis","Aber","8.55.1680","CNIDARIA",null,null,null,null,null,14341,"AZU",1,"A unos 60 metros de la costa en marea baja. localizada a 2º 57' 30.6\" N - 78º 10' 41.0\" O","Azufrada 1",null,3956,"Carlos Aponte"]
["Padina boergesenii","Pboe",null,"Lunares Oscuros","ELO",null,"PNN_GORGONA","PNN_GORGONA",null,"Amphiroa brasiliana","Abra","4026.55.320",null,null,null,null,null,null,14342,"AZU",2,"A unos 70m de la costa en marea baja","Azufrada 2",null,1834,"Diana Isabel Gómez López"]
["Porites branneri","Pbra",null,"Depredación","DEP",null,"UJTL","Universidad Jorge Tadeo Lozano",null,"Acropora cervicornis","Acer","8.55.2380","CNIDARIA",null,null,null,null,null,43726,"POR",1,"Bahía Portete","Bahía Portete",null,1775,"Diego Duque"]
["Porites californica","Pcal",null,"Banda Negra","BBD",null,"UNal","Universidad Nacional",null,"Agelas clathrodes","Acla","4.55.196",null,null,null,null,null,null,55425,"BGO",1,null,"Bonito Gordo (PNN Tayrona)",null,3646,"Elizabeth Galeano Galeano"]
["Pocillopora capitata","Pcap",null,"Banda Amarilla","YBD",null,"ParquesNacionales","Parques Nacionales",null,"Agelas conifera","Acon","4.55.197",null,null,null,null,null,null,14333,"CTI",2,"incluye una parcela en el nivel medio de prof","Cabo Tiburón M",null,1784,"Johanna Carolina Vega Sequeda"]
["Palythoa caribaeorum","Pcar",null,"Banda Roja","RBD",null,null,null,null,"Acropora sp.","Acro","8.46.820","CNIDARIA",null,null,null,null,null,14334,"CTI",1,"la estación es una parcela somera (3 m) forma","Cabo Tiburón S",null,6356,"Jose Francisco Campo Campo"]
{"$rows_left_out":354}
{"sheet":"OTRAS REFERENCIAS","index":5,"n_rows":150,"n_cols":13,"rows_kept":150,"cut":false,"hidden":false,"merged":[[0,0,2,10],[4,0,4,1],[26,0,26,2]]}
["Estas son listas para variables con valores que no se encuentran codificados, pero que deben manejarse de manera estandarizada. \nSi se requiere agregar un valor nuevo hagalo debajo de la lista correspondiente"]
[]
[]
[]
["PROFUNDIDAD",null,null,"METODOS",null,null,null,null,null,null,null,{"$f":"IF(AND(REFERENTES!U2<>\"\",          REFERENTES!U2<>96321,    REFERENTES!U2<>96222            ),CONCATENATE(REFERENTES!T2,\"-\",REFERENTES!U2),\"\")","v":"ACU-1"},{"$f":"REFERENTES!S2","v":14311}]
["Descripcion","Codigo",null,"NOMBRE_MT","CODIGO",null,null,null,null,null,null,{"$f":"IF(AND(REFERENTES!U3<>\"\",          REFERENTES!U3<>96321,    REFERENTES!U3<>96222            ),CONCATENATE(REFERENTES!T3,\"-\",REFERENTES!U3),\"\")","v":"ACU-2"},{"$f":"REFERENTES!S3","v":14312}]
["Somero","S",null,"Manual de métodos de SIMAC: Cadena rotulada cada diez eslabones","Car",null,null,null,null,null,null,{"$f":"IF(AND(REFERENTES!U4<>\"\",          REFERENTES!U4<>96321,    REFERENTES!U4<>96222            ),CONCATENATE(REFERENTES!T4,\"-\",REFERENTES!U4),\"\")","v":"AGU-1"},{"$f":"REFERENTES!S4","v":14338}]
["Medio","M",null,null,null,null,null,null,null,null,null,{"$f":"IF(AND(REFERENTES!U5<>\"\",          REFERENTES!U5<>96321,    REFERENTES!U5<>96222            ),CONCATENATE(REFERENTES!T5,\"-\",REFERENTES!U5),\"\")","v":"AZU-1"},{"$f":"REFERENTES!S5","v":14341}]
["Profundo","P",null,null,null,null,null,null,null,null,null,{"$f":"IF(AND(REFERENTES!U6<>\"\",          REFERENTES!U6<>96321,    REFERENTES!U6<>96222            ),CONCATENATE(REFERENTES!T6,\"-\",REFERENTES!U6),\"\")","v":"AZU-2"},{"$f":"REFERENTES!S6","v":14342}]
[null,null,null,null,null,null,null,null,null,null,null,{"$f":"IF(AND(REFERENTES!U7<>\"\",          REFERENTES!U7<>96321,    REFERENTES!U7<>96222            ),CONCATENATE(REFERENTES!T7,\"-\",REFERENTES!U7),\"\")","v":"POR-1"},{"$f":"REFERENTES!S7","v":43726}]
{"$rows_left_out":141}
{"sheet":"Resumen","index":6,"n_rows":101,"n_cols":8,"rows_kept":101,"cut":false,"hidden":false,"merged":[[0,7,2,11]]}
["estacion","colonias","registros","Etiquetas de fila","Cuenta de registros","Suma de colonias",null,"Esta tabla debe ser actualizada cada vez que introduzca nuevos datos, para ello debe hacer clic sobre cualquier parte de la tabla y presionar las teclas ALT + F5 de manera conjunta."]
[{"$f":"IF(DATOS!S5=\"\",\"\",DATOS!S5)","v":""},{"$f":"IF(DATOS!AH5=\"\",\"\",DATOS!AH5)","v":""},{"$f":"IF(DATOS!Y5=\"\",\"\",DATOS!Y5)","v":""},null,100,0]
[{"$f":"IF(DATOS!S6=\"\",\"\",DATOS!S6)","v":""},{"$f":"IF(DATOS!AH6=\"\",\"\",DATOS!AH6)","v":""},{"$f":"IF(DATOS!Y6=\"\",\"\",DATOS!Y6)","v":""},"Total general",100,0]
[{"$f":"IF(DATOS!S7=\"\",\"\",DATOS!S7)","v":""},{"$f":"IF(DATOS!AH7=\"\",\"\",DATOS!AH7)","v":""},{"$f":"IF(DATOS!Y7=\"\",\"\",DATOS!Y7)","v":""}]
[{"$f":"IF(DATOS!S8=\"\",\"\",DATOS!S8)","v":""},{"$f":"IF(DATOS!AH8=\"\",\"\",DATOS!AH8)","v":""},{"$f":"IF(DATOS!Y8=\"\",\"\",DATOS!Y8)","v":""}]
[{"$f":"IF(DATOS!S9=\"\",\"\",DATOS!S9)","v":""},{"$f":"IF(DATOS!AH9=\"\",\"\",DATOS!AH9)","v":""},{"$f":"IF(DATOS!Y9=\"\",\"\",DATOS!Y9)","v":""}]
[{"$f":"IF(DATOS!S10=\"\",\"\",DATOS!S10)","v":""},{"$f":"IF(DATOS!AH10=\"\",\"\",DATOS!AH10)","v":""},{"$f":"IF(DATOS!Y10=\"\",\"\",DATOS!Y10)","v":""}]
[{"$f":"IF(DATOS!S11=\"\",\"\",DATOS!S11)","v":""},{"$f":"IF(DATOS!AH11=\"\",\"\",DATOS!AH11)","v":""},{"$f":"IF(DATOS!Y11=\"\",\"\",DATOS!Y11)","v":""}]
[{"$f":"IF(DATOS!S12=\"\",\"\",DATOS!S12)","v":""},{"$f":"IF(DATOS!AH12=\"\",\"\",DATOS!AH12)","v":""},{"$f":"IF(DATOS!Y12=\"\",\"\",DATOS!Y12)","v":""}]
[{"$f":"IF(DATOS!S13=\"\",\"\",DATOS!S13)","v":""},{"$f":"IF(DATOS!AH13=\"\",\"\",DATOS!AH13)","v":""},{"$f":"IF(DATOS!Y13=\"\",\"\",DATOS!Y13)","v":""}]
{"$rows_left_out":92}
{"sheet":"AGD_MUESTREOS","index":7,"n_rows":0,"n_cols":0,"rows_kept":0,"cut":false,"hidden":true,"merged":[]}

{"sheet":"AGD_PARAMETRO","index":8,"n_rows":0,"n_cols":0,"rows_kept":0,"cut":false,"hidden":true,"merged":[]}

{"sheet":"AGD_MUESTRAS","index":9,"n_rows":0,"n_cols":0,"rows_kept":0,"cut":false,"hidden":true,"merged":[]}

{"sheet":"AGD_MUESTRAS_VARIABLES","index":10,"n_rows":0,"n_cols":0,"rows_kept":0,"cut":false,"hidden":true,"merged":[]}

{"sheet":"AGD_AUTORIAS","index":11,"n_rows":0,"n_cols":0,"rows_kept":0,"cut":false,"hidden":true,"merged":[]}