{"text_format":"1","workbook":"xlsx","n_sheets":12,"sheets":["Registro de cambios","configuracion","DIGITADOR","DATOS","REFERENTES","OTRAS REFERENCIAS","Resumen","AGD_MUESTREOS","AGD_PARAMETRO","AGD_MUESTRAS","AGD_MUESTRAS_VARIABLES","AGD_AUTORIAS"],"not_rendered":{"charts":0,"images":0,"macros":1,"external_links":1,"defined_names":30,"comments":1,"pivot_tables":1},"unopened":[],"bounds":{"document_bytes":16777216,"sheet_cells":100000,"rows_first":2000,"rows_last":500,"rows_between":2000,"halvings":0,"cell_chars":16384,"cell_head_chars":4096},"cells_cut":0,"cells_raw":0,"read":"whole","date_system":"1900"}

{"sheet":"Registro de cambios","index":0,"n_rows":7,"n_cols":7,"rows_kept":7,"cut":false,"hidden":true,"merged":[[1,3,1,6]]}
[]
[null,null,null,"REGISTRO DE CAMBIOS"]
[null,null,null,"VERSIÓN No.","CAMBIO REALIZADO","AUTOR","VIGENTE DESDE"]
[null,null,null,"20241113i","Actualización del código de la macro.\n\nSe eliminó la URL de la antigua API de portete:\n       http://portete.invemar.org.co:7003/ArgosWebServices-RESTWebService-context-root/rest/1.0\n\nFue reemplazada por la URL de la API de ARGOS:\n       https://argos.invemar.org.co/api/\n\nLa API contiene End Points que permiten tener mayor control, facilitan la descarga de referentes (listas de usuarios, estaciones, especies, etc.) que corresponden a criterios específicos como el proyecto usado en la plantilla para evitar descargar data innecesaria.\n\nDel mismo modo, también permite la carga de información a la BDD del INVEMAR.\n\nLa macro toma los Endpoints desde la hoja configuracion de una tabla llamada \"Configuración referentes\", a la que se le puede modificar las rutas de la API o agregar nuevas. cabe resaltar que se puede \"quemar\" directamente en la macro los Endpoints que lo requieran.","Juan Palomino","2024-11-13"]
[null,null,null,"20210810m","Se elimina entidad de la hoja de datos, se eliman clave_sibm, categoria de vida por tomarse de los refrentes en la base de datos.     \nGREMIO columna AC retirado  \nSe organizan las estaciones para que se filtre lo descargado de la BD y se tomen solo los datos de estaciones en otras referencias      \nColumnas qrst borradas (MAR y SUSTRATO)",null,"2021-07-30"]
[null,null,null,"20200130i","Para trazabilididad la hoja se incluye el nombre del archivo fuente y la posibilidad de anotar el DOI principal del metadato\nPor usabilidad las pestañas que son de interes para el usuario son las verdes\nSi se define mas de un proyecto los referentes de estaciones e investigadores se descargan consecutivo en las mismas columnas\nSe controla la versión para la plantilla mediante comparación dato en AGLOV de la BD.",null,"2020-01-30"]
[null,null,null,"20180413i","Se modifica la generación de los ID de muestreo y se agrega macro que genera número aleatorio en la hoja DIGITADOR.",null,"2018-04-13"]

{"sheet":"configuracion","index":1,"n_rows":71,"n_cols":8,"rows_kept":71,"cut":false,"hidden":true,"merged":[[61,0,61,2],[28,0,35,0],[37,0,42,0],[45,0,45,1],[0,0,2,0],[3,0,5,0],[7,0,8,0],[9,0,15,0],[17,0,21,0],[23,0,26,0]]}
["general","urlServicio","https://argos.invemar.org.co/api/"]
[null,"fila de inicio",5]
[null,"fila de fin",150]
["metodologias","Metodologias",22]
[null,"Referentes",150]
[null,"Cantidad maxima de referentes ",150]
["estaciones/investigadores","proyectos",{"$f":"DIGITADOR!B9","v":1480}]
["Lista especies","metodologias",22]
[null,"proyectos",{"$f":"DIGITADOR!B9","v":1480}]
["MUESTREOS","ID_MUESTREO","DATOS,D"]
{"$rows_left_out":62}
{"sheet":"DIGITADOR","index":2,"n_rows":27,"n_cols":4,"rows_kept":27,"cut":false,"hidden":false,"merged":[[11,3,13,9],[5,0,6,0],[0,0,0,1],[0,3,5,9],[6,3,8,9],[9,3,10,9]]}
["Recolección de Datos Riqueza Areas Coralinas",null,null,"Recomendaciones generales: \n¡Precaución! No inserte Filas o Columnas.\nEn los casos en que falte un valor a ingresar que provenga de la hoja de referencias, informe para que el administrador del sistema haga las adiciones necesarias.\nEsta es una plantilla programada. Las columnas de color oscuro se llenan automaticamente, principalmente a partir de los contenidos de la hoja de referencias. \nNO UTILICE PUNTO Y COMA (;) en ningun campo, por ser el separador de variables (columnas). Tampoco escriba las unidades de medida, no son necesarias.\nPara el correcto funcionamiento de la hoja debe estar activa la opcion de Excel de ejecutar macros (al abrir la hoja acepte la opcion habilitar macros, mensaje de Excel que aparece en la parte superior de la hoja en un recuadro amarillo). La extensión del archivo debe ser .xlsm\nSe recomienda renombrar el archivo de la siguiente manera: SIMAC_Riqueza_NombreEstacion_FechaMonitoreo.xlsm"]
["Código Digitador",{"$f":"IF(B3=\"\",\"\",INDEX(REFERENTES!$Y:$Z,MATCH(DIGITADOR!B3,REFERENTES!$Z:$Z,0),1))","v":""}]
["Nombre del responsable"]
["ENTIDAD"]
["Versión de la plantilla",{"$f":"'Registro de cambios'!D4","v":"20241113i"}]
["Fecha en la que ingresa los datos en esta hoja","DD/MM/AAAA"]
[null,"3000-12-12",null,"Previamente a iniciar el llenado de la plantilla, debe presionar el botón \"Descargar referentes\" para que los referentes de ésta plantilla sean actualizados. \nLuego de llenar completamente la plantilla, haga clic sobre el botón \"Generar tablas\" para que los datos sean organizados antes de cargarlos al Sistema de Información.\nAntes de presionar el botón \"Generar tablas\" verifique que:\na. No haya celdas con valores como \"#N/A\" o \"#¡REF!\"\nb. No se esten aplicando filtros en la hoja de datos \nPara finalizar, presione el botón \"Cargar datos\"."]
[]
["Cod_Proyecto",1480]
["Nombre del Proyecto","Sistema de Monitoreo de los Arrecifes Coralinos en Colombia",null,"Si requiere ayuda contacte a:\nKevin S. Moreno (kevin.moreno@invemar.org.co)  - Apoyo técnico software"]
{"$rows_left_out":18}
{"sheet":"DATOS","index":3,"n_rows":104,"n_cols":35,"rows_kept":104,"cut":false,"hidden":false,"merged":[[1,1,3,1],[0,3,1,8],[1,11,1,13],[1,34,3,34],[1,2,3,2],[1,9,1,10],[1,32,3,32],[1,33,3,33],[3,18,3,19],[1,24,1,28],[1,29,1,31],[1,14,1,23],[3,16,3,17]]}
[{"$f":"DIGITADOR!B7+F5","v":"3000-12-12"},null,null,"MUESTREO"]
[{"$f":"TEXT(A1,\"yyyymmdd\")","v":"30001212"},null,"CODIGO",null,null,null,null,null,null,"INVESTIGADOR",null,"ENTIDAD + OBSERVACIONES",null,null,"LUGAR",null,null,null,null,null,null,null,null,null,"ESPECIE",null,null,null,null,"RIQUEZA",null,null,"ID MUESTRA","CONSECUTIVO","ID_MUESTREO"]
[null,null,null,null,null,null,"DATE","MES","TEMPO",null,null,"UNIKE_KEY"]
[{"$f":"DIGITADOR!$B$2","v":""},null,null,"COD\nMUESTREO","FECHA","HORA","DATE","MES","AGD MUESTREO","DATOS TOMADOS POR","COD","CONTROL CAMBIO\n SEC. ESTAC-INV-FECHA","ENTIDAD","OBSERVACIONES","ESTACION","ID ESTACION","MAR",null,"SUSTRATO",null,"PROFUNDIDAD","COD\nPROFUNDIDAD","CENSO","UBICACIÓN\nESPECIFICA","ESPECIE","DESCRIPCION","COD SIBM","FAMILIA",null,"DESCRIPCION","VALOR\n(RANGO)","VALOR\n(NUMERICO)"]
[null,null,{"$f":"IF(L5=L4,C4,C4+1)","v":1},{"$f":"IF(AI5=\"\",\"\",IF(COUNTIF($AI5:AI5, AI5)>1, \"\", AI5))","v":""},null,null,{"$f":"IF(E5=\"\",\"\",E5+F5)","v":""},{"$f":"IF(G5<>\"\",MONTH(G5),\"\")","v":""},{"$f":"IF(AI5=\"\",\"\",IF(COUNTIF($AI5:AI5, AI5)>1, \"\", AI5))","v":""},null,{"$f":"IF(J5=\"\",\"\",INDEX(REFERENTES!$Y:$Z,MATCH(J5,REFERENTES!$Z:$Z,0),1))","v":""},{"$f":"IF(G5=\"\",\"\",CONCATENATE(G5,P5,K5))","v":""},null,null,null,{"$f":"IF(O5=\"\",\"\",INDEX('OTRAS REFERENCIAS'!$L$5:$M$149,MATCH(O5,'OTRAS REFERENCIAS'!$L$5:$L$159,0),2))","v":""},"MAR",null,null,null,null,{"$f":"IF(U5=\"\",\"\",VLOOKUP(U5,'OTRAS REFERENCIAS'!$A$7:$B$9,2,FALSE))","v":""},null,{"$f":"CONCATENATE(V5,W5)","v":""},null,{"$f":"IF(Y5=\"\",\"\",INDEX(REFERENTES!J:K,MATCH(Y5,REFERENTES!K:K,0),1))","v":""},{"$f":"IF(Y5=\"\",\"\",INDEX(REFERENTES!$D:$L,MATCH(Y5,REFERENTES!$K:$K,0),9))","v":""},{"$f":"IF(Y5=\"\",\"\",INDEX(REFERENTES!$J:$P,MATCH(Y5,REFERENTES!$K:$K,0),7))","v":""},null,null,{"$f":"IF(AD5=\"\",\"\",INDEX(REFERENTES!$D:$E,MATCH(AD5,REFERENTES!$D:$D,0),2))","v":""},{"$f":"IF(AD5=\"\",\"\",IF(AD5=\"A\",1,IF(AD5=\"B\",2,IF(AD5=\"C\",3,4))))","v":""},{"$f":"IF(AI5=\"\",\"\",CONCATENATE(AI5,ROW()-2))","v":""},1,{"$f":"IF(E5<>\"\",CONCATENATE($A$2,DIGITADOR!$B$2,DIGITADOR!$M$1,ROW()-3),\"\")","v":""}]
[null,null,1,{"$f":"IF(AI6=\"\",\"\",IF(COUNTIF($AI6:AI6, AI6)>1, \"\", AI6))","v":""},null,null,{"$f":"IF(E6=\"\",\"\",E6+F6)","v":""},"",{"$f":"IF(AI6=\"\",\"\",IF(COUNTIF($AI6:AI6, AI6)>1, \"\", AI6))","v":""},null,{"$f":"IF(J6=\"\",\"\",INDEX(REFERENTES!$Y:$Z,MATCH(J6,REFERENTES!$Z:$Z,0),1))","v":""},{"$f":"IF(G6=\"\",\"\",CONCATENATE(G6,P6,K6))","v":""},null,null,null,{"$f":"IF(O6=\"\",\"\",INDEX('OTRAS REFERENCIAS'!$L$5:$M$149,MATCH(O6,'OTRAS REFERENCIAS'!$L$5:$L$159,0),2))","v":""},"MAR",null,null,null,null,{"$f":"IF(U6=\"\",\"\",VLOOKUP(U6,'OTRAS REFERENCIAS'!$A$7:$B$9,2,FALSE))","v":""},null,{"$f":"CONCATENATE(V6,W6)","v":""},null,{"$f":"IF(Y6=\"\",\"\",INDEX(REFERENTES!J:K,MATCH(Y6,REFERENTES!K:K,0),1))","v":""},{"$f":"IF(Y6=\"\",\"\",INDEX(REFERENTES!$D:$L,MATCH(Y6,REFERENTES!$K:$K,0),9))","v":""},{"$f":"IF(Y6=\"\",\"\",INDEX(REFERENTES!$J:$P,MATCH(Y6,REFERENTES!$K:$K,0),7))","v":""},null,null,{"$f":"IF(AD6=\"\",\"\",INDEX(REFERENTES!$D:$E,MATCH(AD6,REFERENTES!$D:$D,0),2))","v":""},{"$f":"IF(AD6=\"\",\"\",IF(AD6=\"A\",1,IF(AD6=\"B\",2,IF(AD6=\"C\",3,4))))","v":""},{"$f":"IF(AI6=\"\",\"\",CONCATENATE(AI6,ROW()-2))","v":""},2,{"$f":"IF(E6<>\"\",CONCATENATE($A$2,DIGITADOR!$B$2,DIGITADOR!$M$1,ROW()-3),\"\")","v":""}]
[null,null,1,{"$f":"IF(AI7=\"\",\"\",IF(COUNTIF($AI7:AI7, AI7)>1, \"\", AI7))","v":""},null,null,"","",{"$f":"IF(AI7=\"\",\"\",IF(COUNTIF($AI7:AI7, AI7)>1, \"\", AI7))","v":""},null,{"$f":"IF(J7=\"\",\"\",INDEX(REFERENTES!$Y:$Z,MATCH(J7,REFERENTES!$Z:$Z,0),1))","v":""},"",null,null,null,{"$f":"IF(O7=\"\",\"\",INDEX('OTRAS REFERENCIAS'!$L$5:$M$149,MATCH(O7,'OTRAS REFERENCIAS'!$L$5:$L$159,0),2))","v":""},"MAR",null,null,null,null,{"$f":"IF(U7=\"\",\"\",VLOOKUP(U7,'OTRAS REFERENCIAS'!$A$7:$B$9,2,FALSE))","v":""},null,"",null,{"$f":"IF(Y7=\"\",\"\",INDEX(REFERENTES!J:K,MATCH(Y7,REFERENTES!K:K,0),1))","v":""},{"$f":"IF(Y7=\"\",\"\",INDEX(REFERENTES!$D:$L,MATCH(Y7,REFERENTES!$K:$K,0),9))","v":""},{"$f":"IF(Y7=\"\",\"\",INDEX(REFERENTES!$J:$P,MATCH(Y7,REFERENTES!$K:$K,0),7))","v":""},null,null,{"$f":"IF(AD7=\"\",\"\",INDEX(REFERENTES!$D:$E,MATCH(AD7,REFERENTES!$D:$D,0),2))","v":""},"","",3,{"$f":"IF(E7<>\"\",CONCATENATE($A$2,DIGITADOR!$B$2,DIGITADOR!$M$1,ROW()-3),\"\")","v":""}]
[null,null,1,{"$f":"IF(AI8=\"\",\"\",IF(COUNTIF($AI8:AI8, AI8)>1, \"\", AI8))","v":""},null,null,"","",{"$f":"IF(AI8=\"\",\"\",IF(COUNTIF($AI8:AI8, AI8)>1, \"\", AI8))","v":""},null,{"$f":"IF(J8=\"\",\"\",INDEX(REFERENTES!$Y:$Z,MATCH(J8,REFERENTES!$Z:$Z,0),1))","v":""},"",null,null,null,{"$f":"IF(O8=\"\",\"\",INDEX('OTRAS REFERENCIAS'!$L$5:$M$149,MATCH(O8,'OTRAS REFERENCIAS'!$L$5:$L$159,0),2))","v":""},"MAR",null,null,null,null,{"$f":"IF(U8=\"\",\"\",VLOOKUP(U8,'OTRAS REFERENCIAS'!$A$7:$B$9,2,FALSE))","v":""},null,"",null,{"$f":"IF(Y8=\"\",\"\",INDEX(REFERENTES!J:K,MATCH(Y8,REFERENTES!K:K,0),1))","v":""},{"$f":"IF(Y8=\"\",\"\",INDEX(REFERENTES!$D:$L,MATCH(Y8,REFERENTES!$K:$K,0),9))","v":""},{"$f":"IF(Y8=\"\",\"\",INDEX(REFERENTES!$J:$P,MATCH(Y8,REFERENTES!$K:$K,0),7))","v":""},null,null,{"$f":"IF(AD8=\"\",\"\",INDEX(REFERENTES!$D:$E,MATCH(AD8,REFERENTES!$D:$D,0),2))","v":""},"","",4,{"$f":"IF(E8<>\"\",CONCATENATE($A$2,DIGITADOR!$B$2,DIGITADOR!$M$1,ROW()-3),\"\")","v":""}]
[null,null,1,{"$f":"IF(AI9=\"\",\"\",IF(COUNTIF($AI9:AI9, AI9)>1, \"\", AI9))","v":""},null,null,"","",{"$f":"IF(AI9=\"\",\"\",IF(COUNTIF($AI9:AI9, AI9)>1, \"\", AI9))","v":""},null,{"$f":"IF(J9=\"\",\"\",INDEX(REFERENTES!$Y:$Z,MATCH(J9,REFERENTES!$Z:$Z,0),1))","v":""},"",null,null,"",{"$f":"IF(O9=\"\",\"\",INDEX('OTRAS REFERENCIAS'!$L$5:$M$149,MATCH(O9,'OTRAS REFERENCIAS'!$L$5:$L$159,0),2))","v":""},null,null,null,null,null,{"$f":"IF(U9=\"\",\"\",VLOOKUP(U9,'OTRAS REFERENCIAS'!$A$7:$B$9,2,FALSE))","v":""},null,"",null,{"$f":"IF(Y9=\"\",\"\",INDEX(REFERENTES!J:K,MATCH(Y9,REFERENTES!K:K,0),1))","v":""},{"$f":"IF(Y9=\"\",\"\",INDEX(REFERENTES!$D:$L,MATCH(Y9,REFERENTES!$K:$K,0),9))","v":""},{"$f":"IF(Y9=\"\",\"\",INDEX(REFERENTES!$J:$P,MATCH(Y9,REFERENTES!$K:$K,0),7))","v":""},null,null,{"$f":"IF(AD9=\"\",\"\",INDEX(REFERENTES!$D:$E,MATCH(AD9,REFERENTES!$D:$D,0),2))","v":""},"","",5,{"$f":"IF(E9<>\"\",CONCATENATE($A$2,DIGITADOR!$B$2,DIGITADOR!$M$1,ROW()-3),\"\")","v":""}]
[null,null,1,{"$f":"IF(AI10=\"\",\"\",IF(COUNTIF($AI10:AI10, AI10)>1, \"\", AI10))","v":""},null,null,"","",{"$f":"IF(AI10=\"\",\"\",IF(COUNTIF($AI10:AI10, AI10)>1, \"\", AI10))","v":""},null,{"$f":"IF(J10=\"\",\"\",INDEX(REFERENTES!$Y:$Z,MATCH(J10,REFERENTES!$Z:$Z,0),1))","v":""},"",null,null,"",{"$f":"IF(O10=\"\",\"\",INDEX('OTRAS REFERENCIAS'!$L$5:$M$149,MATCH(O10,'OTRAS REFERENCIAS'!$L$5:$L$159,0),2))","v":""},null,null,null,null,null,{"$f":"IF(U10=\"\",\"\",VLOOKUP(U10,'OTRAS REFERENCIAS'!$A$7:$B$9,2,FALSE))","v":""},null,"",null,{"$f":"IF(Y10=\"\",\"\",INDEX(REFERENTES!J:K,MATCH(Y10,REFERENTES!K:K,0),1))","v":""},{"$f":"IF(Y10=\"\",\"\",INDEX(REFERENTES!$D:$L,MATCH(Y10,REFERENTES!$K:$K,0),9))","v":""},{"$f":"IF(Y10=\"\",\"\",INDEX(REFERENTES!$J:$P,MATCH(Y10,REFERENTES!$K:$K,0),7))","v":""},null,null,{"$f":"IF(AD10=\"\",\"\",INDEX(REFERENTES!$D:$E,MATCH(AD10,REFERENTES!$D:$D,0),2))","v":""},"","",6,{"$f":"IF(E10<>\"\",CONCATENATE($A$2,DIGITADOR!$B$2,DIGITADOR!$M$1,ROW()-3),\"\")","v":""}]
{"$rows_left_out":95}
{"sheet":"REFERENTES","index":4,"n_rows":437,"n_cols":53,"rows_kept":437,"cut":false,"hidden":false,"merged":[]}
["AG_ESPECIES",148022,null,"AG_LOV",1027,null,"AG_LOV",1030,null,"descripcion","cod_letras","clave_sibm","phylum","clase","orden","familia","genero"]
["Exan","Elacatinus xanthiprora",null,"A",1,null,"CORALINA","CORALINA",null,"Apogon affinis","Aaff","70.55.346",null,null,null,"APOGONIDAE",null,null,14311,"ACU",1,null,"Acuario 1",null,3907,"Ameth  Vargas Campo",null,null,null,null,null,null,null,null,null,null,null,null,null,null,null,null,null,null,null,null,null,null,null,null,null,3907,"Ameth  Vargas Campo"]
["Ftab","Fistularia tabacaria",null,"B","2 a 10",null,"F. Malpelo","Fundacion Malpelo",null,"Acanthemblemaria aspera","Aasp","70.55.577",null,null,null,"CHAENOPSIDAE",null,null,14312,"ACU",2,null,"Acuario 2",null,593,"Andrea Polanco",null,null,null,null,null,null,null,null,null,null,null,null,null,null,null,null,null,null,null,null,null,null,null,null,null,593,"Andrea Polanco"]
["Gcin","Gerres cinereus",null,"C","11 a 100",null,"INVEMAR","Instituto de Investigaciones Marinas y Costeras",null,"Apogon atradorsatus","Aatr","70.55.3219",null,null,null,"APOGONIDAE",null,null,14338,"AGU",1,"se encuentra localizada bien al fondo de la ensenada","Aguacate S",null,4408,"Andres Felipe Acosta Chaparro",null,null,null,null,null,null,null,null,null,null,null,null,null,null,null,null,null,null,null,null,null,null,null,null,null,4408,"Andres Felipe Acosta Chaparro"]
["Gerr","Gerres sp.",null,"D",">100",null,"ParquesNacionales","Parques Nacionales",null,"Acanthurus bahianus","Abah","70.55.666",null,null,null,"ACANTHURIDAE",null,null,14341,"AZU",1,"A unos 60 metros de la costa en marea baja. localizada a 2º 57' 30.6\" N - 78º 10' 41.0\" O","Azufrada 1",null,3956,"Carlos Aponte",null,null,null,null,null,null,null,null,null,null,null,null,null,null,null,null,null,null,null,null,null,null,null,null,null,3956,"Carlos Aponte"]
["Gfun","Gymnothorax funebris",null,null,null,null,"PNN_GORGONA","PNN_GORGONA",null,"Abudefduf concolor","Abco","70.55.2706",null,null,null,"POMACENTRIDAE",null,null,14342,"AZU",2,"A unos 70m de la costa en marea baja","Azufrada 2",null,1834,"Diana Isabel Gómez López",null,null,null,null,null,null,null,null,null,null,null,null,null,null,null,null,null,null,null,null,null,null,null,null,null,1834,"Diana Isabel Gómez López"]
["Glor","Gramma loreto",null,null,null,null,"UJTL","UJTL",null,"Acanthemblemaria betinensis","Abet","70.55.578",null,null,null,"CHAENOPSIDAE",null,null,43726,"POR",1,"Bahía Portete","Bahía Portete",null,1775,"Diego Duque",null,null,null,null,null,null,null,null,null,null,null,null,null,null,null,null,null,null,null,null,null,null,null,null,null,1775,"Diego Duque"]
["Gmel","Gramma melacara",null,null,null,null,"UNal","Universidad Nacional",null,"Apogon binotatus","Abin","70.55.348",null,null,null,"APOGONIDAE",null,null,55425,"BGOR",1,null,"Bonito Gordo (PNN Tayrona)",null,1784,"Johanna Carolina Vega Sequeda",null,null,null,null,null,null,null,null,null,null,null,null,null,null,null,null,null,null,null,null,null,null,null,null,null,3646,"Elizabeth Galeano Galeano"]
["Gmil","Gymnothorax miliaris",null,null,null,null,"UNIVALLE","Universidad del Valle",null,"Anisotremus caesius","Acae","70.55.3217",null,null,null,"HAEMULIDAE",null,null,14333,"CTI",2,"incluye una parcela en el nivel medio de prof","Cabo Tiburón M",null,6356,"Jose Francisco Campo Campo",null,null,null,null,null,null,null,null,null,null,null,null,null,null,null,null,null,null,null,null,null,null,null,null,null,1784,"Johanna Carolina Vega Sequeda"]
["Gmor","Gymnothorax moringa",null,null,null,null,null,null,null,"Acanthurus sp.","Acan","70.46.339",null,null,null,"ACANTHURIDAE",null,null,14334,"CTI",1,"la estación es una parcela somera (3 m) forma","Cabo Tiburón S",null,3905,"Juan David González Corredor",null,null,null,null,null,null,null,null,null,null,null,null,null,null,null,null,null,null,null,null,null,null,null,null,null,6356,"Jose Francisco Campo Campo"]
{"$rows_left_out":428}
{"sheet":"OTRAS REFERENCIAS","index":5,"n_rows":162,"n_cols":13,"rows_kept":162,"cut":false,"hidden":false,"merged":[[0,0,2,10],[4,0,4,1],[26,0,26,2]]}
["Estas son listas para variables con valores que no se encuentran codificados, pero que deben manejarse de manera estandarizada. \nSi se requiere agregar un valor nuevo hagalo debajo de la lista correspondiente"]
[]
[]
[]
["PROFUNDIDAD",null,null,"METODOS",null,null,null,null,null,null,null,{"$f":"IF(AND(REFERENTES!U2<>\"\",          REFERENTES!U2<>96321,    REFERENTES!U2<>96222            ),CONCATENATE(REFERENTES!T2,\"-\",REFERENTES!U2),\"\")","v":"ACU-1"},{"$f":"REFERENTES!S2","v":14311}]
["Descripcion","Codigo",null,"NOMBRE_MT","CODIGO",null,null,null,null,null,null,{"$f":"IF(AND(REFERENTES!U3<>\"\",          REFERENTES!U3<>96321,    REFERENTES!U3<>96222            ),CONCATENATE(REFERENTES!T3,\"-\",REFERENTES!U3),\"\")","v":"ACU-2"},{"$f":"REFERENTES!S3","v":14312}]
["Somero","S",null,"Manual de métodos de SIMAC: Cadena rotulada cada diez eslabones","Car",null,null,null,null,null,null,{"$f":"IF(AND(REFERENTES!U4<>\"\",          REFERENTES!U4<>96321,    REFERENTES!U4<>96222            ),CONCATENATE(REFERENTES!T4,\"-\",REFERENTES!U4),\"\")","v":"AGU-1"},{"$f":"REFERENTES!S4","v":14338}]
["Medio","M",null,null,null,null,null,null,null,null,null,{"$f":"IF(AND(REFERENTES!U5<>\"\",          REFERENTES!U5<>96321,    REFERENTES!U5<>96222            ),CONCATENATE(REFERENTES!T5,\"-\",REFERENTES!U5),\"\")","v":"AZU-1"},{"$f":"REFERENTES!S5","v":14341}]
["Profundo","P",null,null,null,null,null,null,null,null,null,{"$f":"IF(AND(REFERENTES!U6<>\"\",          REFERENTES!U6<>96321,    REFERENTES!U6<>96222            ),CONCATENATE(REFERENTES!T6,\"-\",REFERENTES!U6),\"\")","v":"AZU-2"},{"$f":"REFERENTES!S6","v":14342}]
[null,null,null,null,null,null,null,null,null,null,null,{"$f":"IF(AND(REFERENTES!U7<>\"\",          REFERENTES!U7<>96321,    REFERENTES!U7<>96222            ),CONCATENATE(REFERENTES!T7,\"-\",REFERENTES!U7),\"\")","v":"POR-1"},{"$f":"REFERENTES!S7","v":43726}]
{"$rows_left_out":153}
{"sheet":"Resumen","index":6,"n_rows":101,"n_cols":8,"rows_kept":101,"cut":false,"hidden":false,"merged":[[0,7,2,11]]}
["estacion","abundancia","registros","Etiquetas de fila","Cuenta de registros","Suma de abundancia",null,"Esta tabla debe ser actualizada cada vez que introduzca nuevos datos, para ello debe hacer clic sobre cualquier parte de la tabla y presionar las teclas ALT + F5 de manera conjunta."]
[{"$f":"IF(DATOS!O5=\"\",\"\",DATOS!O5)","v":""},{"$f":"IF(DATOS!AD5=\"\",\"\",DATOS!AD5)","v":""},{"$f":"IF(DATOS!W5=\"\",\"\",DATOS!W5)","v":""},null,100,0]
[{"$f":"IF(DATOS!O6=\"\",\"\",DATOS!O6)","v":""},{"$f":"IF(DATOS!AD6=\"\",\"\",DATOS!AD6)","v":""},{"$f":"IF(DATOS!W6=\"\",\"\",DATOS!W6)","v":""},"Total general",100,0]
[{"$f":"IF(DATOS!O7=\"\",\"\",DATOS!O7)","v":""},{"$f":"IF(DATOS!AD7=\"\",\"\",DATOS!AD7)","v":""},{"$f":"IF(DATOS!W7=\"\",\"\",DATOS!W7)","v":""}]
[{"$f":"IF(DATOS!O8=\"\",\"\",DATOS!O8)","v":""},{"$f":"IF(DATOS!AD8=\"\",\"\",DATOS!AD8)","v":""},{"$f":"IF(DATOS!W8=\"\",\"\",DATOS!W8)","v":""}]
[{"$f":"IF(DATOS!O9=\"\",\"\",DATOS!O9)","v":""},{"$f":"IF(DATOS!AD9=\"\",\"\",DATOS!AD9)","v":""},{"$f":"IF(DATOS!W9=\"\",\"\",DATOS!W9)","v":""}]
[{"$f":"IF(DATOS!O10=\"\",\"\",DATOS!O10)","v":""},{"$f":"IF(DATOS!AD10=\"\",\"\",DATOS!AD10)","v":""},{"$f":"IF(DATOS!W10=\"\",\"\",DATOS!W10)","v":""}]
[{"$f":"IF(DATOS!O11=\"\",\"\",DATOS!O11)","v":""},{"$f":"IF(DATOS!AD11=\"\",\"\",DATOS!AD11)","v":""},{"$f":"IF(DATOS!W11=\"\",\"\",DATOS!W11)","v":""}]
[{"$f":"IF(DATOS!O12=\"\",\"\",DATOS!O12)","v":""},{"$f":"IF(DATOS!AD12=\"\",\"\",DATOS!AD12)","v":""},{"$f":"IF(DATOS!W12=\"\",\"\",DATOS!W12)","v":""}]
[{"$f":"IF(DATOS!O13=\"\",\"\",DATOS!O13)","v":""},{"$f":"IF(DATOS!AD13=\"\",\"\",DATOS!AD13)","v":""},{"$f":"IF(DATOS!W13=\"\",\"\",DATOS!W13)","v":""}]
{"$rows_left_out":92}
{"sheet":"AGD_MUESTREOS","index":7,"n_rows":0,"n_cols":0,"rows_kept":0,"cut":false,"hidden":true,"merged":[]}

{"sheet":"AGD_PARAMETRO","index":8,"n_rows":0,"n_cols":0,"rows_kept":0,"cut":false,"hidden":true,"merged":[]}

{"sheet":"AGD_MUESTRAS","index":9,"n_rows":0,"n_cols":0,"rows_kept":0,"cut":false,"hidden":true,"merged":[]}

{"sheet":"AGD_MUESTRAS_VARIABLES","index":10,"n_rows":0,"n_cols":0,"rows_kept":0,"cut":false,"hidden":true,"merged":[]}

{"sheet":"AGD_AUTORIAS","index":11,"n_rows":0,"n_cols":0,"rows_kept":0,"cut":false,"hidden":true,"merged":[]}