{"text_format":"1","workbook":"xlsx","n_sheets":12,"sheets":["Registro de cambios","configuracion","DIGITADOR","DATOS","REFERENTES","OTRAS REFERENCIAS","Resumen","AGD_MUESTREOS","AGD_PARAMETRO","AGD_MUESTRAS","AGD_MUESTRAS_VARIABLES","AGD_AUTORIAS"],"not_rendered":{"charts":0,"images":0,"macros":1,"external_links":1,"defined_names":30,"comments":2,"pivot_tables":1},"unopened":[],"bounds":{"document_bytes":16777216,"sheet_cells":100000,"rows_first":2000,"rows_last":500,"rows_between":2000,"halvings":0,"cell_chars":16384,"cell_head_chars":4096},"cells_cut":0,"cells_raw":0,"read":"whole","date_system":"1900"}

{"sheet":"Registro de cambios","index":0,"n_rows":9,"n_cols":7,"rows_kept":9,"cut":false,"hidden":true,"merged":[[1,3,1,6]]}
[]
[null,null,null,"REGISTRO DE CAMBIOS"]
[null,null,null,"VERSIÓN No.","CAMBIO REALIZADO","AUTOR","VIGENTE DESDE"]
[null,null,null,"20240926i","En la hoja \"configuracion\", se cambia la url de la api, se agrega la tabla \"Tipo Nodo\" y \"CONFIGURACION REFERENTES\".\n\nEn la hoja \"DATOS\" se modifican las formulas de las columnas \"CODMUESTREO\", \"ID_MUESTRA\" y \"ID_MUESTREO\", además de la revisión y ajustes del mapeo de columnas.\n\nEn la hoja \"DIGITADOR\", se agrega la tabla \"ATRIBUTOS ADICIONALES\" y se agrega un el boton \"Administrador\"\npara controlar la visibilidad de los botones \"Generar tablas\" y \"Cargar datos\".\n\nEn la hoja \"OTRAS REFERENCIAS\", se agrega la tabla \"CODIGOS LOV\".","Cristian Charris","26/09/2024"]
[null,null,null,"20210810m","Se retiran por tomar valroes definidos  en la BD las columnas:codigo SIBM, categoria de vida X Y AA AE AB AE",null,"2021-08-10"]
[null,null,null,"20200130i","Para trazabilididad la hoja se incluye el nombre del archivo fuente y la posibilidad de anotar el DOI principal del metadato\nPor usabilidad las pestañas que son de interes para el usuario son las verdes\nSi se define mas de un proyecto los referentes de estaciones e investigadores se descargan consecutivo en las mismas columnas\nSe controla la versión para la plantilla mediante comparación dato en AGLOV de la BD.",null,"2020-01-30"]
[null,null,null,"20180926m","Se modifica la ubicación del consecutivo del ID_MUESTRA y se bloquea para que no sea modificado por la macro",null,"2018-09-26"]
[null,null,null,"20180531m","Se cambia la columna del consecutivo que se le agrega al ID_MUESTRA.",null,"2018-05-31"]
[null,null,null,"20180413i","Se modifica la generación de los ID de muestreo y se agrega macro que genera número aleatorio en la hoja DIGITADOR.",null,"2018-04-13"]

{"sheet":"configuracion","index":1,"n_rows":71,"n_cols":9,"rows_kept":71,"cut":false,"hidden":true,"merged":[[61,0,61,2],[28,0,35,0],[37,0,42,0],[45,0,45,1],[0,0,2,0],[3,0,5,0],[7,0,8,0],[9,0,15,0],[17,0,21,0],[23,0,26,0]]}
["general","urlServicio","https://argos.invemar.org.co/api/"]
[null,"fila de inicio",5]
[null,"fila de fin",105]
["metodologias","Metodologias",{"$f":"'OTRAS REFERENCIAS'!$A$21","v":27}]
[null,"Referentes",150]
[null,"Cantidad maxima de referentes ",150]
["estaciones/investigadores","proyectos",{"$f":"DIGITADOR!B9","v":1480}]
["Lista especies","metodologias",{"$f":"$C$4","v":27}]
[null,"proyectos",{"$f":"DIGITADOR!B9","v":1480}]
["MUESTREOS","ID_MUESTREO","DATOS,D"]
{"$rows_left_out":62}
{"sheet":"DIGITADOR","index":2,"n_rows":28,"n_cols":4,"rows_kept":28,"cut":false,"hidden":false,"merged":[[15,0,15,1],[11,3,13,9],[5,0,6,0],[0,0,0,1],[0,3,5,9],[6,3,8,9],[9,3,10,9]]}
["Recolección de Datos\nMonitoreo Invertebrados Vagiles Areas Coralinas",null,null,"Recomendaciones generales: \n¡Precaución! No inserte Filas o Columnas.\nEn los casos en que falte un valor a ingresar que provenga de la hoja de referencias, informe para que el administrador del sistema haga las adiciones necesarias.\nEsta es una plantilla programada. Las columnas de color oscuro se llenan automaticamente, principalmente a partir de los contenidos de la hoja de referencias. \nNO UTILICE PUNTO Y COMA (;) en ningun campo, por ser el separador de variables (columnas). Tampoco escriba las unidades de medida, no son necesarias.\nPara el correcto funcionamiento de la hoja debe estar activa la opcion de Excel de ejecutar macros (al abrir la hoja acepte la opcion habilitar macros, mensaje de Excel que aparece en la parte superior de la hoja en un recuadro amarillo). La extensión del archivo debe ser .xlsm\nSe recomienda renombrar el archivo de la siguiente manera: SIMAC_Invertebrados_NombreEstacion_FechaMonitoreo.xlsm"]
["Codigo Digitador",{"$f":"IF(B3=\"\",\"\",INDEX(REFERENTES!Y:Z,MATCH(B3,REFERENTES!Z:Z,0),1))","v":""}]
["Nombre del Digitador"]
["Entidad"]
["Version de la plantilla",{"$f":"'Registro de cambios'!$D$4","v":"20240926i"}]
["Fecha en la que ingresa los datos en esta hoja","DD/MM/AAAA"]
[null,"3000-12-12",null,"Previamente a iniciar el llenado de la plantilla, debe presionar el botón \"Descargar referentes\" para que los referentes de ésta plantilla sean actualizados. \nLuego de llenar completamente la plantilla, haga clic sobre el botón \"Generar tablas\" para que los datos sean organizados antes de cargarlos al Sistema de Información.\nAntes de presionar el botón \"Generar tablas\" verifique que:\na. No haya celdas con valores como \"#N/A\" o \"#¡REF!\"\nb. No se esten aplicando filtros en la hoja de datos \nPara finalizar, presione el botón \"Cargar datos\"."]
["Proyecto Convenio"]
["Código Proyecto",{"$f":"IF(B10=\"\",\"\",VLOOKUP(B10,'OTRAS REFERENCIAS'!A14:C16,2,FALSE))","v":1480}]
["Nombre Proyecto","SIMAC","  ","Si requiere ayuda contacte a:\nKevin S. Moreno (kevin.moreno@invemar.org.co)  - Apoyo técnico software"]
{"$rows_left_out":19}
{"sheet":"DATOS","index":3,"n_rows":104,"n_cols":32,"rows_kept":104,"cut":false,"hidden":false,"merged":[[1,24,1,30],[1,14,1,18],[1,2,3,2],[0,3,1,6],[1,9,1,10],[1,19,1,22]]}
[{"$f":"DIGITADOR!B7+F5","v":"3000-12-12"},null,null,"Fecha"]
[{"$f":"TEXT(A1,\"yyyymmddhhmmss\")","v":"30001212000000"},null,"CODIGO",null,null,null,null,null,null,null,null,null,null,null,null,null,null,null,null,null,null,null,null,null,null,null,null,null,null,null,null,"NUMERO DE INDIVIDUOS"]
[null,null,null,null,null,null,"DATE","MES","TEMPO",null,null,"UNIKE_KEY",null,null,null,null,null,null,null,null,null,null,null,null,null,null,null,null,null,null,null,"N"]
[null,null,null,"ID_MUESTREO\n(AGD_MUESTREOS)","FECHA","HORA","DATE",null,"TEMPORADA","DATOS TOMADOS POR","COD\nFUNCIONARIO","Control cambio muestreo","ENTIDAD","OBSERVACIONES","CONSECUTIVO","ID_MUESTRA","COD MUESTREO","ESTACION","ID\nESTACION","PROFUNDIDAD","COD\nPROFUNDIDAD","TRANSECTO","UBICACIÓN\nESPECIFICA","REPLICA","COD\nENTIDAD","CAT VIDA","COD\nCAT VIDA",null,"ESPECIE","COD\nESPECIE",null,"VALOR"]
[null,null,{"$f":"IF(L5=L4,C4,C4+1)","v":1},{"$f":"IF(Q5=\"\",\"\",IF(COUNTIF($Q$5:Q5, Q5)>1, \"\", Q5))","v":""},null,null,{"$f":"IF(E5=\"\",\"\",E5+F5)","v":""},{"$f":"IF(G5<>\"\",MONTH(G5),\"\")","v":""},{"$f":"IF(D5=\"\",\"\",1)","v":""},null,{"$f":"IF(J5=\"\",\"\",INDEX(REFERENTES!$Y:$Z,MATCH(J5,REFERENTES!Z:$Z,0),1))","v":""},{"$f":"IF(G5=\"\",\"\",CONCATENATE(G5,S5,K5,X5))","v":""},null,null,1,{"$f":"IF(Q5=\"\",\"\",CONCATENATE(Q5,ROW()-2))","v":""},{"$f":"IF(R5=\"\",\"\",IF(R5=\"\",\"\",CONCATENATE(DIGITADOR!$M$1,E5,S5)))","v":""},null,{"$f":"IF(R5=\"\",\"\",VLOOKUP(R5,'OTRAS REFERENCIAS'!$L$5:$M$155,2,FALSE))","v":""},null,{"$f":"IF(T5=\"\",\"\",VLOOKUP(T5,'OTRAS REFERENCIAS'!$A$7:$B$9,2,FALSE))","v":""},null,{"$f":"CONCATENATE(U5,V5)","v":""},null,{"$f":"IF(M5=\"\",\"\",VLOOKUP(M5,REFERENTES!$D$2:$E$9,2,FALSE))","v":""},null,{"$f":"IF(Z5=\"\",\"\",INDEX(REFERENTES!G:H,MATCH(Z5,REFERENTES!H:H,0),1))","v":""},null,null,{"$f":"IF(AC5=\"\",\"\",INDEX(REFERENTES!J:K,MATCH(AC5,REFERENTES!K:K,0),1))","v":""}]
[null,null,1,{"$f":"IF(Q6=\"\",\"\",IF(COUNTIF($Q$5:Q6, Q6)>1, \"\", Q6))","v":""},null,null,{"$f":"IF(E6=\"\",\"\",E6+F6)","v":""},"",{"$f":"IF(D6=\"\",\"\",1)","v":""},null,{"$f":"IF(J6=\"\",\"\",INDEX(REFERENTES!$Y:$Z,MATCH(J6,REFERENTES!Z:$Z,0),1))","v":""},{"$f":"IF(G6=\"\",\"\",CONCATENATE(G6,S6,K6,X6))","v":""},null,null,2,{"$f":"IF(Q6=\"\",\"\",CONCATENATE(Q6,ROW()-2))","v":""},{"$f":"IF(R6=\"\",\"\",IF(R6=\"\",\"\",CONCATENATE(DIGITADOR!$M$1,E6,S6)))","v":""},null,{"$f":"IF(R6=\"\",\"\",VLOOKUP(R6,'OTRAS REFERENCIAS'!$L$5:$M$155,2,FALSE))","v":""},null,{"$f":"IF(T6=\"\",\"\",VLOOKUP(T6,'OTRAS REFERENCIAS'!$A$7:$B$9,2,FALSE))","v":""},null,{"$f":"CONCATENATE(U6,V6)","v":""},null,{"$f":"IF(M6=\"\",\"\",VLOOKUP(M6,REFERENTES!$D$2:$E$9,2,FALSE))","v":""},null,{"$f":"IF(Z6=\"\",\"\",INDEX(REFERENTES!G:H,MATCH(Z6,REFERENTES!H:H,0),1))","v":""},null,null,{"$f":"IF(AC6=\"\",\"\",INDEX(REFERENTES!J:K,MATCH(AC6,REFERENTES!K:K,0),1))","v":""}]
[null,null,1,{"$f":"IF(Q7=\"\",\"\",IF(COUNTIF($Q$5:Q7, Q7)>1, \"\", Q7))","v":""},null,null,"","","",null,{"$f":"IF(J7=\"\",\"\",INDEX(REFERENTES!$Y:$Z,MATCH(J7,REFERENTES!Z:$Z,0),1))","v":""},"",null,null,3,"",{"$f":"IF(R7=\"\",\"\",IF(R7=\"\",\"\",CONCATENATE(DIGITADOR!$M$1,E7,S7)))","v":""},null,{"$f":"IF(R7=\"\",\"\",VLOOKUP(R7,'OTRAS REFERENCIAS'!$L$5:$M$155,2,FALSE))","v":""},null,{"$f":"IF(T7=\"\",\"\",VLOOKUP(T7,'OTRAS REFERENCIAS'!$A$7:$B$9,2,FALSE))","v":""},null,"",null,{"$f":"IF(M7=\"\",\"\",VLOOKUP(M7,REFERENTES!$D$2:$E$9,2,FALSE))","v":""},null,{"$f":"IF(Z7=\"\",\"\",INDEX(REFERENTES!G:H,MATCH(Z7,REFERENTES!H:H,0),1))","v":""},null,null,{"$f":"IF(AC7=\"\",\"\",INDEX(REFERENTES!J:K,MATCH(AC7,REFERENTES!K:K,0),1))","v":""}]
[null,null,1,{"$f":"IF(Q8=\"\",\"\",IF(COUNTIF($Q$5:Q8, Q8)>1, \"\", Q8))","v":""},null,null,"","","",null,{"$f":"IF(J8=\"\",\"\",INDEX(REFERENTES!$Y:$Z,MATCH(J8,REFERENTES!Z:$Z,0),1))","v":""},"",null,null,4,"",{"$f":"IF(R8=\"\",\"\",IF(R8=\"\",\"\",CONCATENATE(DIGITADOR!$M$1,E8,S8)))","v":""},null,{"$f":"IF(R8=\"\",\"\",VLOOKUP(R8,'OTRAS REFERENCIAS'!$L$5:$M$155,2,FALSE))","v":""},null,{"$f":"IF(T8=\"\",\"\",VLOOKUP(T8,'OTRAS REFERENCIAS'!$A$7:$B$9,2,FALSE))","v":""},null,"",null,{"$f":"IF(M8=\"\",\"\",VLOOKUP(M8,REFERENTES!$D$2:$E$9,2,FALSE))","v":""},null,{"$f":"IF(Z8=\"\",\"\",INDEX(REFERENTES!G:H,MATCH(Z8,REFERENTES!H:H,0),1))","v":""},null,null,{"$f":"IF(AC8=\"\",\"\",INDEX(REFERENTES!J:K,MATCH(AC8,REFERENTES!K:K,0),1))","v":""}]
[null,null,1,{"$f":"IF(Q9=\"\",\"\",IF(COUNTIF($Q$5:Q9, Q9)>1, \"\", Q9))","v":""},null,null,"","","",null,{"$f":"IF(J9=\"\",\"\",INDEX(REFERENTES!$Y:$Z,MATCH(J9,REFERENTES!Z:$Z,0),1))","v":""},"",null,null,5,"",{"$f":"IF(R9=\"\",\"\",IF(R9=\"\",\"\",CONCATENATE(DIGITADOR!$M$1,E9,S9)))","v":""},null,{"$f":"IF(R9=\"\",\"\",VLOOKUP(R9,'OTRAS REFERENCIAS'!$L$5:$M$155,2,FALSE))","v":""},null,{"$f":"IF(T9=\"\",\"\",VLOOKUP(T9,'OTRAS REFERENCIAS'!$A$7:$B$9,2,FALSE))","v":""},null,"",null,{"$f":"IF(M9=\"\",\"\",VLOOKUP(M9,REFERENTES!$D$2:$E$9,2,FALSE))","v":""},null,{"$f":"IF(Z9=\"\",\"\",INDEX(REFERENTES!G:H,MATCH(Z9,REFERENTES!H:H,0),1))","v":""},null,null,{"$f":"IF(AC9=\"\",\"\",INDEX(REFERENTES!J:K,MATCH(AC9,REFERENTES!K:K,0),1))","v":""}]
[null,null,1,{"$f":"IF(Q10=\"\",\"\",IF(COUNTIF($Q$5:Q10, Q10)>1, \"\", Q10))","v":""},null,null,"","","",null,{"$f":"IF(J10=\"\",\"\",INDEX(REFERENTES!$Y:$Z,MATCH(J10,REFERENTES!Z:$Z,0),1))","v":""},"",null,null,6,"",{"$f":"IF(R10=\"\",\"\",IF(R10=\"\",\"\",CONCATENATE(DIGITADOR!$M$1,E10,S10)))","v":""},null,{"$f":"IF(R10=\"\",\"\",VLOOKUP(R10,'OTRAS REFERENCIAS'!$L$5:$M$155,2,FALSE))","v":""},null,{"$f":"IF(T10=\"\",\"\",VLOOKUP(T10,'OTRAS REFERENCIAS'!$A$7:$B$9,2,FALSE))","v":""},null,"",null,{"$f":"IF(M10=\"\",\"\",VLOOKUP(M10,REFERENTES!$D$2:$E$9,2,FALSE))","v":""},null,{"$f":"IF(Z10=\"\",\"\",INDEX(REFERENTES!G:H,MATCH(Z10,REFERENTES!H:H,0),1))","v":""},null,null,{"$f":"IF(AC10=\"\",\"\",INDEX(REFERENTES!J:K,MATCH(AC10,REFERENTES!K:K,0),1))","v":""}]
{"$rows_left_out":95}
{"sheet":"REFERENTES","index":4,"n_rows":83,"n_cols":26,"rows_kept":83,"cut":false,"hidden":false,"merged":[]}
["AG_ESPECIES",148027,null,"AG_LOV","ALV",null,"AG_LOV",1035,null,"descripcion","cod_letras","clave_sibm","phylum","clase","orden","familia","genero",null,"lugar","prefijo_cdg_est_loc","secuencia_loc","codigo_estacion_loc","descripcion_estacion_loc"]
["Astropiga pulvinata","Apul",null,"CORALINA","CORALINA",null,"Invertebrados","INVE",null,"Astropiga pulvinata","Apul","60.55.2140",null,null,null,null,null,null,"Acuario 1","ACU",14311,1,null,null,3907,"Ameth  Vargas Campo"]
["Centrostephanus coronatus","Ceco",null,"Fundacion Malpelo","F. Malpelo",null,"Camarón","CAMA",null,"Centrostephanus coronatus","Ceco","60.55.3460",null,null,null,null,null,null,"Acuario 2","ACU",14312,2,null,null,593,"Andrea Polanco"]
["Cyphoma gibbosum","Cgib",null,"Instituto de Investigaciones Marinas y Costeras","INVEMAR",null,"Cangreja","CANG",null,"Cyphoma gibbosum","Cgib","52.55.2400",null,null,null,null,null,null,"Aguacate S","AGU",14338,1,"se encuentra localizada bien al fondo de la ensenada",null,4408,"Andres Felipe Acosta Chaparro"]
["Callinectes sp.","Ctes",null,"Parques Nacionales","ParquesNacionales",null,"Caracol","CARA",null,"Callinectes sp.","Ctes","58.46.1570",null,null,null,null,null,null,"Azufrada 1","AZU",14341,1,"A unos 60 metros de la costa en marea baja. localizada a 2º 57' 30.6\" N - 78º 10' 41.0\" O",null,3956,"Carlos Aponte"]
["Diadema antillarum","Dant",null,"PNN_GORGONA","PNN_GORGONA",null,"Erizo","ERIZ",null,"Diadema antillarum","Dant","60.55.2150",null,null,null,null,null,null,"Azufrada 2","AZU",14342,2,"A unos 70m de la costa en marea baja",null,1834,"Diana Isabel Gómez López"]
["Diadema sp.","Diad",null,"UJTL","UJTL",null,"Langosta","LANG",null,"Diadema sp.","Diad","60.46.1135",null,null,null,null,null,null,"Bahía Portete","POR",43726,1,"Bahía Portete",null,1775,"Diego Duque"]
["Diadema mexicanum","Dmex",null,"Universidad Nacional","UNal",null,"Poliqueto","POLI",null,"Diadema mexicanum","Dmex","60.55.2160",null,null,null,null,null,null,"Bonito Gordo (PNN Tayrona)","BGO",55425,1,null,null,3646,"Elizabeth Galeano Galeano"]
["Echinometra sp.","Echi",null,"Universidad del Valle","UNIVALLE",null,"Pulpo","PULP",null,"Echinometra sp.","Echi","60.46.1185",null,null,null,null,null,null,"Cabo Tiburón M","CTI",14333,2,"incluye una parcela en el nivel medio de prof",null,1784,"Johanna Carolina Vega Sequeda"]
["Echinometra lucunter","Eluc",null,null,null,null,null,null,null,"Echinometra lucunter","Eluc","60.55.2280",null,null,null,null,null,null,"Cabo Tiburón S","CTI",14334,1,"la estación es una parcela somera (3 m) forma",null,6356,"Jose Francisco Campo Campo"]
{"$rows_left_out":74}
{"sheet":"OTRAS REFERENCIAS","index":5,"n_rows":155,"n_cols":13,"rows_kept":155,"cut":false,"hidden":false,"merged":[[0,0,2,10],[4,0,4,1],[26,0,26,2],[11,0,11,2],[18,0,18,1]]}
["Estas son listas para variables con valores que no se encuentran codificados, pero que deben manejarse de manera estandarizada. \nSi se requiere agregar un valor nuevo hagalo debajo de la lista correspondiente"]
[]
[]
[]
["PROFUNDIDAD",null,null,"METODOS",null,null,null,null,null,null,null,{"$f":"IF(AND(REFERENTES!V2<>\"\",          REFERENTES!V2<>96321,    REFERENTES!V2<>96222            ),CONCATENATE(REFERENTES!T2,\"-\",REFERENTES!V2),\"\")","v":"ACU-1"},{"$f":"REFERENTES!U2","v":14311}]
["Descripcion","Codigo",null,"NOMBRE_MT","CODIGO",null,null,null,null,null,null,{"$f":"IF(AND(REFERENTES!V3<>\"\",          REFERENTES!V3<>96321,    REFERENTES!V3<>96222            ),CONCATENATE(REFERENTES!T3,\"-\",REFERENTES!V3),\"\")","v":"ACU-2"},{"$f":"REFERENTES!U3","v":14312}]
["Somero","S",null,"Manual de métodos de SIMAC: Cadena rotulada cada diez eslabones","Car",null,null,null,null,null,null,{"$f":"IF(AND(REFERENTES!V4<>\"\",          REFERENTES!V4<>96321,    REFERENTES!V4<>96222            ),CONCATENATE(REFERENTES!T4,\"-\",REFERENTES!V4),\"\")","v":"AGU-1"},{"$f":"REFERENTES!U4","v":14338}]
["Medio","M",null,null,null,null,null,null,null,null,null,{"$f":"IF(AND(REFERENTES!V5<>\"\",          REFERENTES!V5<>96321,    REFERENTES!V5<>96222            ),CONCATENATE(REFERENTES!T5,\"-\",REFERENTES!V5),\"\")","v":"AZU-1"},{"$f":"REFERENTES!U5","v":14341}]
["Profundo","P",null,null,null,null,null,null,null,null,null,{"$f":"IF(AND(REFERENTES!V6<>\"\",          REFERENTES!V6<>96321,    REFERENTES!V6<>96222            ),CONCATENATE(REFERENTES!T6,\"-\",REFERENTES!V6),\"\")","v":"AZU-2"},{"$f":"REFERENTES!U6","v":14342}]
[null,null,null,null,null,null,null,null,null,null,null,{"$f":"IF(AND(REFERENTES!V7<>\"\",          REFERENTES!V7<>96321,    REFERENTES!V7<>96222            ),CONCATENATE(REFERENTES!T7,\"-\",REFERENTES!V7),\"\")","v":"POR-1"},{"$f":"REFERENTES!U7","v":43726}]
{"$rows_left_out":146}
{"sheet":"Resumen","index":6,"n_rows":101,"n_cols":8,"rows_kept":101,"cut":false,"hidden":false,"merged":[[0,7,2,11]]}
["estacion","individuos","registros","Etiquetas de fila","Suma de individuos","Cuenta de registros",null,"Esta tabla debe ser actualizada cada vez que introduzca nuevos datos, para ello debe hacer clic sobre cualquier parte de la tabla y presionar las teclas ALT + F5 de manera conjunta."]
[{"$f":"IF(DATOS!R5=\"\",\"\",DATOS!R5)","v":""},{"$f":"IF(DATOS!AF5=\"\",\"\",DATOS!AF5)","v":""},{"$f":"IF(DATOS!V5=\"\",\"\",DATOS!V5)","v":""},null,0,100]
[{"$f":"IF(DATOS!R6=\"\",\"\",DATOS!R6)","v":""},{"$f":"IF(DATOS!AF6=\"\",\"\",DATOS!AF6)","v":""},{"$f":"IF(DATOS!V6=\"\",\"\",DATOS!V6)","v":""},"Total general",0,100]
[{"$f":"IF(DATOS!R7=\"\",\"\",DATOS!R7)","v":""},{"$f":"IF(DATOS!AF7=\"\",\"\",DATOS!AF7)","v":""},{"$f":"IF(DATOS!V7=\"\",\"\",DATOS!V7)","v":""}]
[{"$f":"IF(DATOS!R8=\"\",\"\",DATOS!R8)","v":""},{"$f":"IF(DATOS!AF8=\"\",\"\",DATOS!AF8)","v":""},{"$f":"IF(DATOS!V8=\"\",\"\",DATOS!V8)","v":""}]
[{"$f":"IF(DATOS!R9=\"\",\"\",DATOS!R9)","v":""},{"$f":"IF(DATOS!AF9=\"\",\"\",DATOS!AF9)","v":""},{"$f":"IF(DATOS!V9=\"\",\"\",DATOS!V9)","v":""}]
[{"$f":"IF(DATOS!R10=\"\",\"\",DATOS!R10)","v":""},{"$f":"IF(DATOS!AF10=\"\",\"\",DATOS!AF10)","v":""},{"$f":"IF(DATOS!V10=\"\",\"\",DATOS!V10)","v":""}]
[{"$f":"IF(DATOS!R11=\"\",\"\",DATOS!R11)","v":""},{"$f":"IF(DATOS!AF11=\"\",\"\",DATOS!AF11)","v":""},{"$f":"IF(DATOS!V11=\"\",\"\",DATOS!V11)","v":""}]
[{"$f":"IF(DATOS!R12=\"\",\"\",DATOS!R12)","v":""},{"$f":"IF(DATOS!AF12=\"\",\"\",DATOS!AF12)","v":""},{"$f":"IF(DATOS!V12=\"\",\"\",DATOS!V12)","v":""}]
[{"$f":"IF(DATOS!R13=\"\",\"\",DATOS!R13)","v":""},{"$f":"IF(DATOS!AF13=\"\",\"\",DATOS!AF13)","v":""},{"$f":"IF(DATOS!V13=\"\",\"\",DATOS!V13)","v":""}]
{"$rows_left_out":92}
{"sheet":"AGD_MUESTREOS","index":7,"n_rows":0,"n_cols":0,"rows_kept":0,"cut":false,"hidden":true,"merged":[]}

{"sheet":"AGD_PARAMETRO","index":8,"n_rows":0,"n_cols":0,"rows_kept":0,"cut":false,"hidden":true,"merged":[]}

{"sheet":"AGD_MUESTRAS","index":9,"n_rows":0,"n_cols":0,"rows_kept":0,"cut":false,"hidden":true,"merged":[]}

{"sheet":"AGD_MUESTRAS_VARIABLES","index":10,"n_rows":0,"n_cols":0,"rows_kept":0,"cut":false,"hidden":true,"merged":[]}

{"sheet":"AGD_AUTORIAS","index":11,"n_rows":0,"n_cols":0,"rows_kept":0,"cut":false,"hidden":true,"merged":[]}