{"text_format":"1","workbook":"xlsx","n_sheets":12,"sheets":["Registro de cambios","configuracion","DIGITADOR","DATOS","REFERENTES","OTRAS REFERENCIAS","Resumen","AGD_MUESTREOS","AGD_PARAMETRO","AGD_MUESTRAS","AGD_MUESTRAS_VARIABLES","AGD_AUTORIAS"],"not_rendered":{"charts":0,"images":0,"macros":1,"external_links":1,"defined_names":29,"comments":1,"pivot_tables":1},"unopened":[],"bounds":{"document_bytes":16777216,"sheet_cells":100000,"rows_first":2000,"rows_last":500,"rows_between":2000,"halvings":0,"cell_chars":16384,"cell_head_chars":4096},"cells_cut":0,"cells_raw":0,"read":"whole","date_system":"1900"}

{"sheet":"Registro de cambios","index":0,"n_rows":6,"n_cols":7,"rows_kept":6,"cut":false,"hidden":true,"merged":[[1,3,1,6]]}
[]
[null,null,null,"REGISTRO DE CAMBIOS"]
[null,null,null,"VERSIÓN No.","CAMBIO REALIZADO","AUTOR","VIGENTE DESDE"]
[null,null,null,"20240926i","Actualización del código de la macro.\n\nSe eliminó la URL de la antigua API de portete:\n       http://portete.invemar.org.co:7003/ArgosWebServices-RESTWebService-context-root/rest/1.0\n\nFue reemplazada por la URL de la API de ARGOS:\n       https://argos.invemar.org.co/api/\n\nLa API contiene End Points que permiten tener mayor control, facilitan la descarga de referentes (listas de usuarios, estaciones, especies, etc.) que corresponden a criterios específicos como el proyecto usado en la plantilla para evitar descargar data innecesaria.\n\nDel mismo modo, también permite la carga de información a la BDD del INVEMAR.\n\nLa macro toma los Endpoints desde la hoja configuracion de una tabla llamada \"Configuración referentes\", a la que se le puede modificar las rutas de la API o agregar nuevas. cabe resaltar que se puede \"quemar\" directamente en la macro los Endpoints que lo requieran.","Juan Palomino","26/09/2024"]
[null,null,null,"20200130i","Para trazabilididad la hoja se incluye el nombre del archivo fuente y la posibilidad de anotar el DOI principal del metadato\nPor usabilidad las pestañas que son de interes para el usuario son las verdes\nSi se define mas de un proyecto los referentes de estaciones e investigadores se descargan consecutivo en las mismas columnas\nSe controla la versión para la plantilla mediante comparación dato en AGLOV de la BD.",null,"2020-01-30"]
[null,null,null,"20180413m","Se modifica la generación de los ID de muestreo y se agrega macro que genera número aleatorio en la hoja DIGITADOR.",null,"2018-04-13"]

{"sheet":"configuracion","index":1,"n_rows":71,"n_cols":8,"rows_kept":71,"cut":false,"hidden":true,"merged":[[61,0,61,2],[28,0,35,0],[37,0,42,0],[45,0,45,1],[0,0,2,0],[3,0,5,0],[7,0,8,0],[9,0,15,0],[17,0,21,0],[23,0,26,0]]}
["general","urlServicio","https://argos.invemar.org.co/api/"]
[null,"fila de inicio",5]
[null,"fila de fin",305]
["metodologias","Metodologias",28]
[null,"Referentes",350]
[null,"Cantidad maxima de referentes ",350]
["estaciones/investigadores","proyectos",{"$f":"DIGITADOR!B9","v":1480}]
["Lista especies","metodologias",28]
[null,"proyectos",{"$f":"DIGITADOR!B9","v":1480}]
["MUESTREOS","ID_MUESTREO","DATOS,D"]
{"$rows_left_out":62}
{"sheet":"DIGITADOR","index":2,"n_rows":27,"n_cols":4,"rows_kept":27,"cut":false,"hidden":false,"merged":[[26,1,26,2],[24,1,24,2],[11,3,13,9],[5,0,6,0],[0,0,0,1],[0,3,5,9],[6,3,8,9],[9,3,10,9],[25,1,25,2],[15,0,15,1]]}
["Plantilla para la Recolección de\nDatos Gorgonáceos",null,null,"Recomendaciones generales: \n¡Precaución! No inserte Filas o Columnas.\nEn los casos en que falte un valor a ingresar que provenga de la hoja de referencias, informe para que el administrador del sistema haga las adiciones necesarias.\nEsta es una plantilla programada. Las columnas de color oscuro se llenan automaticamente, principalmente a partir de los contenidos de la hoja de referencias. \nNO UTILICE PUNTO Y COMA (;) en ningun campo, por ser el separador de variables (columnas). Tampoco escriba las unidades de medida, no son necesarias.\nPara el correcto funcionamiento de la hoja debe estar activa la opcion de Excel de ejecutar macros (al abrir la hoja acepte la opcion habilitar macros, mensaje de Excel que aparece en la parte superior de la hoja en un recuadro amarillo). La extensión del archivo debe ser .xlsm\nSe recomienda renombrar el archivo de la siguiente manera: SIMAC_Gorgonaceos_NombreEstacion_FechaMonitoreo.xlsm"]
["Código Digitador",{"$f":"IF(B3=\"\",\"\",INDEX(REFERENTES!V:W,MATCH(B3,REFERENTES!W:W,0),1))","v":""}]
["Nombre del responsable"]
["Entidad"]
["Versión de la plantilla",{"$f":"'Registro de cambios'!D4","v":"20240926i"}]
["Fecha en la que ingresa los datos en esta hoja","DD/MM/AAAA"]
[null,"3000-12-12",null,"Previamente a iniciar el llenado de la plantilla, debe presionar el botón \"Descargar referentes\" para que los referentes de ésta plantilla sean actualizados. \nLuego de llenar completamente la plantilla, haga clic sobre el botón \"Generar tablas\" para que los datos sean organizados antes de cargarlos al Sistema de Información.\nAntes de presionar el botón \"Generar tablas\" verifique que:\na. No haya celdas con valores como \"#N/A\" o \"#¡REF!\"\nb. No se esten aplicando filtros en la hoja de datos \nPara finalizar, presione el botón \"Cargar datos\"."]
[]
["Código Monitoreo",1480]
["Proyecto Principal","Sistema de Monitoreo de los Arrecifes Coralinos en Colombia",null,"Si requiere ayuda contacte a:\nKevin S. Moreno (kevin.moreno@invemar.org.co)  - Apoyo técnico software"]
{"$rows_left_out":18}
{"sheet":"DATOS","index":3,"n_rows":304,"n_cols":33,"rows_kept":304,"cut":false,"hidden":false,"merged":[[1,24,1,31],[1,14,1,18],[1,2,3,2],[0,3,1,6],[1,9,1,10],[1,19,1,22]]}
[{"$f":"DIGITADOR!B7+F5","v":"3000-12-12"},null,null,"Fecha"]
[{"$f":"TEXT(A1,\"yyyymmdd\")","v":"30001212"},null,"CODIGO",null,null,null,null,null,null,null,null,null,null,null,null,null,null,null,null,null,null,null,null,null,null,null,null,null,null,null,null,null,"NÚMERO DE INDIVIDUOS"]
[null,null,null,null,null,null,"DATE","MES","TEMPO",null,null,"UNIKE_KEY",null,null,null,null,null,null,null,null,null,null,null,null,null,null,null,null,null,null,null,null,"N"]
[null,null,null,"CODMUESTREO","FECHA","HORA","DATE","MES","TEMPORADA","DATOS TOMADOS POR","COD\nINVESTIGADOR","UNIKE KEY","ENTIDAD","OBSERVACIONES","CONSECUTIVO","ID\nMUESTRA","ID_MUESTREO (AGD_MUESTREO)","ESTACION","ID ESTACION","PROFUNDIDAD","COD","TRANSECTO","UBICACION","REPLICA","POSICION\n(m)","CAT VIDA","DESCRIPCIÓN\nCAT VIDA","COD\nESPECIE MAYÚSCULA",null,"ESPECIE","DESCRIPCIÓN\nESPECIE","COD\nSIBM","VALOR"]
[null,null,{"$f":"IF(L5=L4,C4,C4+1)","v":1},{"$f":"IF(Q5=\"\",\"\",IF(COUNTIF($Q5:Q5, Q5)>1, \"\", Q5))","v":""},null,null,{"$f":"IF(E5=\"\",\"\",E5+F5)","v":""},{"$f":"IF(G5<>\"\",MONTH(G5),\"\")","v":""},{"$f":"IF(D5=\"\",\"\",1)","v":""},null,{"$f":"IF(J5=\"\",\"\",INDEX(REFERENTES!$V:$W,MATCH(J5,REFERENTES!$W:$W,0),1))","v":""},{"$f":"IF(G5=\"\",\"\",CONCATENATE(G5,S5,K5,X5))","v":""},null,null,1,{"$f":"IF(Q5=\"\",\"\",CONCATENATE(Q5,ROW()-2))","v":""},{"$f":"IF(E5<>\"\",CONCATENATE($A$2,DIGITADOR!$B$2,DIGITADOR!$M$1,C5),\"\")","v":""},null,{"$f":"IF(R5=\"\",\"\",INDEX('OTRAS REFERENCIAS'!$L$5:$M$152,MATCH(R5,'OTRAS REFERENCIAS'!$L$5:$L$157,0),2))","v":""},null,{"$f":"IF(T5=\"\",\"\",VLOOKUP(T5,'OTRAS REFERENCIAS'!$A$7:$B$9,2,FALSE))","v":""},null,{"$f":"CONCATENATE(T5,V5)","v":""},null,null,null,{"$f":"IF(Z5=\"\",\"\",INDEX(REFERENTES!$A:$B,MATCH(Z5,REFERENTES!$B:$B,0),1))","v":""},{"$f":"UPPER(AD5)","v":""},null,null,{"$f":"IF(AD5=\"\",\"\",INDEX(REFERENTES!$D:$E,MATCH(AD5,REFERENTES!$E:$E,0),1))","v":""},{"$f":"IF(AD5=\"\",\"\",INDEX(REFERENTES!$D:$L,MATCH(AD5,REFERENTES!$E:$E,0),6))","v":""}]
[null,null,1,{"$f":"IF(Q6=\"\",\"\",IF(COUNTIF($Q6:Q6, Q6)>1, \"\", Q6))","v":""},null,null,{"$f":"IF(E6=\"\",\"\",E6+F6)","v":""},"",{"$f":"IF(D6=\"\",\"\",1)","v":""},null,{"$f":"IF(J6=\"\",\"\",INDEX(REFERENTES!$V:$W,MATCH(J6,REFERENTES!$W:$W,0),1))","v":""},"",null,null,1,{"$f":"IF(Q6=\"\",\"\",CONCATENATE(Q6,ROW()-2))","v":""},{"$f":"IF(E6<>\"\",CONCATENATE($A$2,DIGITADOR!$B$2,DIGITADOR!$M$1,C6),\"\")","v":""},null,{"$f":"IF(R6=\"\",\"\",INDEX('OTRAS REFERENCIAS'!$L$5:$M$152,MATCH(R6,'OTRAS REFERENCIAS'!$L$5:$L$157,0),2))","v":""},null,{"$f":"IF(T6=\"\",\"\",VLOOKUP(T6,'OTRAS REFERENCIAS'!$A$7:$B$9,2,FALSE))","v":""},null,{"$f":"CONCATENATE(T6,V6)","v":""},null,null,null,{"$f":"IF(Z6=\"\",\"\",INDEX(REFERENTES!$A:$B,MATCH(Z6,REFERENTES!$B:$B,0),1))","v":""},{"$f":"UPPER(AD6)","v":""},null,null,{"$f":"IF(AD6=\"\",\"\",INDEX(REFERENTES!$D:$E,MATCH(AD6,REFERENTES!$E:$E,0),1))","v":""},{"$f":"IF(AD6=\"\",\"\",INDEX(REFERENTES!$D:$L,MATCH(AD6,REFERENTES!$E:$E,0),6))","v":""}]
[null,null,1,{"$f":"IF(Q7=\"\",\"\",IF(COUNTIF($Q7:Q7, Q7)>1, \"\", Q7))","v":""},null,null,"","","",null,{"$f":"IF(J7=\"\",\"\",INDEX(REFERENTES!$V:$W,MATCH(J7,REFERENTES!$W:$W,0),1))","v":""},"",null,null,3,"",{"$f":"IF(E7<>\"\",CONCATENATE($A$2,DIGITADOR!$B$2,DIGITADOR!$M$1,C7),\"\")","v":""},null,{"$f":"IF(R7=\"\",\"\",INDEX('OTRAS REFERENCIAS'!$L$5:$M$152,MATCH(R7,'OTRAS REFERENCIAS'!$L$5:$L$157,0),2))","v":""},null,{"$f":"IF(T7=\"\",\"\",VLOOKUP(T7,'OTRAS REFERENCIAS'!$A$7:$B$9,2,FALSE))","v":""},null,"",null,null,null,{"$f":"IF(Z7=\"\",\"\",INDEX(REFERENTES!$A:$B,MATCH(Z7,REFERENTES!$B:$B,0),1))","v":""},"",null,null,{"$f":"IF(AD7=\"\",\"\",INDEX(REFERENTES!$D:$E,MATCH(AD7,REFERENTES!$E:$E,0),1))","v":""},{"$f":"IF(AD7=\"\",\"\",INDEX(REFERENTES!$D:$L,MATCH(AD7,REFERENTES!$E:$E,0),6))","v":""}]
[null,null,1,{"$f":"IF(Q8=\"\",\"\",IF(COUNTIF($Q8:Q8, Q8)>1, \"\", Q8))","v":""},null,null,"","","",null,{"$f":"IF(J8=\"\",\"\",INDEX(REFERENTES!$V:$W,MATCH(J8,REFERENTES!$W:$W,0),1))","v":""},{"$f":"IF(G8=\"\",\"\",CONCATENATE(G8,S8,K8,X8))","v":""},null,null,4,"",{"$f":"IF(E8<>\"\",CONCATENATE($A$2,DIGITADOR!$B$2,DIGITADOR!$M$1,C8),\"\")","v":""},"",{"$f":"IF(R8=\"\",\"\",INDEX('OTRAS REFERENCIAS'!$L$5:$M$152,MATCH(R8,'OTRAS REFERENCIAS'!$L$5:$L$157,0),2))","v":""},null,{"$f":"IF(T8=\"\",\"\",VLOOKUP(T8,'OTRAS REFERENCIAS'!$A$7:$B$9,2,FALSE))","v":""},null,"",null,null,null,{"$f":"IF(Z8=\"\",\"\",INDEX(REFERENTES!$A:$B,MATCH(Z8,REFERENTES!$B:$B,0),1))","v":""},"",null,null,{"$f":"IF(AD8=\"\",\"\",INDEX(REFERENTES!$D:$E,MATCH(AD8,REFERENTES!$E:$E,0),1))","v":""},{"$f":"IF(AD8=\"\",\"\",INDEX(REFERENTES!$D:$L,MATCH(AD8,REFERENTES!$E:$E,0),6))","v":""}]
[null,null,1,{"$f":"IF(Q9=\"\",\"\",IF(COUNTIF($Q9:Q9, Q9)>1, \"\", Q9))","v":""},null,null,"","","",null,{"$f":"IF(J9=\"\",\"\",INDEX(REFERENTES!$V:$W,MATCH(J9,REFERENTES!$W:$W,0),1))","v":""},"",null,null,5,"",{"$f":"IF(E9<>\"\",CONCATENATE($A$2,DIGITADOR!$B$2,DIGITADOR!$M$1,C9),\"\")","v":""},"",{"$f":"IF(R9=\"\",\"\",INDEX('OTRAS REFERENCIAS'!$L$5:$M$152,MATCH(R9,'OTRAS REFERENCIAS'!$L$5:$L$157,0),2))","v":""},null,{"$f":"IF(T9=\"\",\"\",VLOOKUP(T9,'OTRAS REFERENCIAS'!$A$7:$B$9,2,FALSE))","v":""},null,"",null,null,null,{"$f":"IF(Z9=\"\",\"\",INDEX(REFERENTES!$A:$B,MATCH(Z9,REFERENTES!$B:$B,0),1))","v":""},"",null,null,{"$f":"IF(AD9=\"\",\"\",INDEX(REFERENTES!$D:$E,MATCH(AD9,REFERENTES!$E:$E,0),1))","v":""},{"$f":"IF(AD9=\"\",\"\",INDEX(REFERENTES!$D:$L,MATCH(AD9,REFERENTES!$E:$E,0),6))","v":""}]
[null,null,1,{"$f":"IF(Q10=\"\",\"\",IF(COUNTIF($Q10:Q10, Q10)>1, \"\", Q10))","v":""},null,null,"","","",null,{"$f":"IF(J10=\"\",\"\",INDEX(REFERENTES!$V:$W,MATCH(J10,REFERENTES!$W:$W,0),1))","v":""},"",null,null,6,"",{"$f":"IF(E10<>\"\",CONCATENATE($A$2,DIGITADOR!$B$2,DIGITADOR!$M$1,C10),\"\")","v":""},null,{"$f":"IF(R10=\"\",\"\",INDEX('OTRAS REFERENCIAS'!$L$5:$M$152,MATCH(R10,'OTRAS REFERENCIAS'!$L$5:$L$157,0),2))","v":""},null,{"$f":"IF(T10=\"\",\"\",VLOOKUP(T10,'OTRAS REFERENCIAS'!$A$7:$B$9,2,FALSE))","v":""},null,"",null,null,null,{"$f":"IF(Z10=\"\",\"\",INDEX(REFERENTES!$A:$B,MATCH(Z10,REFERENTES!$B:$B,0),1))","v":""},"",null,null,{"$f":"IF(AD10=\"\",\"\",INDEX(REFERENTES!$D:$E,MATCH(AD10,REFERENTES!$E:$E,0),1))","v":""},{"$f":"IF(AD10=\"\",\"\",INDEX(REFERENTES!$D:$L,MATCH(AD10,REFERENTES!$E:$E,0),6))","v":""}]
{"$rows_left_out":295}
{"sheet":"REFERENTES","index":4,"n_rows":148,"n_cols":23,"rows_kept":148,"cut":false,"hidden":false,"merged":[]}
["AG_LOV",1037,null,"AG_ESPECIES",148028]
["Rod","ROD",null,"Briareum asbestinum","Basb",null,null,"Briareum asbestinum","8.55.60","CNIDARIA","CORALINA","CORALINA",null,null,null,14295,"PLA",2,"A unos 150m de la costa en marea baja","Playa Blanca 2",null,3907,"Ameth  Vargas Campo"]
["Feather","FEAT",null,"Briareum sp.","Bria",null,null,"Briareum sp.","8.46.50","CNIDARIA","Fundacion Malpelo","F. Malpelo",null,null,null,14296,"CHO",1,"ubicada a 6º","La Chola 1",null,593,"Andrea Polanco"]
["Fan","FAN",null,"Carijoa riisei","Crii",null,null,"Carijoa riisei","8.55.40","CNIDARIA","Instituto de Investigaciones Marinas y Costeras","INVEMAR",null,null,null,14297,"CHE",1,"Compartida con CARICOMP.La parcela del nivel somero (3-5 m) presenta una cobertura coralina _x000D_\r\r\naproximada del 29% dada principalmente por Montastraea faveolata y esqueletos de _x000D_\r\r\nAcropora palmata (algunas colonias vivas). _x000D_\r\r\nLas parcelas media (9-10 m) y profunda (15-16) tienen coberturas de 22% y 21%_x000D_\r\r\n respectivamente y están dominadas por una franja amplia de pendiente suave conformada por _x000D_\r\r\n corales masivos e incrustantes de Diploria spp, Montastraea faveolata y M. cavernosa principalmente._x000D_\r\r\n  El relieve de éstas dos últimas parcelas no es fuerte ya que no hay tamaños de colonias considerables, _x000D_\r\r\n  pero si hay una zona de relieve complejo muy cerca de los transectos la cual es dominada por colonias _x000D_\r\r\n  muy grandes de crecimiento montañoso de M. faveolata. En la parcela media se pueden observar además _x000D_\r\r\n  abundantes colonias medianas de gorgonáceos de la especie Eunicea fusca","Chengue..C1",null,4408,"Andres Felipe Acosta Chaparro"]
["Whip","WHIP",null,"Diodogorgia nodulifera","Dnod",null,null,"Diodogorgia nodulifera","8.55.100","CNIDARIA","Parques Nacionales","ParquesNacionales",null,null,null,14298,"CHE",2,"Las formaciones coralinas y el tipo de relieve son similares a los de C1 exceptuando _x000D_\r\r\nque en el nivel somero (3-6 m) de C2 hay mayor cobertura coralina (38%), _x000D_\r\r\nse pueden observar además cabezas grandes de Siderastrea siderea y _x000D_\r\r\nlos arrecifes de las parcelas media (9-11 m) y profunda (15-17 m), _x000D_\r\r\ndescienden como un talud de pendiente más fuerte. _x000D_\r\r\nLa cobertura de las parcelas media y profunda es de 40% y 31% _x000D_\r\r\nrespectivamente y dichos niveles presentan abundantes cabezas de Montastraea cavernosa_x000D_\r\r\ny Diploria strigosa, así como algunas colonias de gorgonáceos de tamaño considerable principalmente _x000D_\r\r\ndel género Plexaura sp. Debido a que las parcelas media y profunda están ubicados más hacia afuera _x000D_\r\r\nde la bahía, presentan un poco de oleaje de diciembre a abril por la fuerte acción de los _x000D_\r\r\nvientos alisios, lo cual dificulta el muestreo de los transectos de cadena durante esa _x000D_\r\r\népoca","Chengue..C2",null,3956,"Carlos Aponte"]
[null,null,null,"Ellisella barbadensis","Ebar",null,null,"Ellisella barbadensis","8.55.1180","CNIDARIA","PNN_GORGONA","PNN_GORGONA",null,null,null,14299,"TES",1,"Isla Rosario, el Tesoro. está ubicada en una cuenca lagunar de poca pendiente y relieve complejo, _x000D_\r\r\npresenta una cobertura aproximada del 45% y se observan cabezas coralinas _x000D_\r\r\ngrandes dominadas por Montastraea annularis. Es posible observar también _x000D_\r\r\notros corales de crecimiento masivo y cobertura importante como M. faveolata, _x000D_\r\r\nDiploria labyrinthiformis y Colpophyllia natans mezclados con parches amplios de arena._x000D_\r\r\n También se presentan abundantes gorgonáceos de los géneros Briareum sp. y Pseudoplexaura sp. _x000D_\r\r\n Después del plano se presenta hacia afuera un talud de pendiente media y relieve complejo donde _x000D_\r\r\n están ubicados las parcelas de los niveles medio (9-12 m) y profundo (16-19 m). El nivel medio _x000D_\r\r\n tiene una cobertura coralina del 24% y es un ambiente de corales masivos mixtos como M. annularis, _x000D_\r\r\n M franksi y C. natans, mientras el profundo presenta una cobertura mayor (35%) y está dominado por M. _x000D_\r\r\n franksi que forma colonias grandes con bordes tipo terraza. En la parcela profunda se presentan colonias _x000D_\r\r\n aisladas de látigos del género Ellisella sp","Tesoro 1",null,1834,"Diana Isabel Gómez López"]
[null,null,null,"Eunicea calyculata","Ecal",null,null,"Eunicea calyculata","8.55.420","CNIDARIA","UJTL","UJTL",null,null,null,14300,"PAV",1,"Isla Rosario, Pavitos. El ambiente de esta estación en los tres niveles de profundidad difiere considerablemente al de tesoro _x000D_\r\r\npues pavitos está dominado por corales de crecimiento foliáceo del tipo Agaricia sp,_x000D_\r\r\n los gorgonáceos están prácticamente ausentes y se presentan gran cantidad de esponjas de variados _x000D_\r\r\n tamaños, formas de crecimiento y colores. La parcela somera de monitoreo está ubicada_x000D_\r\r\n  sobre la plataforma o terraza que rodea la Isla Pavitos y presenta una cobertura coralina _x000D_\r\r\n  del 31% y cerca se observa un talud de pendiente fuerte y de sustrato frágil donde _x000D_\r\r\n  se localizan las parcelas de los niveles medio (9-12 m) y profundo (16-18 m)._x000D_\r\r\n  En el nivel somero también pueden observarse comúnmente algunas cabezas medianas de _x000D_\r\r\n  Montastraea annularis y M. faveolata mientras en el profundo hay abundantes colonias _x000D_\r\r\n  de M. franksi. Los niveles medio y profundo presenta una cobertura coralina del 40% y 30%_x000D_\r\r\n   respectivamente_x000D_","Pavitos",null,1775,"Diego Duque"]
[null,null,null,"Erythropodium caribaeorum","Ecar",null,null,"Erythropodium caribaeorum","8.55.120","CNIDARIA","Universidad Nacional","UNal",null,null,null,14301,"PBT",1,"Area coralina Punta Betín, Santa Marta","Punta de Betin",null,6356,"Jose Campo"]
[null,null,null,"Eunicea clavigera","Ecla",null,null,"Eunicea clavigera","8.55.500","CNIDARIA","Universidad del Valle","UNIVALLE",null,null,null,14302,"GAY",1,null,"Gayraca 1",null,3905,"Juan David González Corredor"]
[null,null,null,"Ellisella elongata","Eelo",null,null,"Ellisella elongata","8.55.1160","CNIDARIA",null,null,null,null,null,14303,"MRO",1,null,"El Morro",null,5705,"Katherine Johanna Mejía Quintero"]
{"$rows_left_out":139}
{"sheet":"OTRAS REFERENCIAS","index":5,"n_rows":156,"n_cols":13,"rows_kept":156,"cut":false,"hidden":false,"merged":[[0,0,2,10],[4,0,4,1],[26,0,26,2]]}
["Estas son listas para variables con valores que no se encuentran codificados, pero que deben manejarse de manera estandarizada. \nSi se requiere agregar un valor nuevo hagalo debajo de la lista correspondiente"]
[]
[]
[]
["PROFUNDIDAD",null,null,"METODOS",null,null,null,null,null,null,null,{"$f":"IF(AND(REFERENTES!R2<>\"\",          REFERENTES!R2<>96321,    REFERENTES!R2<>96222            ),CONCATENATE(REFERENTES!Q2,\"-\",REFERENTES!R2),\"\")","v":"PLA-2"},{"$f":"REFERENTES!P2","v":14295}]
["Descripcion","Codigo",null,"NOMBRE_MT","CODIGO",null,null,null,null,null,null,{"$f":"IF(AND(REFERENTES!R3<>\"\",          REFERENTES!R3<>96321,    REFERENTES!R3<>96222            ),CONCATENATE(REFERENTES!Q3,\"-\",REFERENTES!R3),\"\")","v":"CHO-1"},{"$f":"REFERENTES!P3","v":14296}]
["S","Somero",null,"Manual de métodos de SIMAC: Cadena rotulada cada diez eslabones","Car",null,null,null,null,null,null,{"$f":"IF(AND(REFERENTES!R4<>\"\",          REFERENTES!R4<>96321,    REFERENTES!R4<>96222            ),CONCATENATE(REFERENTES!Q4,\"-\",REFERENTES!R4),\"\")","v":"CHE-1"},{"$f":"REFERENTES!P4","v":14297}]
["M","Medio",null,null,null,null,null,null,null,null,null,{"$f":"IF(AND(REFERENTES!R5<>\"\",          REFERENTES!R5<>96321,    REFERENTES!R5<>96222            ),CONCATENATE(REFERENTES!Q5,\"-\",REFERENTES!R5),\"\")","v":"CHE-2"},{"$f":"REFERENTES!P5","v":14298}]
["P","Profundo",null,null,null,null,null,null,null,null,null,{"$f":"IF(AND(REFERENTES!R6<>\"\",          REFERENTES!R6<>96321,    REFERENTES!R6<>96222            ),CONCATENATE(REFERENTES!Q6,\"-\",REFERENTES!R6),\"\")","v":"TES-1"},{"$f":"REFERENTES!P6","v":14299}]
[null,null,null,null,null,null,null,null,null,null,null,{"$f":"IF(AND(REFERENTES!R7<>\"\",          REFERENTES!R7<>96321,    REFERENTES!R7<>96222            ),CONCATENATE(REFERENTES!Q7,\"-\",REFERENTES!R7),\"\")","v":"PAV-1"},{"$f":"REFERENTES!P7","v":14300}]
{"$rows_left_out":147}
{"sheet":"Resumen","index":6,"n_rows":301,"n_cols":8,"rows_kept":301,"cut":false,"hidden":false,"merged":[[0,7,2,11]]}
["estacion","individuos","registros","Etiquetas de fila","Suma de individuos","Cuenta de registros",null,"Esta tabla debe ser actualizada cada vez que introduzca nuevos datos, para ello debe hacer clic sobre cualquier parte de la tabla y presionar las teclas ALT + F5 de manera conjunta."]
[{"$f":"IF(DATOS!R5=\"\",\"\",DATOS!R5)","v":""},{"$f":"IF(DATOS!AG5=\"\",\"\",DATOS!AG5)","v":""},{"$f":"IF(DATOS!V5=\"\",\"\",DATOS!V5)","v":""},null,0,300]
[{"$f":"IF(DATOS!R6=\"\",\"\",DATOS!R6)","v":""},{"$f":"IF(DATOS!AG6=\"\",\"\",DATOS!AG6)","v":""},{"$f":"IF(DATOS!V6=\"\",\"\",DATOS!V6)","v":""},"Total general",0,300]
[{"$f":"IF(DATOS!R7=\"\",\"\",DATOS!R7)","v":""},{"$f":"IF(DATOS!AG7=\"\",\"\",DATOS!AG7)","v":""},{"$f":"IF(DATOS!V7=\"\",\"\",DATOS!V7)","v":""}]
[{"$f":"IF(DATOS!R8=\"\",\"\",DATOS!R8)","v":""},{"$f":"IF(DATOS!AG8=\"\",\"\",DATOS!AG8)","v":""},{"$f":"IF(DATOS!V8=\"\",\"\",DATOS!V8)","v":""}]
[{"$f":"IF(DATOS!R9=\"\",\"\",DATOS!R9)","v":""},{"$f":"IF(DATOS!AG9=\"\",\"\",DATOS!AG9)","v":""},{"$f":"IF(DATOS!V9=\"\",\"\",DATOS!V9)","v":""}]
[{"$f":"IF(DATOS!R10=\"\",\"\",DATOS!R10)","v":""},{"$f":"IF(DATOS!AG10=\"\",\"\",DATOS!AG10)","v":""},{"$f":"IF(DATOS!V10=\"\",\"\",DATOS!V10)","v":""}]
[{"$f":"IF(DATOS!R11=\"\",\"\",DATOS!R11)","v":""},{"$f":"IF(DATOS!AG11=\"\",\"\",DATOS!AG11)","v":""},{"$f":"IF(DATOS!V11=\"\",\"\",DATOS!V11)","v":""}]
[{"$f":"IF(DATOS!R12=\"\",\"\",DATOS!R12)","v":""},{"$f":"IF(DATOS!AG12=\"\",\"\",DATOS!AG12)","v":""},{"$f":"IF(DATOS!V12=\"\",\"\",DATOS!V12)","v":""}]
[{"$f":"IF(DATOS!R13=\"\",\"\",DATOS!R13)","v":""},{"$f":"IF(DATOS!AG13=\"\",\"\",DATOS!AG13)","v":""},{"$f":"IF(DATOS!V13=\"\",\"\",DATOS!V13)","v":""}]
{"$rows_left_out":292}
{"sheet":"AGD_MUESTREOS","index":7,"n_rows":0,"n_cols":0,"rows_kept":0,"cut":false,"hidden":true,"merged":[]}

{"sheet":"AGD_PARAMETRO","index":8,"n_rows":0,"n_cols":0,"rows_kept":0,"cut":false,"hidden":true,"merged":[]}

{"sheet":"AGD_MUESTRAS","index":9,"n_rows":0,"n_cols":0,"rows_kept":0,"cut":false,"hidden":true,"merged":[]}

{"sheet":"AGD_MUESTRAS_VARIABLES","index":10,"n_rows":0,"n_cols":0,"rows_kept":0,"cut":false,"hidden":true,"merged":[]}

{"sheet":"AGD_AUTORIAS","index":11,"n_rows":0,"n_cols":0,"rows_kept":0,"cut":false,"hidden":true,"merged":[]}