{"text_format":"1","workbook":"xlsx","n_sheets":12,"sheets":["Registro de cambios","configuracion","DIGITADOR","DATOS","REFERENTES","OTRAS REFERENCIAS","Resumen","AGD_MUESTREOS","AGD_PARAMETRO","AGD_MUESTRAS","AGD_MUESTRAS_VARIABLES","AGD_AUTORIAS"],"not_rendered":{"charts":0,"images":0,"macros":1,"external_links":1,"defined_names":29,"comments":1,"pivot_tables":1},"unopened":[],"bounds":{"document_bytes":16777216,"sheet_cells":100000,"rows_first":2000,"rows_last":500,"rows_between":2000,"halvings":0,"cell_chars":16384,"cell_head_chars":4096},"cells_cut":0,"cells_raw":0,"read":"whole","date_system":"1900"}

{"sheet":"Registro de cambios","index":0,"n_rows":6,"n_cols":7,"rows_kept":6,"cut":false,"hidden":true,"merged":[[1,3,1,6]]}
[]
[null,null,null,"REGISTRO DE CAMBIOS"]
[null,null,null,"VERSIÓN No.","CAMBIO REALIZADO","AUTOR","VIGENTE DESDE"]
[null,null,null,"20240926i","Actualización del código de la macro.\n\nSe eliminó la URL de la antigua API de portete:\n       http://portete.invemar.org.co:7003/ArgosWebServices-RESTWebService-context-root/rest/1.0\n\nFue reemplazada por la URL de la API de ARGOS:\n       https://argos.invemar.org.co/api/\n\nLa API contiene End Points que permiten tener mayor control, facilitan la descarga de referentes (listas de usuarios, estaciones, especies, etc.) que corresponden a criterios específicos como el proyecto usado en la plantilla para evitar descargar data innecesaria.\n\nDel mismo modo, también permite la carga de información a la BDD del INVEMAR.\n\nLa macro toma los Endpoints desde la hoja configuracion de una tabla llamada \"Configuración referentes\", a la que se le puede modificar las rutas de la API o agregar nuevas. cabe resaltar que se puede \"quemar\" directamente en la macro los Endpoints que lo requieran.","Juan Palomino","26/09/2024"]
[null,null,null,"20200130i","Para trazabilididad la hoja se incluye el nombre del archivo fuente y la posibilidad de anotar el DOI principal del metadato\nPor usabilidad las pestañas que son de interes para el usuario son las verdes\nSi se define mas de un proyecto los referentes de estaciones e investigadores se descargan consecutivo en las mismas columnas\nSe controla la versión para la plantilla mediante comparación dato en AGLOV de la BD.",null,"2020-01-30"]
[null,null,null,"20180413m","Se modifica la generación de los ID de muestreo y se agrega macro que genera número aleatorio en la hoja DIGITADOR.",null,"2018-04-13"]

{"sheet":"configuracion","index":1,"n_rows":71,"n_cols":8,"rows_kept":71,"cut":false,"hidden":true,"merged":[[61,0,61,2],[28,0,35,0],[37,0,42,0],[45,0,45,1],[0,0,2,0],[3,0,5,0],[7,0,8,0],[9,0,15,0],[17,0,21,0],[23,0,26,0]]}
["general","urlServicio","https://argos.invemar.org.co/api/"]
[null,"fila de inicio",5]
[null,"fila de fin",305]
["metodologias","Metodologias",28]
[null,"Referentes",350]
[null,"Cantidad maxima de referentes ",350]
["estaciones/investigadores","proyectos",{"$f":"DIGITADOR!B9","v":1480}]
["Lista especies","metodologias",28]
[null,"proyectos",{"$f":"DIGITADOR!B9","v":1480}]
["MUESTREOS","ID_MUESTREO","DATOS,D"]
[null,"ID_ESTACION","DATOS,S"]
[null,"ID_PROYECTO",1480]
[null,"ID_METODOLOGIA",28]
[null,"ID_TEMATICAS",208]
[null,"FECHA","DIGITADOR,B,7"]
[null,"NOTAS","DIGITADOR,B,17"]
[null,"cantidad",305]
["parametro muestreo","ID_MUESTREO","DATOS,D","DATOS,D","DATOS,D"]
[null,"ID_PARAMETRO",1055,1169,1170]
[null,"ID_METODOLOGIA",28,28,28]
[null,"ID_UNIDAD_MEDIDA",100,100,100]
[null,"VALOR","DIGITADOR,B,5","DIGITADOR,B,12","DIGITADOR,B,11"]
[null,"cantidad",305,305,305]
["muestra","ID_MUESTRA","DATOS,P"]
[null,"ID_MUESTREO","DATOS,D"]
[null,"NOTAS","DATOS,N"]
[null,"ES_REPLICA",1]
[null,"cantidad",350]
["muestra variable","ID_PARAMETRO",585,823,827,828,849,854]
[null,"ID_METODOLOGIA",28,28,28,28,28,28]
[null,"ID_UNIDAD_MEDIDA",100,19,100,100,100,11]
[null,"ID_MUESTRA","DATOS,P","DATOS,P","DATOS,P","DATOS,P","DATOS,P","DATOS,P"]
[null,"ID_METODO",732,732,null,null,732]
[null,"VALOR","DATOS,AB","DATOS,AG","DATOS,W","DATOS,M","DATOS,Z","DATOS,Y"]
[null,"QUALITY_FLAG"]
[null,"PRECISION"]
[null,"cantidad",305,305,305,305,305,305]
["autoria","ID_FUNCIONARIO","DIGITADOR,B,2","DATOS,K"]
[null,"ID_TAREA",5,4]
[null,"ORDEN",1,2]
[null,"FECHA","DIGITADOR,B,7","DATOS,G"]
[null,"ID_MUESTREO","DATOS,D","DATOS,D"]
[null,"ENTIDAD","DIGITADOR,B,4","DATOS,M"]
[null,"cantidad",305,305]
[]
["REGISTROS GENERADOS",null,"REGISTROS CARGADOS",null,null,"ID_PARAMETRO","ID_UNIDAD_MEDIDA","NOMBRE_COLUMNA"]
["MUESTREOS",null,null,null,null,585,100,"ESPECIE"]
["parametro muestreo",null,null,null,null,823,19,"VALOR"]
["muestra",null,null,null,null,827,100,"UBICACION_ESPECIFICA"]
["muestra variable",null,null,null,null,828,100,"ENTIDAD"]
["autoria",null,null,null,null,849,100,"CAT_VIDA"]
["registros correctos",null,null,null,null,854,11,"POSICION"]
["Fecha de carga",null,null,null,null,1055,100,"VERSION_PLANTILLA"]
["json error",null,null,null,null,1169,100,"URL_METADATO"]
["error",null,null,null,null,1170,100,"ARCHIVO_FUENTE"]
[]
[]
["Atributo","Descripción","Código"]
["Tipo Nodo","Estaciones",{"$f":"VLOOKUP(B59,'OTRAS REFERENCIAS'!$A$29:$C$39,2,FALSE)","v":40}]
[]
[]
["CONFIGURACION REFERENTES"]
["Ruta de la API","Endpoint","Descripción"]
["URL - AGM Campo",{"$f":"CONCATENATE(\"parametros/agmcampo/\",$C$4,\"\")","v":"parametros/agmcampo/28"},"Listado de referentes AGM_CAMPO."]
["URL - Especies",{"$f":"IF($C$8=\"\",\"\",CONCATENATE(\"especies/filt/\",$C$9,\",\",$C$8,\"/\"))","v":"especies/filt/1480,28/"},"Especies por proyecto\n(No todos los proyectos tienen asociados una lista de especies)"]
["URL - Estaciones",{"$f":"CONCATENATE(\"estaciones/\", $C$59, \"/\",$C$9,\"\")","v":"estaciones/40/1480"},"Estaciones/parcelas por proyecto, cambia dependiendo del Tipo de Nodo, cuyo estado sea VIGENTE."]
["URL - Usuarios",{"$f":"CONCATENATE(\"parametros/usersByProject/\",$C$7,\"\")","v":"parametros/usersByProject/1480"},"Usuarios por proyecto."]
["URL - Entidades","estaciones/get-entidades","Listado de entidades."]
["Atributos de la API","codigo_in","nombre_in"]
["Rango de atributos de la API","B70:C71","nombre_in"]
["URL - Plantillas","plantillas/","Endpoint para la carga de datos al sistema."]

{"sheet":"DIGITADOR","index":2,"n_rows":27,"n_cols":4,"rows_kept":27,"cut":false,"hidden":false,"merged":[[26,1,26,2],[24,1,24,2],[11,3,13,9],[5,0,6,0],[0,0,0,1],[0,3,5,9],[6,3,8,9],[9,3,10,9],[25,1,25,2],[15,0,15,1]]}
["Plantilla para la Recolección de\nDatos Gorgonáceos",null,null,"Recomendaciones generales: \n¡Precaución! No inserte Filas o Columnas.\nEn los casos en que falte un valor a ingresar que provenga de la hoja de referencias, informe para que el administrador del sistema haga las adiciones necesarias.\nEsta es una plantilla programada. Las columnas de color oscuro se llenan automaticamente, principalmente a partir de los contenidos de la hoja de referencias. \nNO UTILICE PUNTO Y COMA (;) en ningun campo, por ser el separador de variables (columnas). Tampoco escriba las unidades de medida, no son necesarias.\nPara el correcto funcionamiento de la hoja debe estar activa la opcion de Excel de ejecutar macros (al abrir la hoja acepte la opcion habilitar macros, mensaje de Excel que aparece en la parte superior de la hoja en un recuadro amarillo). La extensión del archivo debe ser .xlsm\nSe recomienda renombrar el archivo de la siguiente manera: SIMAC_Gorgonaceos_NombreEstacion_FechaMonitoreo.xlsm"]
["Código Digitador",{"$f":"IF(B3=\"\",\"\",INDEX(REFERENTES!V:W,MATCH(B3,REFERENTES!W:W,0),1))","v":""}]
["Nombre del responsable"]
["Entidad"]
["Versión de la plantilla",{"$f":"'Registro de cambios'!D4","v":"20240926i"}]
["Fecha en la que ingresa los datos en esta hoja","DD/MM/AAAA"]
[null,"3000-12-12",null,"Previamente a iniciar el llenado de la plantilla, debe presionar el botón \"Descargar referentes\" para que los referentes de ésta plantilla sean actualizados. \nLuego de llenar completamente la plantilla, haga clic sobre el botón \"Generar tablas\" para que los datos sean organizados antes de cargarlos al Sistema de Información.\nAntes de presionar el botón \"Generar tablas\" verifique que:\na. No haya celdas con valores como \"#N/A\" o \"#¡REF!\"\nb. No se esten aplicando filtros en la hoja de datos \nPara finalizar, presione el botón \"Cargar datos\"."]
[]
["Código Monitoreo",1480]
["Proyecto Principal","Sistema de Monitoreo de los Arrecifes Coralinos en Colombia",null,"Si requiere ayuda contacte a:\nKevin S. Moreno (kevin.moreno@invemar.org.co)  - Apoyo técnico software"]
["Nombre del Archivo",{"$f":"MID(CELL(\"FILENAME\",N50),FIND(\"[\",CELL(\"FILENAME\",N50))+1,   FIND(\"]\",CELL(\"FILENAME\",N50))-FIND(\"[\",CELL(\"FILENAME\",N50))-1)","v":"SIMAC_Gorgonaceos_20240926i.xlsm"}]
["DOI Metadato",null,null,"El custodio de los datos es el único autorizado para distribuir este conjunto de datos. El observador y el digitador se comprometen a tomar las medidas necesarias para salvaguardar este conjunto de datos de modo que copia de los mismos no sean obtenidas y/o usadas por terceros no relacionados con el propósito para la cual se recolectó."]
["Fuente Plantilla","http://cinto.invemar.org.co/download/Plantillas_ARGOS_Plus/"]
[]
[]
["ATRIBUTOS ADICIONALES"]
["Observaciones generales"]
[]
[null,"REGISTROS GENERADOS","REGISTROS CARGADOS"]
["Muestreos",{"$f":"IF(configuracion!B47=\"\",\"\",configuracion!B47)","v":""},{"$f":"IF(configuracion!C47=\"\",\"\",configuracion!C47)","v":""}]
["Parámetros del muestreo",{"$f":"IF(configuracion!B48=\"\",\"\",configuracion!B48)","v":""},{"$f":"IF(configuracion!C48=\"\",\"\",configuracion!C48)","v":""}]
["Muestras",{"$f":"IF(configuracion!B49=\"\",\"\",configuracion!B49)","v":""},{"$f":"IF(configuracion!C49=\"\",\"\",configuracion!C49)","v":""}]
["Variables",{"$f":"IF(configuracion!B50=\"\",\"\",configuracion!B50)","v":""},{"$f":"IF(configuracion!C50=\"\",\"\",configuracion!C50)","v":""}]
["Autores",{"$f":"IF(configuracion!B51=\"\",\"\",configuracion!B51)","v":""},{"$f":"IF(configuracion!C51=\"\",\"\",configuracion!C51)","v":""}]
["Registros correctos",{"$f":"IF(D35=\"\",\"\",IF(D35=0,0,IF(C35-D35=0,D35,\"Fallaron \"&C35-D35&\" registros\")))","v":""}]
["json error",{"$f":"IF(configuracion!B54=\"\",\"\",configuracion!B54)","v":""}]
["error",{"$f":"IF(configuracion!B55=\"\",\"\",configuracion!B55)","v":""}]

{"sheet":"DATOS","index":3,"n_rows":304,"n_cols":33,"rows_kept":304,"cut":false,"hidden":false,"merged":[[1,24,1,31],[1,14,1,18],[1,2,3,2],[0,3,1,6],[1,9,1,10],[1,19,1,22]]}
[{"$f":"DIGITADOR!B7+F5","v":"3000-12-12"},null,null,"Fecha"]
[{"$f":"TEXT(A1,\"yyyymmdd\")","v":"30001212"},null,"CODIGO",null,null,null,null,null,null,null,null,null,null,null,null,null,null,null,null,null,null,null,null,null,null,null,null,null,null,null,null,null,"NÚMERO DE INDIVIDUOS"]
[null,null,null,null,null,null,"DATE","MES","TEMPO",null,null,"UNIKE_KEY",null,null,null,null,null,null,null,null,null,null,null,null,null,null,null,null,null,null,null,null,"N"]
[null,null,null,"CODMUESTREO","FECHA","HORA","DATE","MES","TEMPORADA","DATOS TOMADOS POR","COD\nINVESTIGADOR","UNIKE KEY","ENTIDAD","OBSERVACIONES","CONSECUTIVO","ID\nMUESTRA","ID_MUESTREO (AGD_MUESTREO)","ESTACION","ID ESTACION","PROFUNDIDAD","COD","TRANSECTO","UBICACION","REPLICA","POSICION\n(m)","CAT VIDA","DESCRIPCIÓN\nCAT VIDA","COD\nESPECIE MAYÚSCULA",null,"ESPECIE","DESCRIPCIÓN\nESPECIE","COD\nSIBM","VALOR"]
[null,null,{"$f":"IF(L5=L4,C4,C4+1)","v":1},{"$f":"IF(Q5=\"\",\"\",IF(COUNTIF($Q5:Q5, Q5)>1, \"\", Q5))","v":""},null,null,{"$f":"IF(E5=\"\",\"\",E5+F5)","v":""},{"$f":"IF(G5<>\"\",MONTH(G5),\"\")","v":""},{"$f":"IF(D5=\"\",\"\",1)","v":""},null,{"$f":"IF(J5=\"\",\"\",INDEX(REFERENTES!$V:$W,MATCH(J5,REFERENTES!$W:$W,0),1))","v":""},{"$f":"IF(G5=\"\",\"\",CONCATENATE(G5,S5,K5,X5))","v":""},null,null,1,{"$f":"IF(Q5=\"\",\"\",CONCATENATE(Q5,ROW()-2))","v":""},{"$f":"IF(E5<>\"\",CONCATENATE($A$2,DIGITADOR!$B$2,DIGITADOR!$M$1,C5),\"\")","v":""},null,{"$f":"IF(R5=\"\",\"\",INDEX('OTRAS REFERENCIAS'!$L$5:$M$152,MATCH(R5,'OTRAS REFERENCIAS'!$L$5:$L$157,0),2))","v":""},null,{"$f":"IF(T5=\"\",\"\",VLOOKUP(T5,'OTRAS REFERENCIAS'!$A$7:$B$9,2,FALSE))","v":""},null,{"$f":"CONCATENATE(T5,V5)","v":""},null,null,null,{"$f":"IF(Z5=\"\",\"\",INDEX(REFERENTES!$A:$B,MATCH(Z5,REFERENTES!$B:$B,0),1))","v":""},{"$f":"UPPER(AD5)","v":""},null,null,{"$f":"IF(AD5=\"\",\"\",INDEX(REFERENTES!$D:$E,MATCH(AD5,REFERENTES!$E:$E,0),1))","v":""},{"$f":"IF(AD5=\"\",\"\",INDEX(REFERENTES!$D:$L,MATCH(AD5,REFERENTES!$E:$E,0),6))","v":""}]
[null,null,1,{"$f":"IF(Q6=\"\",\"\",IF(COUNTIF($Q6:Q6, Q6)>1, \"\", Q6))","v":""},null,null,{"$f":"IF(E6=\"\",\"\",E6+F6)","v":""},"",{"$f":"IF(D6=\"\",\"\",1)","v":""},null,{"$f":"IF(J6=\"\",\"\",INDEX(REFERENTES!$V:$W,MATCH(J6,REFERENTES!$W:$W,0),1))","v":""},"",null,null,1,{"$f":"IF(Q6=\"\",\"\",CONCATENATE(Q6,ROW()-2))","v":""},{"$f":"IF(E6<>\"\",CONCATENATE($A$2,DIGITADOR!$B$2,DIGITADOR!$M$1,C6),\"\")","v":""},null,{"$f":"IF(R6=\"\",\"\",INDEX('OTRAS REFERENCIAS'!$L$5:$M$152,MATCH(R6,'OTRAS REFERENCIAS'!$L$5:$L$157,0),2))","v":""},null,{"$f":"IF(T6=\"\",\"\",VLOOKUP(T6,'OTRAS REFERENCIAS'!$A$7:$B$9,2,FALSE))","v":""},null,{"$f":"CONCATENATE(T6,V6)","v":""},null,null,null,{"$f":"IF(Z6=\"\",\"\",INDEX(REFERENTES!$A:$B,MATCH(Z6,REFERENTES!$B:$B,0),1))","v":""},{"$f":"UPPER(AD6)","v":""},null,null,{"$f":"IF(AD6=\"\",\"\",INDEX(REFERENTES!$D:$E,MATCH(AD6,REFERENTES!$E:$E,0),1))","v":""},{"$f":"IF(AD6=\"\",\"\",INDEX(REFERENTES!$D:$L,MATCH(AD6,REFERENTES!$E:$E,0),6))","v":""}]
[null,null,1,{"$f":"IF(Q7=\"\",\"\",IF(COUNTIF($Q7:Q7, Q7)>1, \"\", Q7))","v":""},null,null,"","","",null,{"$f":"IF(J7=\"\",\"\",INDEX(REFERENTES!$V:$W,MATCH(J7,REFERENTES!$W:$W,0),1))","v":""},"",null,null,3,"",{"$f":"IF(E7<>\"\",CONCATENATE($A$2,DIGITADOR!$B$2,DIGITADOR!$M$1,C7),\"\")","v":""},null,{"$f":"IF(R7=\"\",\"\",INDEX('OTRAS REFERENCIAS'!$L$5:$M$152,MATCH(R7,'OTRAS REFERENCIAS'!$L$5:$L$157,0),2))","v":""},null,{"$f":"IF(T7=\"\",\"\",VLOOKUP(T7,'OTRAS REFERENCIAS'!$A$7:$B$9,2,FALSE))","v":""},null,"",null,null,null,{"$f":"IF(Z7=\"\",\"\",INDEX(REFERENTES!$A:$B,MATCH(Z7,REFERENTES!$B:$B,0),1))","v":""},"",null,null,{"$f":"IF(AD7=\"\",\"\",INDEX(REFERENTES!$D:$E,MATCH(AD7,REFERENTES!$E:$E,0),1))","v":""},{"$f":"IF(AD7=\"\",\"\",INDEX(REFERENTES!$D:$L,MATCH(AD7,REFERENTES!$E:$E,0),6))","v":""}]
[null,null,1,{"$f":"IF(Q8=\"\",\"\",IF(COUNTIF($Q8:Q8, Q8)>1, \"\", Q8))","v":""},null,null,"","","",null,{"$f":"IF(J8=\"\",\"\",INDEX(REFERENTES!$V:$W,MATCH(J8,REFERENTES!$W:$W,0),1))","v":""},{"$f":"IF(G8=\"\",\"\",CONCATENATE(G8,S8,K8,X8))","v":""},null,null,4,"",{"$f":"IF(E8<>\"\",CONCATENATE($A$2,DIGITADOR!$B$2,DIGITADOR!$M$1,C8),\"\")","v":""},"",{"$f":"IF(R8=\"\",\"\",INDEX('OTRAS REFERENCIAS'!$L$5:$M$152,MATCH(R8,'OTRAS REFERENCIAS'!$L$5:$L$157,0),2))","v":""},null,{"$f":"IF(T8=\"\",\"\",VLOOKUP(T8,'OTRAS REFERENCIAS'!$A$7:$B$9,2,FALSE))","v":""},null,"",null,null,null,{"$f":"IF(Z8=\"\",\"\",INDEX(REFERENTES!$A:$B,MATCH(Z8,REFERENTES!$B:$B,0),1))","v":""},"",null,null,{"$f":"IF(AD8=\"\",\"\",INDEX(REFERENTES!$D:$E,MATCH(AD8,REFERENTES!$E:$E,0),1))","v":""},{"$f":"IF(AD8=\"\",\"\",INDEX(REFERENTES!$D:$L,MATCH(AD8,REFERENTES!$E:$E,0),6))","v":""}]
[null,null,1,{"$f":"IF(Q9=\"\",\"\",IF(COUNTIF($Q9:Q9, Q9)>1, \"\", Q9))","v":""},null,null,"","","",null,{"$f":"IF(J9=\"\",\"\",INDEX(REFERENTES!$V:$W,MATCH(J9,REFERENTES!$W:$W,0),1))","v":""},"",null,null,5,"",{"$f":"IF(E9<>\"\",CONCATENATE($A$2,DIGITADOR!$B$2,DIGITADOR!$M$1,C9),\"\")","v":""},"",{"$f":"IF(R9=\"\",\"\",INDEX('OTRAS REFERENCIAS'!$L$5:$M$152,MATCH(R9,'OTRAS REFERENCIAS'!$L$5:$L$157,0),2))","v":""},null,{"$f":"IF(T9=\"\",\"\",VLOOKUP(T9,'OTRAS REFERENCIAS'!$A$7:$B$9,2,FALSE))","v":""},null,"",null,null,null,{"$f":"IF(Z9=\"\",\"\",INDEX(REFERENTES!$A:$B,MATCH(Z9,REFERENTES!$B:$B,0),1))","v":""},"",null,null,{"$f":"IF(AD9=\"\",\"\",INDEX(REFERENTES!$D:$E,MATCH(AD9,REFERENTES!$E:$E,0),1))","v":""},{"$f":"IF(AD9=\"\",\"\",INDEX(REFERENTES!$D:$L,MATCH(AD9,REFERENTES!$E:$E,0),6))","v":""}]
[null,null,1,{"$f":"IF(Q10=\"\",\"\",IF(COUNTIF($Q10:Q10, Q10)>1, \"\", Q10))","v":""},null,null,"","","",null,{"$f":"IF(J10=\"\",\"\",INDEX(REFERENTES!$V:$W,MATCH(J10,REFERENTES!$W:$W,0),1))","v":""},"",null,null,6,"",{"$f":"IF(E10<>\"\",CONCATENATE($A$2,DIGITADOR!$B$2,DIGITADOR!$M$1,C10),\"\")","v":""},null,{"$f":"IF(R10=\"\",\"\",INDEX('OTRAS REFERENCIAS'!$L$5:$M$152,MATCH(R10,'OTRAS REFERENCIAS'!$L$5:$L$157,0),2))","v":""},null,{"$f":"IF(T10=\"\",\"\",VLOOKUP(T10,'OTRAS REFERENCIAS'!$A$7:$B$9,2,FALSE))","v":""},null,"",null,null,null,{"$f":"IF(Z10=\"\",\"\",INDEX(REFERENTES!$A:$B,MATCH(Z10,REFERENTES!$B:$B,0),1))","v":""},"",null,null,{"$f":"IF(AD10=\"\",\"\",INDEX(REFERENTES!$D:$E,MATCH(AD10,REFERENTES!$E:$E,0),1))","v":""},{"$f":"IF(AD10=\"\",\"\",INDEX(REFERENTES!$D:$L,MATCH(AD10,REFERENTES!$E:$E,0),6))","v":""}]
[null,null,1,{"$f":"IF(Q11=\"\",\"\",IF(COUNTIF($Q11:Q11, Q11)>1, \"\", Q11))","v":""},null,null,"","","",null,{"$f":"IF(J11=\"\",\"\",INDEX(REFERENTES!$V:$W,MATCH(J11,REFERENTES!$W:$W,0),1))","v":""},"",null,null,7,"",{"$f":"IF(E11<>\"\",CONCATENATE($A$2,DIGITADOR!$B$2,DIGITADOR!$M$1,C11),\"\")","v":""},null,{"$f":"IF(R11=\"\",\"\",INDEX('OTRAS REFERENCIAS'!$L$5:$M$152,MATCH(R11,'OTRAS REFERENCIAS'!$L$5:$L$157,0),2))","v":""},null,{"$f":"IF(T11=\"\",\"\",VLOOKUP(T11,'OTRAS REFERENCIAS'!$A$7:$B$9,2,FALSE))","v":""},null,"",null,null,null,{"$f":"IF(Z11=\"\",\"\",INDEX(REFERENTES!$A:$B,MATCH(Z11,REFERENTES!$B:$B,0),1))","v":""},"",null,null,{"$f":"IF(AD11=\"\",\"\",INDEX(REFERENTES!$D:$E,MATCH(AD11,REFERENTES!$E:$E,0),1))","v":""},{"$f":"IF(AD11=\"\",\"\",INDEX(REFERENTES!$D:$L,MATCH(AD11,REFERENTES!$E:$E,0),6))","v":""}]
[null,null,1,{"$f":"IF(Q12=\"\",\"\",IF(COUNTIF($Q12:Q12, Q12)>1, \"\", Q12))","v":""},null,null,"","","",null,{"$f":"IF(J12=\"\",\"\",INDEX(REFERENTES!$V:$W,MATCH(J12,REFERENTES!$W:$W,0),1))","v":""},"",null,null,8,"",{"$f":"IF(E12<>\"\",CONCATENATE($A$2,DIGITADOR!$B$2,DIGITADOR!$M$1,C12),\"\")","v":""},null,{"$f":"IF(R12=\"\",\"\",INDEX('OTRAS REFERENCIAS'!$L$5:$M$152,MATCH(R12,'OTRAS REFERENCIAS'!$L$5:$L$157,0),2))","v":""},null,{"$f":"IF(T12=\"\",\"\",VLOOKUP(T12,'OTRAS REFERENCIAS'!$A$7:$B$9,2,FALSE))","v":""},null,"",null,null,null,{"$f":"IF(Z12=\"\",\"\",INDEX(REFERENTES!$A:$B,MATCH(Z12,REFERENTES!$B:$B,0),1))","v":""},"",null,null,{"$f":"IF(AD12=\"\",\"\",INDEX(REFERENTES!$D:$E,MATCH(AD12,REFERENTES!$E:$E,0),1))","v":""},{"$f":"IF(AD12=\"\",\"\",INDEX(REFERENTES!$D:$L,MATCH(AD12,REFERENTES!$E:$E,0),6))","v":""}]
[null,null,1,{"$f":"IF(Q13=\"\",\"\",IF(COUNTIF($Q13:Q13, Q13)>1, \"\", Q13))","v":""},null,null,"","","",null,{"$f":"IF(J13=\"\",\"\",INDEX(REFERENTES!$V:$W,MATCH(J13,REFERENTES!$W:$W,0),1))","v":""},"",null,null,9,"",{"$f":"IF(E13<>\"\",CONCATENATE($A$2,DIGITADOR!$B$2,DIGITADOR!$M$1,C13),\"\")","v":""},null,{"$f":"IF(R13=\"\",\"\",INDEX('OTRAS REFERENCIAS'!$L$5:$M$152,MATCH(R13,'OTRAS REFERENCIAS'!$L$5:$L$157,0),2))","v":""},null,{"$f":"IF(T13=\"\",\"\",VLOOKUP(T13,'OTRAS REFERENCIAS'!$A$7:$B$9,2,FALSE))","v":""},null,"",null,null,null,{"$f":"IF(Z13=\"\",\"\",INDEX(REFERENTES!$A:$B,MATCH(Z13,REFERENTES!$B:$B,0),1))","v":""},"",null,null,{"$f":"IF(AD13=\"\",\"\",INDEX(REFERENTES!$D:$E,MATCH(AD13,REFERENTES!$E:$E,0),1))","v":""},{"$f":"IF(AD13=\"\",\"\",INDEX(REFERENTES!$D:$L,MATCH(AD13,REFERENTES!$E:$E,0),6))","v":""}]
[null,null,1,{"$f":"IF(Q14=\"\",\"\",IF(COUNTIF($Q14:Q14, Q14)>1, \"\", Q14))","v":""},null,null,"","","",null,{"$f":"IF(J14=\"\",\"\",INDEX(REFERENTES!$V:$W,MATCH(J14,REFERENTES!$W:$W,0),1))","v":""},"",null,null,10,"",{"$f":"IF(E14<>\"\",CONCATENATE($A$2,DIGITADOR!$B$2,DIGITADOR!$M$1,C14),\"\")","v":""},null,{"$f":"IF(R14=\"\",\"\",INDEX('OTRAS REFERENCIAS'!$L$5:$M$152,MATCH(R14,'OTRAS REFERENCIAS'!$L$5:$L$157,0),2))","v":""},null,{"$f":"IF(T14=\"\",\"\",VLOOKUP(T14,'OTRAS REFERENCIAS'!$A$7:$B$9,2,FALSE))","v":""},null,"",null,null,null,{"$f":"IF(Z14=\"\",\"\",INDEX(REFERENTES!$A:$B,MATCH(Z14,REFERENTES!$B:$B,0),1))","v":""},"",null,null,{"$f":"IF(AD14=\"\",\"\",INDEX(REFERENTES!$D:$E,MATCH(AD14,REFERENTES!$E:$E,0),1))","v":""},{"$f":"IF(AD14=\"\",\"\",INDEX(REFERENTES!$D:$L,MATCH(AD14,REFERENTES!$E:$E,0),6))","v":""}]
[null,null,1,{"$f":"IF(Q15=\"\",\"\",IF(COUNTIF($Q15:Q15, Q15)>1, \"\", Q15))","v":""},null,null,"","","",null,{"$f":"IF(J15=\"\",\"\",INDEX(REFERENTES!$V:$W,MATCH(J15,REFERENTES!$W:$W,0),1))","v":""},"",null,null,11,"",{"$f":"IF(E15<>\"\",CONCATENATE($A$2,DIGITADOR!$B$2,DIGITADOR!$M$1,C15),\"\")","v":""},null,{"$f":"IF(R15=\"\",\"\",INDEX('OTRAS REFERENCIAS'!$L$5:$M$152,MATCH(R15,'OTRAS REFERENCIAS'!$L$5:$L$157,0),2))","v":""},null,{"$f":"IF(T15=\"\",\"\",VLOOKUP(T15,'OTRAS REFERENCIAS'!$A$7:$B$9,2,FALSE))","v":""},null,"",null,null,null,{"$f":"IF(Z15=\"\",\"\",INDEX(REFERENTES!$A:$B,MATCH(Z15,REFERENTES!$B:$B,0),1))","v":""},"",null,null,{"$f":"IF(AD15=\"\",\"\",INDEX(REFERENTES!$D:$E,MATCH(AD15,REFERENTES!$E:$E,0),1))","v":""},{"$f":"IF(AD15=\"\",\"\",INDEX(REFERENTES!$D:$L,MATCH(AD15,REFERENTES!$E:$E,0),6))","v":""}]
[null,null,1,{"$f":"IF(Q16=\"\",\"\",IF(COUNTIF($Q16:Q16, Q16)>1, \"\", Q16))","v":""},null,null,"","","",null,{"$f":"IF(J16=\"\",\"\",INDEX(REFERENTES!$V:$W,MATCH(J16,REFERENTES!$W:$W,0),1))","v":""},"",null,null,12,"",{"$f":"IF(E16<>\"\",CONCATENATE($A$2,DIGITADOR!$B$2,DIGITADOR!$M$1,C16),\"\")","v":""},null,{"$f":"IF(R16=\"\",\"\",INDEX('OTRAS REFERENCIAS'!$L$5:$M$152,MATCH(R16,'OTRAS REFERENCIAS'!$L$5:$L$157,0),2))","v":""},null,{"$f":"IF(T16=\"\",\"\",VLOOKUP(T16,'OTRAS REFERENCIAS'!$A$7:$B$9,2,FALSE))","v":""},null,"",null,null,null,{"$f":"IF(Z16=\"\",\"\",INDEX(REFERENTES!$A:$B,MATCH(Z16,REFERENTES!$B:$B,0),1))","v":""},"",null,null,{"$f":"IF(AD16=\"\",\"\",INDEX(REFERENTES!$D:$E,MATCH(AD16,REFERENTES!$E:$E,0),1))","v":""},{"$f":"IF(AD16=\"\",\"\",INDEX(REFERENTES!$D:$L,MATCH(AD16,REFERENTES!$E:$E,0),6))","v":""}]
[null,null,1,{"$f":"IF(Q17=\"\",\"\",IF(COUNTIF($Q17:Q17, Q17)>1, \"\", Q17))","v":""},null,null,"","","",null,{"$f":"IF(J17=\"\",\"\",INDEX(REFERENTES!$V:$W,MATCH(J17,REFERENTES!$W:$W,0),1))","v":""},"",null,null,13,"",{"$f":"IF(E17<>\"\",CONCATENATE($A$2,DIGITADOR!$B$2,DIGITADOR!$M$1,C17),\"\")","v":""},null,{"$f":"IF(R17=\"\",\"\",INDEX('OTRAS REFERENCIAS'!$L$5:$M$152,MATCH(R17,'OTRAS REFERENCIAS'!$L$5:$L$157,0),2))","v":""},null,{"$f":"IF(T17=\"\",\"\",VLOOKUP(T17,'OTRAS REFERENCIAS'!$A$7:$B$9,2,FALSE))","v":""},null,"",null,null,null,{"$f":"IF(Z17=\"\",\"\",INDEX(REFERENTES!$A:$B,MATCH(Z17,REFERENTES!$B:$B,0),1))","v":""},"",null,null,{"$f":"IF(AD17=\"\",\"\",INDEX(REFERENTES!$D:$E,MATCH(AD17,REFERENTES!$E:$E,0),1))","v":""},{"$f":"IF(AD17=\"\",\"\",INDEX(REFERENTES!$D:$L,MATCH(AD17,REFERENTES!$E:$E,0),6))","v":""}]
[null,null,1,{"$f":"IF(Q18=\"\",\"\",IF(COUNTIF($Q18:Q18, Q18)>1, \"\", Q18))","v":""},null,null,"","","",null,{"$f":"IF(J18=\"\",\"\",INDEX(REFERENTES!$V:$W,MATCH(J18,REFERENTES!$W:$W,0),1))","v":""},"",null,null,14,"",{"$f":"IF(E18<>\"\",CONCATENATE($A$2,DIGITADOR!$B$2,DIGITADOR!$M$1,C18),\"\")","v":""},null,{"$f":"IF(R18=\"\",\"\",INDEX('OTRAS REFERENCIAS'!$L$5:$M$152,MATCH(R18,'OTRAS REFERENCIAS'!$L$5:$L$157,0),2))","v":""},null,{"$f":"IF(T18=\"\",\"\",VLOOKUP(T18,'OTRAS REFERENCIAS'!$A$7:$B$9,2,FALSE))","v":""},null,"",null,null,null,{"$f":"IF(Z18=\"\",\"\",INDEX(REFERENTES!$A:$B,MATCH(Z18,REFERENTES!$B:$B,0),1))","v":""},"",null,null,{"$f":"IF(AD18=\"\",\"\",INDEX(REFERENTES!$D:$E,MATCH(AD18,REFERENTES!$E:$E,0),1))","v":""},{"$f":"IF(AD18=\"\",\"\",INDEX(REFERENTES!$D:$L,MATCH(AD18,REFERENTES!$E:$E,0),6))","v":""}]
[null,null,1,{"$f":"IF(Q19=\"\",\"\",IF(COUNTIF($Q19:Q19, Q19)>1, \"\", Q19))","v":""},null,null,"","","",null,{"$f":"IF(J19=\"\",\"\",INDEX(REFERENTES!$V:$W,MATCH(J19,REFERENTES!$W:$W,0),1))","v":""},"",null,null,15,"",{"$f":"IF(E19<>\"\",CONCATENATE($A$2,DIGITADOR!$B$2,DIGITADOR!$M$1,C19),\"\")","v":""},null,{"$f":"IF(R19=\"\",\"\",INDEX('OTRAS REFERENCIAS'!$L$5:$M$152,MATCH(R19,'OTRAS REFERENCIAS'!$L$5:$L$157,0),2))","v":""},null,{"$f":"IF(T19=\"\",\"\",VLOOKUP(T19,'OTRAS REFERENCIAS'!$A$7:$B$9,2,FALSE))","v":""},null,"",null,null,null,{"$f":"IF(Z19=\"\",\"\",INDEX(REFERENTES!$A:$B,MATCH(Z19,REFERENTES!$B:$B,0),1))","v":""},"",null,null,{"$f":"IF(AD19=\"\",\"\",INDEX(REFERENTES!$D:$E,MATCH(AD19,REFERENTES!$E:$E,0),1))","v":""},{"$f":"IF(AD19=\"\",\"\",INDEX(REFERENTES!$D:$L,MATCH(AD19,REFERENTES!$E:$E,0),6))","v":""}]
[null,null,1,{"$f":"IF(Q20=\"\",\"\",IF(COUNTIF($Q20:Q20, Q20)>1, \"\", Q20))","v":""},null,null,"","","",null,{"$f":"IF(J20=\"\",\"\",INDEX(REFERENTES!$V:$W,MATCH(J20,REFERENTES!$W:$W,0),1))","v":""},"",null,null,16,"",{"$f":"IF(E20<>\"\",CONCATENATE($A$2,DIGITADOR!$B$2,DIGITADOR!$M$1,C20),\"\")","v":""},null,{"$f":"IF(R20=\"\",\"\",INDEX('OTRAS REFERENCIAS'!$L$5:$M$152,MATCH(R20,'OTRAS REFERENCIAS'!$L$5:$L$157,0),2))","v":""},null,{"$f":"IF(T20=\"\",\"\",VLOOKUP(T20,'OTRAS REFERENCIAS'!$A$7:$B$9,2,FALSE))","v":""},null,"",null,null,null,{"$f":"IF(Z20=\"\",\"\",INDEX(REFERENTES!$A:$B,MATCH(Z20,REFERENTES!$B:$B,0),1))","v":""},"",null,null,{"$f":"IF(AD20=\"\",\"\",INDEX(REFERENTES!$D:$E,MATCH(AD20,REFERENTES!$E:$E,0),1))","v":""},{"$f":"IF(AD20=\"\",\"\",INDEX(REFERENTES!$D:$L,MATCH(AD20,REFERENTES!$E:$E,0),6))","v":""}]
[null,null,1,{"$f":"IF(Q21=\"\",\"\",IF(COUNTIF($Q21:Q21, Q21)>1, \"\", Q21))","v":""},null,null,"","","",null,{"$f":"IF(J21=\"\",\"\",INDEX(REFERENTES!$V:$W,MATCH(J21,REFERENTES!$W:$W,0),1))","v":""},"",null,null,17,"",{"$f":"IF(E21<>\"\",CONCATENATE($A$2,DIGITADOR!$B$2,DIGITADOR!$M$1,C21),\"\")","v":""},null,{"$f":"IF(R21=\"\",\"\",INDEX('OTRAS REFERENCIAS'!$L$5:$M$152,MATCH(R21,'OTRAS REFERENCIAS'!$L$5:$L$157,0),2))","v":""},null,{"$f":"IF(T21=\"\",\"\",VLOOKUP(T21,'OTRAS REFERENCIAS'!$A$7:$B$9,2,FALSE))","v":""},null,"",null,null,null,{"$f":"IF(Z21=\"\",\"\",INDEX(REFERENTES!$A:$B,MATCH(Z21,REFERENTES!$B:$B,0),1))","v":""},"",null,null,{"$f":"IF(AD21=\"\",\"\",INDEX(REFERENTES!$D:$E,MATCH(AD21,REFERENTES!$E:$E,0),1))","v":""},{"$f":"IF(AD21=\"\",\"\",INDEX(REFERENTES!$D:$L,MATCH(AD21,REFERENTES!$E:$E,0),6))","v":""}]
[null,null,1,{"$f":"IF(Q22=\"\",\"\",IF(COUNTIF($Q22:Q22, Q22)>1, \"\", Q22))","v":""},null,null,"","","",null,{"$f":"IF(J22=\"\",\"\",INDEX(REFERENTES!$V:$W,MATCH(J22,REFERENTES!$W:$W,0),1))","v":""},"",null,null,18,"",{"$f":"IF(E22<>\"\",CONCATENATE($A$2,DIGITADOR!$B$2,DIGITADOR!$M$1,C22),\"\")","v":""},null,{"$f":"IF(R22=\"\",\"\",INDEX('OTRAS REFERENCIAS'!$L$5:$M$152,MATCH(R22,'OTRAS REFERENCIAS'!$L$5:$L$157,0),2))","v":""},null,{"$f":"IF(T22=\"\",\"\",VLOOKUP(T22,'OTRAS REFERENCIAS'!$A$7:$B$9,2,FALSE))","v":""},null,"",null,null,null,{"$f":"IF(Z22=\"\",\"\",INDEX(REFERENTES!$A:$B,MATCH(Z22,REFERENTES!$B:$B,0),1))","v":""},"",null,null,{"$f":"IF(AD22=\"\",\"\",INDEX(REFERENTES!$D:$E,MATCH(AD22,REFERENTES!$E:$E,0),1))","v":""},{"$f":"IF(AD22=\"\",\"\",INDEX(REFERENTES!$D:$L,MATCH(AD22,REFERENTES!$E:$E,0),6))","v":""}]
[null,null,1,{"$f":"IF(Q23=\"\",\"\",IF(COUNTIF($Q23:Q23, Q23)>1, \"\", Q23))","v":""},null,null,"","","",null,{"$f":"IF(J23=\"\",\"\",INDEX(REFERENTES!$V:$W,MATCH(J23,REFERENTES!$W:$W,0),1))","v":""},"",null,null,19,"",{"$f":"IF(E23<>\"\",CONCATENATE($A$2,DIGITADOR!$B$2,DIGITADOR!$M$1,C23),\"\")","v":""},null,{"$f":"IF(R23=\"\",\"\",INDEX('OTRAS REFERENCIAS'!$L$5:$M$152,MATCH(R23,'OTRAS REFERENCIAS'!$L$5:$L$157,0),2))","v":""},null,{"$f":"IF(T23=\"\",\"\",VLOOKUP(T23,'OTRAS REFERENCIAS'!$A$7:$B$9,2,FALSE))","v":""},null,"",null,null,null,{"$f":"IF(Z23=\"\",\"\",INDEX(REFERENTES!$A:$B,MATCH(Z23,REFERENTES!$B:$B,0),1))","v":""},"",null,null,{"$f":"IF(AD23=\"\",\"\",INDEX(REFERENTES!$D:$E,MATCH(AD23,REFERENTES!$E:$E,0),1))","v":""},{"$f":"IF(AD23=\"\",\"\",INDEX(REFERENTES!$D:$L,MATCH(AD23,REFERENTES!$E:$E,0),6))","v":""}]
[null,null,1,{"$f":"IF(Q24=\"\",\"\",IF(COUNTIF($Q24:Q24, Q24)>1, \"\", Q24))","v":""},null,null,"","","",null,{"$f":"IF(J24=\"\",\"\",INDEX(REFERENTES!$V:$W,MATCH(J24,REFERENTES!$W:$W,0),1))","v":""},"",null,null,20,"",{"$f":"IF(E24<>\"\",CONCATENATE($A$2,DIGITADOR!$B$2,DIGITADOR!$M$1,C24),\"\")","v":""},null,{"$f":"IF(R24=\"\",\"\",INDEX('OTRAS REFERENCIAS'!$L$5:$M$152,MATCH(R24,'OTRAS REFERENCIAS'!$L$5:$L$157,0),2))","v":""},null,{"$f":"IF(T24=\"\",\"\",VLOOKUP(T24,'OTRAS REFERENCIAS'!$A$7:$B$9,2,FALSE))","v":""},null,"",null,null,null,{"$f":"IF(Z24=\"\",\"\",INDEX(REFERENTES!$A:$B,MATCH(Z24,REFERENTES!$B:$B,0),1))","v":""},"",null,null,{"$f":"IF(AD24=\"\",\"\",INDEX(REFERENTES!$D:$E,MATCH(AD24,REFERENTES!$E:$E,0),1))","v":""},{"$f":"IF(AD24=\"\",\"\",INDEX(REFERENTES!$D:$L,MATCH(AD24,REFERENTES!$E:$E,0),6))","v":""}]
[null,null,1,{"$f":"IF(Q25=\"\",\"\",IF(COUNTIF($Q25:Q25, Q25)>1, \"\", Q25))","v":""},null,null,"","","",null,{"$f":"IF(J25=\"\",\"\",INDEX(REFERENTES!$V:$W,MATCH(J25,REFERENTES!$W:$W,0),1))","v":""},"",null,null,21,"",{"$f":"IF(E25<>\"\",CONCATENATE($A$2,DIGITADOR!$B$2,DIGITADOR!$M$1,C25),\"\")","v":""},null,{"$f":"IF(R25=\"\",\"\",INDEX('OTRAS REFERENCIAS'!$L$5:$M$152,MATCH(R25,'OTRAS REFERENCIAS'!$L$5:$L$157,0),2))","v":""},null,{"$f":"IF(T25=\"\",\"\",VLOOKUP(T25,'OTRAS REFERENCIAS'!$A$7:$B$9,2,FALSE))","v":""},null,"",null,null,null,{"$f":"IF(Z25=\"\",\"\",INDEX(REFERENTES!$A:$B,MATCH(Z25,REFERENTES!$B:$B,0),1))","v":""},"",null,null,{"$f":"IF(AD25=\"\",\"\",INDEX(REFERENTES!$D:$E,MATCH(AD25,REFERENTES!$E:$E,0),1))","v":""},{"$f":"IF(AD25=\"\",\"\",INDEX(REFERENTES!$D:$L,MATCH(AD25,REFERENTES!$E:$E,0),6))","v":""}]
[null,null,1,{"$f":"IF(Q26=\"\",\"\",IF(COUNTIF($Q26:Q26, Q26)>1, \"\", Q26))","v":""},null,null,"","","",null,{"$f":"IF(J26=\"\",\"\",INDEX(REFERENTES!$V:$W,MATCH(J26,REFERENTES!$W:$W,0),1))","v":""},"",null,null,21,"",{"$f":"IF(E26<>\"\",CONCATENATE($A$2,DIGITADOR!$B$2,DIGITADOR!$M$1,C26),\"\")","v":""},null,{"$f":"IF(R26=\"\",\"\",INDEX('OTRAS REFERENCIAS'!$L$5:$M$152,MATCH(R26,'OTRAS REFERENCIAS'!$L$5:$L$157,0),2))","v":""},null,{"$f":"IF(T26=\"\",\"\",VLOOKUP(T26,'OTRAS REFERENCIAS'!$A$7:$B$9,2,FALSE))","v":""},null,"",null,null,null,{"$f":"IF(Z26=\"\",\"\",INDEX(REFERENTES!$A:$B,MATCH(Z26,REFERENTES!$B:$B,0),1))","v":""},"",null,null,{"$f":"IF(AD26=\"\",\"\",INDEX(REFERENTES!$D:$E,MATCH(AD26,REFERENTES!$E:$E,0),1))","v":""},{"$f":"IF(AD26=\"\",\"\",INDEX(REFERENTES!$D:$L,MATCH(AD26,REFERENTES!$E:$E,0),6))","v":""}]
[null,null,1,{"$f":"IF(Q27=\"\",\"\",IF(COUNTIF($Q27:Q27, Q27)>1, \"\", Q27))","v":""},null,null,"","","",null,{"$f":"IF(J27=\"\",\"\",INDEX(REFERENTES!$V:$W,MATCH(J27,REFERENTES!$W:$W,0),1))","v":""},"",null,null,21,"",{"$f":"IF(E27<>\"\",CONCATENATE($A$2,DIGITADOR!$B$2,DIGITADOR!$M$1,C27),\"\")","v":""},null,{"$f":"IF(R27=\"\",\"\",INDEX('OTRAS REFERENCIAS'!$L$5:$M$152,MATCH(R27,'OTRAS REFERENCIAS'!$L$5:$L$157,0),2))","v":""},null,{"$f":"IF(T27=\"\",\"\",VLOOKUP(T27,'OTRAS REFERENCIAS'!$A$7:$B$9,2,FALSE))","v":""},null,"",null,null,null,{"$f":"IF(Z27=\"\",\"\",INDEX(REFERENTES!$A:$B,MATCH(Z27,REFERENTES!$B:$B,0),1))","v":""},"",null,null,{"$f":"IF(AD27=\"\",\"\",INDEX(REFERENTES!$D:$E,MATCH(AD27,REFERENTES!$E:$E,0),1))","v":""},{"$f":"IF(AD27=\"\",\"\",INDEX(REFERENTES!$D:$L,MATCH(AD27,REFERENTES!$E:$E,0),6))","v":""}]
[null,null,1,{"$f":"IF(Q28=\"\",\"\",IF(COUNTIF($Q28:Q28, Q28)>1, \"\", Q28))","v":""},null,null,"","","",null,{"$f":"IF(J28=\"\",\"\",INDEX(REFERENTES!$V:$W,MATCH(J28,REFERENTES!$W:$W,0),1))","v":""},"",null,null,21,"",{"$f":"IF(E28<>\"\",CONCATENATE($A$2,DIGITADOR!$B$2,DIGITADOR!$M$1,C28),\"\")","v":""},null,{"$f":"IF(R28=\"\",\"\",INDEX('OTRAS REFERENCIAS'!$L$5:$M$152,MATCH(R28,'OTRAS REFERENCIAS'!$L$5:$L$157,0),2))","v":""},null,{"$f":"IF(T28=\"\",\"\",VLOOKUP(T28,'OTRAS REFERENCIAS'!$A$7:$B$9,2,FALSE))","v":""},null,"",null,null,null,{"$f":"IF(Z28=\"\",\"\",INDEX(REFERENTES!$A:$B,MATCH(Z28,REFERENTES!$B:$B,0),1))","v":""},"",null,null,{"$f":"IF(AD28=\"\",\"\",INDEX(REFERENTES!$D:$E,MATCH(AD28,REFERENTES!$E:$E,0),1))","v":""},{"$f":"IF(AD28=\"\",\"\",INDEX(REFERENTES!$D:$L,MATCH(AD28,REFERENTES!$E:$E,0),6))","v":""}]
[null,null,1,{"$f":"IF(Q29=\"\",\"\",IF(COUNTIF($Q29:Q29, Q29)>1, \"\", Q29))","v":""},null,null,"","","",null,{"$f":"IF(J29=\"\",\"\",INDEX(REFERENTES!$V:$W,MATCH(J29,REFERENTES!$W:$W,0),1))","v":""},"",null,null,21,"",{"$f":"IF(E29<>\"\",CONCATENATE($A$2,DIGITADOR!$B$2,DIGITADOR!$M$1,C29),\"\")","v":""},null,{"$f":"IF(R29=\"\",\"\",INDEX('OTRAS REFERENCIAS'!$L$5:$M$152,MATCH(R29,'OTRAS REFERENCIAS'!$L$5:$L$157,0),2))","v":""},null,{"$f":"IF(T29=\"\",\"\",VLOOKUP(T29,'OTRAS REFERENCIAS'!$A$7:$B$9,2,FALSE))","v":""},null,"",null,null,null,{"$f":"IF(Z29=\"\",\"\",INDEX(REFERENTES!$A:$B,MATCH(Z29,REFERENTES!$B:$B,0),1))","v":""},"",null,null,{"$f":"IF(AD29=\"\",\"\",INDEX(REFERENTES!$D:$E,MATCH(AD29,REFERENTES!$E:$E,0),1))","v":""},{"$f":"IF(AD29=\"\",\"\",INDEX(REFERENTES!$D:$L,MATCH(AD29,REFERENTES!$E:$E,0),6))","v":""}]
[null,null,1,{"$f":"IF(Q30=\"\",\"\",IF(COUNTIF($Q30:Q30, Q30)>1, \"\", Q30))","v":""},null,null,"","","",null,{"$f":"IF(J30=\"\",\"\",INDEX(REFERENTES!$V:$W,MATCH(J30,REFERENTES!$W:$W,0),1))","v":""},"",null,null,26,"",{"$f":"IF(E30<>\"\",CONCATENATE($A$2,DIGITADOR!$B$2,DIGITADOR!$M$1,C30),\"\")","v":""},null,{"$f":"IF(R30=\"\",\"\",INDEX('OTRAS REFERENCIAS'!$L$5:$M$152,MATCH(R30,'OTRAS REFERENCIAS'!$L$5:$L$157,0),2))","v":""},null,{"$f":"IF(T30=\"\",\"\",VLOOKUP(T30,'OTRAS REFERENCIAS'!$A$7:$B$9,2,FALSE))","v":""},null,"",null,null,null,{"$f":"IF(Z30=\"\",\"\",INDEX(REFERENTES!$A:$B,MATCH(Z30,REFERENTES!$B:$B,0),1))","v":""},"",null,null,{"$f":"IF(AD30=\"\",\"\",INDEX(REFERENTES!$D:$E,MATCH(AD30,REFERENTES!$E:$E,0),1))","v":""},{"$f":"IF(AD30=\"\",\"\",INDEX(REFERENTES!$D:$L,MATCH(AD30,REFERENTES!$E:$E,0),6))","v":""}]
[null,null,1,{"$f":"IF(Q31=\"\",\"\",IF(COUNTIF($Q31:Q31, Q31)>1, \"\", Q31))","v":""},null,null,"","","",null,{"$f":"IF(J31=\"\",\"\",INDEX(REFERENTES!$V:$W,MATCH(J31,REFERENTES!$W:$W,0),1))","v":""},"",null,null,27,"",{"$f":"IF(E31<>\"\",CONCATENATE($A$2,DIGITADOR!$B$2,DIGITADOR!$M$1,C31),\"\")","v":""},null,{"$f":"IF(R31=\"\",\"\",INDEX('OTRAS REFERENCIAS'!$L$5:$M$152,MATCH(R31,'OTRAS REFERENCIAS'!$L$5:$L$157,0),2))","v":""},null,{"$f":"IF(T31=\"\",\"\",VLOOKUP(T31,'OTRAS REFERENCIAS'!$A$7:$B$9,2,FALSE))","v":""},null,"",null,null,null,{"$f":"IF(Z31=\"\",\"\",INDEX(REFERENTES!$A:$B,MATCH(Z31,REFERENTES!$B:$B,0),1))","v":""},"",null,null,{"$f":"IF(AD31=\"\",\"\",INDEX(REFERENTES!$D:$E,MATCH(AD31,REFERENTES!$E:$E,0),1))","v":""},{"$f":"IF(AD31=\"\",\"\",INDEX(REFERENTES!$D:$L,MATCH(AD31,REFERENTES!$E:$E,0),6))","v":""}]
[null,null,1,{"$f":"IF(Q32=\"\",\"\",IF(COUNTIF($Q32:Q32, Q32)>1, \"\", Q32))","v":""},null,null,"","","",null,{"$f":"IF(J32=\"\",\"\",INDEX(REFERENTES!$V:$W,MATCH(J32,REFERENTES!$W:$W,0),1))","v":""},"",null,null,28,"",{"$f":"IF(E32<>\"\",CONCATENATE($A$2,DIGITADOR!$B$2,DIGITADOR!$M$1,C32),\"\")","v":""},null,{"$f":"IF(R32=\"\",\"\",INDEX('OTRAS REFERENCIAS'!$L$5:$M$152,MATCH(R32,'OTRAS REFERENCIAS'!$L$5:$L$157,0),2))","v":""},null,{"$f":"IF(T32=\"\",\"\",VLOOKUP(T32,'OTRAS REFERENCIAS'!$A$7:$B$9,2,FALSE))","v":""},null,"",null,null,null,{"$f":"IF(Z32=\"\",\"\",INDEX(REFERENTES!$A:$B,MATCH(Z32,REFERENTES!$B:$B,0),1))","v":""},"",null,null,{"$f":"IF(AD32=\"\",\"\",INDEX(REFERENTES!$D:$E,MATCH(AD32,REFERENTES!$E:$E,0),1))","v":""},{"$f":"IF(AD32=\"\",\"\",INDEX(REFERENTES!$D:$L,MATCH(AD32,REFERENTES!$E:$E,0),6))","v":""}]
[null,null,1,{"$f":"IF(Q33=\"\",\"\",IF(COUNTIF($Q33:Q33, Q33)>1, \"\", Q33))","v":""},null,null,"","","",null,{"$f":"IF(J33=\"\",\"\",INDEX(REFERENTES!$V:$W,MATCH(J33,REFERENTES!$W:$W,0),1))","v":""},"",null,null,29,"",{"$f":"IF(E33<>\"\",CONCATENATE($A$2,DIGITADOR!$B$2,DIGITADOR!$M$1,C33),\"\")","v":""},null,{"$f":"IF(R33=\"\",\"\",INDEX('OTRAS REFERENCIAS'!$L$5:$M$152,MATCH(R33,'OTRAS REFERENCIAS'!$L$5:$L$157,0),2))","v":""},null,{"$f":"IF(T33=\"\",\"\",VLOOKUP(T33,'OTRAS REFERENCIAS'!$A$7:$B$9,2,FALSE))","v":""},null,"",null,null,null,{"$f":"IF(Z33=\"\",\"\",INDEX(REFERENTES!$A:$B,MATCH(Z33,REFERENTES!$B:$B,0),1))","v":""},"",null,null,{"$f":"IF(AD33=\"\",\"\",INDEX(REFERENTES!$D:$E,MATCH(AD33,REFERENTES!$E:$E,0),1))","v":""},{"$f":"IF(AD33=\"\",\"\",INDEX(REFERENTES!$D:$L,MATCH(AD33,REFERENTES!$E:$E,0),6))","v":""}]
[null,null,1,{"$f":"IF(Q34=\"\",\"\",IF(COUNTIF($Q34:Q34, Q34)>1, \"\", Q34))","v":""},null,null,"","","",null,{"$f":"IF(J34=\"\",\"\",INDEX(REFERENTES!$V:$W,MATCH(J34,REFERENTES!$W:$W,0),1))","v":""},"",null,null,30,"",{"$f":"IF(E34<>\"\",CONCATENATE($A$2,DIGITADOR!$B$2,DIGITADOR!$M$1,C34),\"\")","v":""},null,{"$f":"IF(R34=\"\",\"\",INDEX('OTRAS REFERENCIAS'!$L$5:$M$152,MATCH(R34,'OTRAS REFERENCIAS'!$L$5:$L$157,0),2))","v":""},null,{"$f":"IF(T34=\"\",\"\",VLOOKUP(T34,'OTRAS REFERENCIAS'!$A$7:$B$9,2,FALSE))","v":""},null,"",null,null,null,{"$f":"IF(Z34=\"\",\"\",INDEX(REFERENTES!$A:$B,MATCH(Z34,REFERENTES!$B:$B,0),1))","v":""},"",null,null,{"$f":"IF(AD34=\"\",\"\",INDEX(REFERENTES!$D:$E,MATCH(AD34,REFERENTES!$E:$E,0),1))","v":""},{"$f":"IF(AD34=\"\",\"\",INDEX(REFERENTES!$D:$L,MATCH(AD34,REFERENTES!$E:$E,0),6))","v":""}]
[null,null,1,{"$f":"IF(Q35=\"\",\"\",IF(COUNTIF($Q35:Q35, Q35)>1, \"\", Q35))","v":""},null,null,"","","",null,{"$f":"IF(J35=\"\",\"\",INDEX(REFERENTES!$V:$W,MATCH(J35,REFERENTES!$W:$W,0),1))","v":""},"",null,null,31,"",{"$f":"IF(E35<>\"\",CONCATENATE($A$2,DIGITADOR!$B$2,DIGITADOR!$M$1,C35),\"\")","v":""},null,{"$f":"IF(R35=\"\",\"\",INDEX('OTRAS REFERENCIAS'!$L$5:$M$152,MATCH(R35,'OTRAS REFERENCIAS'!$L$5:$L$157,0),2))","v":""},null,{"$f":"IF(T35=\"\",\"\",VLOOKUP(T35,'OTRAS REFERENCIAS'!$A$7:$B$9,2,FALSE))","v":""},null,"",null,null,null,{"$f":"IF(Z35=\"\",\"\",INDEX(REFERENTES!$A:$B,MATCH(Z35,REFERENTES!$B:$B,0),1))","v":""},"",null,null,{"$f":"IF(AD35=\"\",\"\",INDEX(REFERENTES!$D:$E,MATCH(AD35,REFERENTES!$E:$E,0),1))","v":""},{"$f":"IF(AD35=\"\",\"\",INDEX(REFERENTES!$D:$L,MATCH(AD35,REFERENTES!$E:$E,0),6))","v":""}]
[null,null,1,{"$f":"IF(Q36=\"\",\"\",IF(COUNTIF($Q36:Q36, Q36)>1, \"\", Q36))","v":""},null,null,"","","",null,{"$f":"IF(J36=\"\",\"\",INDEX(REFERENTES!$V:$W,MATCH(J36,REFERENTES!$W:$W,0),1))","v":""},"",null,null,32,"",{"$f":"IF(E36<>\"\",CONCATENATE($A$2,DIGITADOR!$B$2,DIGITADOR!$M$1,C36),\"\")","v":""},null,{"$f":"IF(R36=\"\",\"\",INDEX('OTRAS REFERENCIAS'!$L$5:$M$152,MATCH(R36,'OTRAS REFERENCIAS'!$L$5:$L$157,0),2))","v":""},null,{"$f":"IF(T36=\"\",\"\",VLOOKUP(T36,'OTRAS REFERENCIAS'!$A$7:$B$9,2,FALSE))","v":""},null,"",null,null,null,{"$f":"IF(Z36=\"\",\"\",INDEX(REFERENTES!$A:$B,MATCH(Z36,REFERENTES!$B:$B,0),1))","v":""},"",null,null,{"$f":"IF(AD36=\"\",\"\",INDEX(REFERENTES!$D:$E,MATCH(AD36,REFERENTES!$E:$E,0),1))","v":""},{"$f":"IF(AD36=\"\",\"\",INDEX(REFERENTES!$D:$L,MATCH(AD36,REFERENTES!$E:$E,0),6))","v":""}]
[null,null,1,{"$f":"IF(Q37=\"\",\"\",IF(COUNTIF($Q37:Q37, Q37)>1, \"\", Q37))","v":""},null,null,"","","",null,{"$f":"IF(J37=\"\",\"\",INDEX(REFERENTES!$V:$W,MATCH(J37,REFERENTES!$W:$W,0),1))","v":""},"",null,null,33,"",{"$f":"IF(E37<>\"\",CONCATENATE($A$2,DIGITADOR!$B$2,DIGITADOR!$M$1,C37),\"\")","v":""},null,{"$f":"IF(R37=\"\",\"\",INDEX('OTRAS REFERENCIAS'!$L$5:$M$152,MATCH(R37,'OTRAS REFERENCIAS'!$L$5:$L$157,0),2))","v":""},null,{"$f":"IF(T37=\"\",\"\",VLOOKUP(T37,'OTRAS REFERENCIAS'!$A$7:$B$9,2,FALSE))","v":""},null,"",null,null,null,{"$f":"IF(Z37=\"\",\"\",INDEX(REFERENTES!$A:$B,MATCH(Z37,REFERENTES!$B:$B,0),1))","v":""},"",null,null,{"$f":"IF(AD37=\"\",\"\",INDEX(REFERENTES!$D:$E,MATCH(AD37,REFERENTES!$E:$E,0),1))","v":""},{"$f":"IF(AD37=\"\",\"\",INDEX(REFERENTES!$D:$L,MATCH(AD37,REFERENTES!$E:$E,0),6))","v":""}]
[null,null,1,{"$f":"IF(Q38=\"\",\"\",IF(COUNTIF($Q38:Q38, Q38)>1, \"\", Q38))","v":""},null,null,"","","",null,{"$f":"IF(J38=\"\",\"\",INDEX(REFERENTES!$V:$W,MATCH(J38,REFERENTES!$W:$W,0),1))","v":""},"",null,null,34,"",{"$f":"IF(E38<>\"\",CONCATENATE($A$2,DIGITADOR!$B$2,DIGITADOR!$M$1,C38),\"\")","v":""},null,{"$f":"IF(R38=\"\",\"\",INDEX('OTRAS REFERENCIAS'!$L$5:$M$152,MATCH(R38,'OTRAS REFERENCIAS'!$L$5:$L$157,0),2))","v":""},null,{"$f":"IF(T38=\"\",\"\",VLOOKUP(T38,'OTRAS REFERENCIAS'!$A$7:$B$9,2,FALSE))","v":""},null,"",null,null,null,{"$f":"IF(Z38=\"\",\"\",INDEX(REFERENTES!$A:$B,MATCH(Z38,REFERENTES!$B:$B,0),1))","v":""},"",null,null,{"$f":"IF(AD38=\"\",\"\",INDEX(REFERENTES!$D:$E,MATCH(AD38,REFERENTES!$E:$E,0),1))","v":""},{"$f":"IF(AD38=\"\",\"\",INDEX(REFERENTES!$D:$L,MATCH(AD38,REFERENTES!$E:$E,0),6))","v":""}]
[null,null,1,{"$f":"IF(Q39=\"\",\"\",IF(COUNTIF($Q39:Q39, Q39)>1, \"\", Q39))","v":""},null,null,"","","",null,{"$f":"IF(J39=\"\",\"\",INDEX(REFERENTES!$V:$W,MATCH(J39,REFERENTES!$W:$W,0),1))","v":""},"",null,null,35,"",{"$f":"IF(E39<>\"\",CONCATENATE($A$2,DIGITADOR!$B$2,DIGITADOR!$M$1,C39),\"\")","v":""},null,{"$f":"IF(R39=\"\",\"\",INDEX('OTRAS REFERENCIAS'!$L$5:$M$152,MATCH(R39,'OTRAS REFERENCIAS'!$L$5:$L$157,0),2))","v":""},null,{"$f":"IF(T39=\"\",\"\",VLOOKUP(T39,'OTRAS REFERENCIAS'!$A$7:$B$9,2,FALSE))","v":""},null,"",null,null,null,{"$f":"IF(Z39=\"\",\"\",INDEX(REFERENTES!$A:$B,MATCH(Z39,REFERENTES!$B:$B,0),1))","v":""},"",null,null,{"$f":"IF(AD39=\"\",\"\",INDEX(REFERENTES!$D:$E,MATCH(AD39,REFERENTES!$E:$E,0),1))","v":""},{"$f":"IF(AD39=\"\",\"\",INDEX(REFERENTES!$D:$L,MATCH(AD39,REFERENTES!$E:$E,0),6))","v":""}]
[null,null,1,{"$f":"IF(Q40=\"\",\"\",IF(COUNTIF($Q40:Q40, Q40)>1, \"\", Q40))","v":""},null,null,"","","",null,{"$f":"IF(J40=\"\",\"\",INDEX(REFERENTES!$V:$W,MATCH(J40,REFERENTES!$W:$W,0),1))","v":""},"",null,null,36,"",{"$f":"IF(E40<>\"\",CONCATENATE($A$2,DIGITADOR!$B$2,DIGITADOR!$M$1,C40),\"\")","v":""},null,{"$f":"IF(R40=\"\",\"\",INDEX('OTRAS REFERENCIAS'!$L$5:$M$152,MATCH(R40,'OTRAS REFERENCIAS'!$L$5:$L$157,0),2))","v":""},null,{"$f":"IF(T40=\"\",\"\",VLOOKUP(T40,'OTRAS REFERENCIAS'!$A$7:$B$9,2,FALSE))","v":""},null,"",null,null,null,{"$f":"IF(Z40=\"\",\"\",INDEX(REFERENTES!$A:$B,MATCH(Z40,REFERENTES!$B:$B,0),1))","v":""},"",null,null,{"$f":"IF(AD40=\"\",\"\",INDEX(REFERENTES!$D:$E,MATCH(AD40,REFERENTES!$E:$E,0),1))","v":""},{"$f":"IF(AD40=\"\",\"\",INDEX(REFERENTES!$D:$L,MATCH(AD40,REFERENTES!$E:$E,0),6))","v":""}]
[null,null,1,{"$f":"IF(Q41=\"\",\"\",IF(COUNTIF($Q41:Q41, Q41)>1, \"\", Q41))","v":""},null,null,"","","",null,{"$f":"IF(J41=\"\",\"\",INDEX(REFERENTES!$V:$W,MATCH(J41,REFERENTES!$W:$W,0),1))","v":""},"",null,null,37,"",{"$f":"IF(E41<>\"\",CONCATENATE($A$2,DIGITADOR!$B$2,DIGITADOR!$M$1,C41),\"\")","v":""},null,{"$f":"IF(R41=\"\",\"\",INDEX('OTRAS REFERENCIAS'!$L$5:$M$152,MATCH(R41,'OTRAS REFERENCIAS'!$L$5:$L$157,0),2))","v":""},null,{"$f":"IF(T41=\"\",\"\",VLOOKUP(T41,'OTRAS REFERENCIAS'!$A$7:$B$9,2,FALSE))","v":""},null,"",null,null,null,{"$f":"IF(Z41=\"\",\"\",INDEX(REFERENTES!$A:$B,MATCH(Z41,REFERENTES!$B:$B,0),1))","v":""},"",null,null,{"$f":"IF(AD41=\"\",\"\",INDEX(REFERENTES!$D:$E,MATCH(AD41,REFERENTES!$E:$E,0),1))","v":""},{"$f":"IF(AD41=\"\",\"\",INDEX(REFERENTES!$D:$L,MATCH(AD41,REFERENTES!$E:$E,0),6))","v":""}]
[null,null,1,{"$f":"IF(Q42=\"\",\"\",IF(COUNTIF($Q42:Q42, Q42)>1, \"\", Q42))","v":""},null,null,"","","",null,{"$f":"IF(J42=\"\",\"\",INDEX(REFERENTES!$V:$W,MATCH(J42,REFERENTES!$W:$W,0),1))","v":""},"",null,null,38,"",{"$f":"IF(E42<>\"\",CONCATENATE($A$2,DIGITADOR!$B$2,DIGITADOR!$M$1,C42),\"\")","v":""},null,{"$f":"IF(R42=\"\",\"\",INDEX('OTRAS REFERENCIAS'!$L$5:$M$152,MATCH(R42,'OTRAS REFERENCIAS'!$L$5:$L$157,0),2))","v":""},null,{"$f":"IF(T42=\"\",\"\",VLOOKUP(T42,'OTRAS REFERENCIAS'!$A$7:$B$9,2,FALSE))","v":""},null,"",null,null,null,{"$f":"IF(Z42=\"\",\"\",INDEX(REFERENTES!$A:$B,MATCH(Z42,REFERENTES!$B:$B,0),1))","v":""},"",null,null,{"$f":"IF(AD42=\"\",\"\",INDEX(REFERENTES!$D:$E,MATCH(AD42,REFERENTES!$E:$E,0),1))","v":""},{"$f":"IF(AD42=\"\",\"\",INDEX(REFERENTES!$D:$L,MATCH(AD42,REFERENTES!$E:$E,0),6))","v":""}]
[null,null,1,{"$f":"IF(Q43=\"\",\"\",IF(COUNTIF($Q43:Q43, Q43)>1, \"\", Q43))","v":""},null,null,"","","",null,{"$f":"IF(J43=\"\",\"\",INDEX(REFERENTES!$V:$W,MATCH(J43,REFERENTES!$W:$W,0),1))","v":""},"",null,null,39,"",{"$f":"IF(E43<>\"\",CONCATENATE($A$2,DIGITADOR!$B$2,DIGITADOR!$M$1,C43),\"\")","v":""},null,{"$f":"IF(R43=\"\",\"\",INDEX('OTRAS REFERENCIAS'!$L$5:$M$152,MATCH(R43,'OTRAS REFERENCIAS'!$L$5:$L$157,0),2))","v":""},null,{"$f":"IF(T43=\"\",\"\",VLOOKUP(T43,'OTRAS REFERENCIAS'!$A$7:$B$9,2,FALSE))","v":""},null,"",null,null,null,{"$f":"IF(Z43=\"\",\"\",INDEX(REFERENTES!$A:$B,MATCH(Z43,REFERENTES!$B:$B,0),1))","v":""},"",null,null,{"$f":"IF(AD43=\"\",\"\",INDEX(REFERENTES!$D:$E,MATCH(AD43,REFERENTES!$E:$E,0),1))","v":""},{"$f":"IF(AD43=\"\",\"\",INDEX(REFERENTES!$D:$L,MATCH(AD43,REFERENTES!$E:$E,0),6))","v":""}]
[null,null,1,{"$f":"IF(Q44=\"\",\"\",IF(COUNTIF($Q44:Q44, Q44)>1, \"\", Q44))","v":""},null,null,"","","",null,{"$f":"IF(J44=\"\",\"\",INDEX(REFERENTES!$V:$W,MATCH(J44,REFERENTES!$W:$W,0),1))","v":""},"",null,null,40,"",{"$f":"IF(E44<>\"\",CONCATENATE($A$2,DIGITADOR!$B$2,DIGITADOR!$M$1,C44),\"\")","v":""},null,{"$f":"IF(R44=\"\",\"\",INDEX('OTRAS REFERENCIAS'!$L$5:$M$152,MATCH(R44,'OTRAS REFERENCIAS'!$L$5:$L$157,0),2))","v":""},null,{"$f":"IF(T44=\"\",\"\",VLOOKUP(T44,'OTRAS REFERENCIAS'!$A$7:$B$9,2,FALSE))","v":""},null,"",null,null,null,{"$f":"IF(Z44=\"\",\"\",INDEX(REFERENTES!$A:$B,MATCH(Z44,REFERENTES!$B:$B,0),1))","v":""},"",null,null,{"$f":"IF(AD44=\"\",\"\",INDEX(REFERENTES!$D:$E,MATCH(AD44,REFERENTES!$E:$E,0),1))","v":""},{"$f":"IF(AD44=\"\",\"\",INDEX(REFERENTES!$D:$L,MATCH(AD44,REFERENTES!$E:$E,0),6))","v":""}]
[null,null,1,{"$f":"IF(Q45=\"\",\"\",IF(COUNTIF($Q45:Q45, Q45)>1, \"\", Q45))","v":""},null,null,"","","",null,{"$f":"IF(J45=\"\",\"\",INDEX(REFERENTES!$V:$W,MATCH(J45,REFERENTES!$W:$W,0),1))","v":""},"",null,null,41,"",{"$f":"IF(E45<>\"\",CONCATENATE($A$2,DIGITADOR!$B$2,DIGITADOR!$M$1,C45),\"\")","v":""},null,{"$f":"IF(R45=\"\",\"\",INDEX('OTRAS REFERENCIAS'!$L$5:$M$152,MATCH(R45,'OTRAS REFERENCIAS'!$L$5:$L$157,0),2))","v":""},null,{"$f":"IF(T45=\"\",\"\",VLOOKUP(T45,'OTRAS REFERENCIAS'!$A$7:$B$9,2,FALSE))","v":""},null,"",null,null,null,{"$f":"IF(Z45=\"\",\"\",INDEX(REFERENTES!$A:$B,MATCH(Z45,REFERENTES!$B:$B,0),1))","v":""},"",null,null,{"$f":"IF(AD45=\"\",\"\",INDEX(REFERENTES!$D:$E,MATCH(AD45,REFERENTES!$E:$E,0),1))","v":""},{"$f":"IF(AD45=\"\",\"\",INDEX(REFERENTES!$D:$L,MATCH(AD45,REFERENTES!$E:$E,0),6))","v":""}]
[null,null,1,{"$f":"IF(Q46=\"\",\"\",IF(COUNTIF($Q46:Q46, Q46)>1, \"\", Q46))","v":""},null,null,"","","",null,{"$f":"IF(J46=\"\",\"\",INDEX(REFERENTES!$V:$W,MATCH(J46,REFERENTES!$W:$W,0),1))","v":""},"",null,null,42,"",{"$f":"IF(E46<>\"\",CONCATENATE($A$2,DIGITADOR!$B$2,DIGITADOR!$M$1,C46),\"\")","v":""},null,{"$f":"IF(R46=\"\",\"\",INDEX('OTRAS REFERENCIAS'!$L$5:$M$152,MATCH(R46,'OTRAS REFERENCIAS'!$L$5:$L$157,0),2))","v":""},null,{"$f":"IF(T46=\"\",\"\",VLOOKUP(T46,'OTRAS REFERENCIAS'!$A$7:$B$9,2,FALSE))","v":""},null,"",null,null,null,{"$f":"IF(Z46=\"\",\"\",INDEX(REFERENTES!$A:$B,MATCH(Z46,REFERENTES!$B:$B,0),1))","v":""},"",null,null,{"$f":"IF(AD46=\"\",\"\",INDEX(REFERENTES!$D:$E,MATCH(AD46,REFERENTES!$E:$E,0),1))","v":""},{"$f":"IF(AD46=\"\",\"\",INDEX(REFERENTES!$D:$L,MATCH(AD46,REFERENTES!$E:$E,0),6))","v":""}]
[null,null,1,{"$f":"IF(Q47=\"\",\"\",IF(COUNTIF($Q47:Q47, Q47)>1, \"\", Q47))","v":""},null,null,"","","",null,{"$f":"IF(J47=\"\",\"\",INDEX(REFERENTES!$V:$W,MATCH(J47,REFERENTES!$W:$W,0),1))","v":""},"",null,null,43,"",{"$f":"IF(E47<>\"\",CONCATENATE($A$2,DIGITADOR!$B$2,DIGITADOR!$M$1,C47),\"\")","v":""},null,{"$f":"IF(R47=\"\",\"\",INDEX('OTRAS REFERENCIAS'!$L$5:$M$152,MATCH(R47,'OTRAS REFERENCIAS'!$L$5:$L$157,0),2))","v":""},null,{"$f":"IF(T47=\"\",\"\",VLOOKUP(T47,'OTRAS REFERENCIAS'!$A$7:$B$9,2,FALSE))","v":""},null,"",null,null,null,{"$f":"IF(Z47=\"\",\"\",INDEX(REFERENTES!$A:$B,MATCH(Z47,REFERENTES!$B:$B,0),1))","v":""},"",null,null,{"$f":"IF(AD47=\"\",\"\",INDEX(REFERENTES!$D:$E,MATCH(AD47,REFERENTES!$E:$E,0),1))","v":""},{"$f":"IF(AD47=\"\",\"\",INDEX(REFERENTES!$D:$L,MATCH(AD47,REFERENTES!$E:$E,0),6))","v":""}]
[null,null,1,{"$f":"IF(Q48=\"\",\"\",IF(COUNTIF($Q48:Q48, Q48)>1, \"\", Q48))","v":""},null,null,"","","",null,{"$f":"IF(J48=\"\",\"\",INDEX(REFERENTES!$V:$W,MATCH(J48,REFERENTES!$W:$W,0),1))","v":""},"",null,null,44,"",{"$f":"IF(E48<>\"\",CONCATENATE($A$2,DIGITADOR!$B$2,DIGITADOR!$M$1,C48),\"\")","v":""},null,{"$f":"IF(R48=\"\",\"\",INDEX('OTRAS REFERENCIAS'!$L$5:$M$152,MATCH(R48,'OTRAS REFERENCIAS'!$L$5:$L$157,0),2))","v":""},null,{"$f":"IF(T48=\"\",\"\",VLOOKUP(T48,'OTRAS REFERENCIAS'!$A$7:$B$9,2,FALSE))","v":""},null,"",null,null,null,{"$f":"IF(Z48=\"\",\"\",INDEX(REFERENTES!$A:$B,MATCH(Z48,REFERENTES!$B:$B,0),1))","v":""},"",null,null,{"$f":"IF(AD48=\"\",\"\",INDEX(REFERENTES!$D:$E,MATCH(AD48,REFERENTES!$E:$E,0),1))","v":""},{"$f":"IF(AD48=\"\",\"\",INDEX(REFERENTES!$D:$L,MATCH(AD48,REFERENTES!$E:$E,0),6))","v":""}]
[null,null,1,{"$f":"IF(Q49=\"\",\"\",IF(COUNTIF($Q49:Q49, Q49)>1, \"\", Q49))","v":""},null,null,"","","",null,{"$f":"IF(J49=\"\",\"\",INDEX(REFERENTES!$V:$W,MATCH(J49,REFERENTES!$W:$W,0),1))","v":""},"",null,null,45,"",{"$f":"IF(E49<>\"\",CONCATENATE($A$2,DIGITADOR!$B$2,DIGITADOR!$M$1,C49),\"\")","v":""},null,{"$f":"IF(R49=\"\",\"\",INDEX('OTRAS REFERENCIAS'!$L$5:$M$152,MATCH(R49,'OTRAS REFERENCIAS'!$L$5:$L$157,0),2))","v":""},null,{"$f":"IF(T49=\"\",\"\",VLOOKUP(T49,'OTRAS REFERENCIAS'!$A$7:$B$9,2,FALSE))","v":""},null,"",null,null,null,{"$f":"IF(Z49=\"\",\"\",INDEX(REFERENTES!$A:$B,MATCH(Z49,REFERENTES!$B:$B,0),1))","v":""},"",null,null,{"$f":"IF(AD49=\"\",\"\",INDEX(REFERENTES!$D:$E,MATCH(AD49,REFERENTES!$E:$E,0),1))","v":""},{"$f":"IF(AD49=\"\",\"\",INDEX(REFERENTES!$D:$L,MATCH(AD49,REFERENTES!$E:$E,0),6))","v":""}]
[null,null,1,{"$f":"IF(Q50=\"\",\"\",IF(COUNTIF($Q50:Q50, Q50)>1, \"\", Q50))","v":""},null,null,"","","",null,{"$f":"IF(J50=\"\",\"\",INDEX(REFERENTES!$V:$W,MATCH(J50,REFERENTES!$W:$W,0),1))","v":""},"",null,null,46,"",{"$f":"IF(E50<>\"\",CONCATENATE($A$2,DIGITADOR!$B$2,DIGITADOR!$M$1,C50),\"\")","v":""},null,{"$f":"IF(R50=\"\",\"\",INDEX('OTRAS REFERENCIAS'!$L$5:$M$152,MATCH(R50,'OTRAS REFERENCIAS'!$L$5:$L$157,0),2))","v":""},null,{"$f":"IF(T50=\"\",\"\",VLOOKUP(T50,'OTRAS REFERENCIAS'!$A$7:$B$9,2,FALSE))","v":""},null,"",null,null,null,{"$f":"IF(Z50=\"\",\"\",INDEX(REFERENTES!$A:$B,MATCH(Z50,REFERENTES!$B:$B,0),1))","v":""},"",null,null,{"$f":"IF(AD50=\"\",\"\",INDEX(REFERENTES!$D:$E,MATCH(AD50,REFERENTES!$E:$E,0),1))","v":""},{"$f":"IF(AD50=\"\",\"\",INDEX(REFERENTES!$D:$L,MATCH(AD50,REFERENTES!$E:$E,0),6))","v":""}]
[null,null,1,{"$f":"IF(Q51=\"\",\"\",IF(COUNTIF($Q51:Q51, Q51)>1, \"\", Q51))","v":""},null,null,"","","",null,{"$f":"IF(J51=\"\",\"\",INDEX(REFERENTES!$V:$W,MATCH(J51,REFERENTES!$W:$W,0),1))","v":""},"",null,null,47,"",{"$f":"IF(E51<>\"\",CONCATENATE($A$2,DIGITADOR!$B$2,DIGITADOR!$M$1,C51),\"\")","v":""},null,{"$f":"IF(R51=\"\",\"\",INDEX('OTRAS REFERENCIAS'!$L$5:$M$152,MATCH(R51,'OTRAS REFERENCIAS'!$L$5:$L$157,0),2))","v":""},null,{"$f":"IF(T51=\"\",\"\",VLOOKUP(T51,'OTRAS REFERENCIAS'!$A$7:$B$9,2,FALSE))","v":""},null,"",null,null,null,{"$f":"IF(Z51=\"\",\"\",INDEX(REFERENTES!$A:$B,MATCH(Z51,REFERENTES!$B:$B,0),1))","v":""},"",null,null,{"$f":"IF(AD51=\"\",\"\",INDEX(REFERENTES!$D:$E,MATCH(AD51,REFERENTES!$E:$E,0),1))","v":""},{"$f":"IF(AD51=\"\",\"\",INDEX(REFERENTES!$D:$L,MATCH(AD51,REFERENTES!$E:$E,0),6))","v":""}]
[null,null,1,{"$f":"IF(Q52=\"\",\"\",IF(COUNTIF($Q52:Q52, Q52)>1, \"\", Q52))","v":""},null,null,"","","",null,{"$f":"IF(J52=\"\",\"\",INDEX(REFERENTES!$V:$W,MATCH(J52,REFERENTES!$W:$W,0),1))","v":""},"",null,null,48,"",{"$f":"IF(E52<>\"\",CONCATENATE($A$2,DIGITADOR!$B$2,DIGITADOR!$M$1,C52),\"\")","v":""},null,{"$f":"IF(R52=\"\",\"\",INDEX('OTRAS REFERENCIAS'!$L$5:$M$152,MATCH(R52,'OTRAS REFERENCIAS'!$L$5:$L$157,0),2))","v":""},null,{"$f":"IF(T52=\"\",\"\",VLOOKUP(T52,'OTRAS REFERENCIAS'!$A$7:$B$9,2,FALSE))","v":""},null,"",null,null,null,{"$f":"IF(Z52=\"\",\"\",INDEX(REFERENTES!$A:$B,MATCH(Z52,REFERENTES!$B:$B,0),1))","v":""},"",null,null,{"$f":"IF(AD52=\"\",\"\",INDEX(REFERENTES!$D:$E,MATCH(AD52,REFERENTES!$E:$E,0),1))","v":""},{"$f":"IF(AD52=\"\",\"\",INDEX(REFERENTES!$D:$L,MATCH(AD52,REFERENTES!$E:$E,0),6))","v":""}]
[null,null,1,{"$f":"IF(Q53=\"\",\"\",IF(COUNTIF($Q53:Q53, Q53)>1, \"\", Q53))","v":""},null,null,"","","",null,{"$f":"IF(J53=\"\",\"\",INDEX(REFERENTES!$V:$W,MATCH(J53,REFERENTES!$W:$W,0),1))","v":""},"",null,null,49,"",{"$f":"IF(E53<>\"\",CONCATENATE($A$2,DIGITADOR!$B$2,DIGITADOR!$M$1,C53),\"\")","v":""},null,{"$f":"IF(R53=\"\",\"\",INDEX('OTRAS REFERENCIAS'!$L$5:$M$152,MATCH(R53,'OTRAS REFERENCIAS'!$L$5:$L$157,0),2))","v":""},null,{"$f":"IF(T53=\"\",\"\",VLOOKUP(T53,'OTRAS REFERENCIAS'!$A$7:$B$9,2,FALSE))","v":""},null,"",null,null,null,{"$f":"IF(Z53=\"\",\"\",INDEX(REFERENTES!$A:$B,MATCH(Z53,REFERENTES!$B:$B,0),1))","v":""},"",null,null,{"$f":"IF(AD53=\"\",\"\",INDEX(REFERENTES!$D:$E,MATCH(AD53,REFERENTES!$E:$E,0),1))","v":""},{"$f":"IF(AD53=\"\",\"\",INDEX(REFERENTES!$D:$L,MATCH(AD53,REFERENTES!$E:$E,0),6))","v":""}]
[null,null,1,{"$f":"IF(Q54=\"\",\"\",IF(COUNTIF($Q54:Q54, Q54)>1, \"\", Q54))","v":""},null,null,"","","",null,{"$f":"IF(J54=\"\",\"\",INDEX(REFERENTES!$V:$W,MATCH(J54,REFERENTES!$W:$W,0),1))","v":""},"",null,null,50,"",{"$f":"IF(E54<>\"\",CONCATENATE($A$2,DIGITADOR!$B$2,DIGITADOR!$M$1,C54),\"\")","v":""},null,{"$f":"IF(R54=\"\",\"\",INDEX('OTRAS REFERENCIAS'!$L$5:$M$152,MATCH(R54,'OTRAS REFERENCIAS'!$L$5:$L$157,0),2))","v":""},null,{"$f":"IF(T54=\"\",\"\",VLOOKUP(T54,'OTRAS REFERENCIAS'!$A$7:$B$9,2,FALSE))","v":""},null,"",null,null,null,{"$f":"IF(Z54=\"\",\"\",INDEX(REFERENTES!$A:$B,MATCH(Z54,REFERENTES!$B:$B,0),1))","v":""},"",null,null,{"$f":"IF(AD54=\"\",\"\",INDEX(REFERENTES!$D:$E,MATCH(AD54,REFERENTES!$E:$E,0),1))","v":""},{"$f":"IF(AD54=\"\",\"\",INDEX(REFERENTES!$D:$L,MATCH(AD54,REFERENTES!$E:$E,0),6))","v":""}]
[null,null,1,{"$f":"IF(Q55=\"\",\"\",IF(COUNTIF($Q55:Q55, Q55)>1, \"\", Q55))","v":""},null,null,"","","",null,{"$f":"IF(J55=\"\",\"\",INDEX(REFERENTES!$V:$W,MATCH(J55,REFERENTES!$W:$W,0),1))","v":""},"",null,null,51,"",{"$f":"IF(E55<>\"\",CONCATENATE($A$2,DIGITADOR!$B$2,DIGITADOR!$M$1,C55),\"\")","v":""},null,{"$f":"IF(R55=\"\",\"\",INDEX('OTRAS REFERENCIAS'!$L$5:$M$152,MATCH(R55,'OTRAS REFERENCIAS'!$L$5:$L$157,0),2))","v":""},null,{"$f":"IF(T55=\"\",\"\",VLOOKUP(T55,'OTRAS REFERENCIAS'!$A$7:$B$9,2,FALSE))","v":""},null,"",null,null,null,{"$f":"IF(Z55=\"\",\"\",INDEX(REFERENTES!$A:$B,MATCH(Z55,REFERENTES!$B:$B,0),1))","v":""},"",null,null,{"$f":"IF(AD55=\"\",\"\",INDEX(REFERENTES!$D:$E,MATCH(AD55,REFERENTES!$E:$E,0),1))","v":""},{"$f":"IF(AD55=\"\",\"\",INDEX(REFERENTES!$D:$L,MATCH(AD55,REFERENTES!$E:$E,0),6))","v":""}]
[null,null,1,{"$f":"IF(Q56=\"\",\"\",IF(COUNTIF($Q56:Q56, Q56)>1, \"\", Q56))","v":""},null,null,"","","",null,{"$f":"IF(J56=\"\",\"\",INDEX(REFERENTES!$V:$W,MATCH(J56,REFERENTES!$W:$W,0),1))","v":""},"",null,null,52,"",{"$f":"IF(E56<>\"\",CONCATENATE($A$2,DIGITADOR!$B$2,DIGITADOR!$M$1,C56),\"\")","v":""},null,{"$f":"IF(R56=\"\",\"\",INDEX('OTRAS REFERENCIAS'!$L$5:$M$152,MATCH(R56,'OTRAS REFERENCIAS'!$L$5:$L$157,0),2))","v":""},null,{"$f":"IF(T56=\"\",\"\",VLOOKUP(T56,'OTRAS REFERENCIAS'!$A$7:$B$9,2,FALSE))","v":""},null,"",null,null,null,{"$f":"IF(Z56=\"\",\"\",INDEX(REFERENTES!$A:$B,MATCH(Z56,REFERENTES!$B:$B,0),1))","v":""},"",null,null,{"$f":"IF(AD56=\"\",\"\",INDEX(REFERENTES!$D:$E,MATCH(AD56,REFERENTES!$E:$E,0),1))","v":""},{"$f":"IF(AD56=\"\",\"\",INDEX(REFERENTES!$D:$L,MATCH(AD56,REFERENTES!$E:$E,0),6))","v":""}]
[null,null,1,{"$f":"IF(Q57=\"\",\"\",IF(COUNTIF($Q57:Q57, Q57)>1, \"\", Q57))","v":""},null,null,"","","",null,{"$f":"IF(J57=\"\",\"\",INDEX(REFERENTES!$V:$W,MATCH(J57,REFERENTES!$W:$W,0),1))","v":""},"",null,null,53,"",{"$f":"IF(E57<>\"\",CONCATENATE($A$2,DIGITADOR!$B$2,DIGITADOR!$M$1,C57),\"\")","v":""},null,{"$f":"IF(R57=\"\",\"\",INDEX('OTRAS REFERENCIAS'!$L$5:$M$152,MATCH(R57,'OTRAS REFERENCIAS'!$L$5:$L$157,0),2))","v":""},null,{"$f":"IF(T57=\"\",\"\",VLOOKUP(T57,'OTRAS REFERENCIAS'!$A$7:$B$9,2,FALSE))","v":""},null,"",null,null,null,{"$f":"IF(Z57=\"\",\"\",INDEX(REFERENTES!$A:$B,MATCH(Z57,REFERENTES!$B:$B,0),1))","v":""},"",null,null,{"$f":"IF(AD57=\"\",\"\",INDEX(REFERENTES!$D:$E,MATCH(AD57,REFERENTES!$E:$E,0),1))","v":""},{"$f":"IF(AD57=\"\",\"\",INDEX(REFERENTES!$D:$L,MATCH(AD57,REFERENTES!$E:$E,0),6))","v":""}]
[null,null,1,{"$f":"IF(Q58=\"\",\"\",IF(COUNTIF($Q58:Q58, Q58)>1, \"\", Q58))","v":""},null,null,"","","",null,{"$f":"IF(J58=\"\",\"\",INDEX(REFERENTES!$V:$W,MATCH(J58,REFERENTES!$W:$W,0),1))","v":""},"",null,null,54,"",{"$f":"IF(E58<>\"\",CONCATENATE($A$2,DIGITADOR!$B$2,DIGITADOR!$M$1,C58),\"\")","v":""},null,{"$f":"IF(R58=\"\",\"\",INDEX('OTRAS REFERENCIAS'!$L$5:$M$152,MATCH(R58,'OTRAS REFERENCIAS'!$L$5:$L$157,0),2))","v":""},null,{"$f":"IF(T58=\"\",\"\",VLOOKUP(T58,'OTRAS REFERENCIAS'!$A$7:$B$9,2,FALSE))","v":""},null,"",null,null,null,{"$f":"IF(Z58=\"\",\"\",INDEX(REFERENTES!$A:$B,MATCH(Z58,REFERENTES!$B:$B,0),1))","v":""},"",null,null,{"$f":"IF(AD58=\"\",\"\",INDEX(REFERENTES!$D:$E,MATCH(AD58,REFERENTES!$E:$E,0),1))","v":""},{"$f":"IF(AD58=\"\",\"\",INDEX(REFERENTES!$D:$L,MATCH(AD58,REFERENTES!$E:$E,0),6))","v":""}]
[null,null,1,{"$f":"IF(Q59=\"\",\"\",IF(COUNTIF($Q59:Q59, Q59)>1, \"\", Q59))","v":""},null,null,"","","",null,{"$f":"IF(J59=\"\",\"\",INDEX(REFERENTES!$V:$W,MATCH(J59,REFERENTES!$W:$W,0),1))","v":""},"",null,null,55,"",{"$f":"IF(E59<>\"\",CONCATENATE($A$2,DIGITADOR!$B$2,DIGITADOR!$M$1,C59),\"\")","v":""},null,{"$f":"IF(R59=\"\",\"\",INDEX('OTRAS REFERENCIAS'!$L$5:$M$152,MATCH(R59,'OTRAS REFERENCIAS'!$L$5:$L$157,0),2))","v":""},null,{"$f":"IF(T59=\"\",\"\",VLOOKUP(T59,'OTRAS REFERENCIAS'!$A$7:$B$9,2,FALSE))","v":""},null,"",null,null,null,{"$f":"IF(Z59=\"\",\"\",INDEX(REFERENTES!$A:$B,MATCH(Z59,REFERENTES!$B:$B,0),1))","v":""},"",null,null,{"$f":"IF(AD59=\"\",\"\",INDEX(REFERENTES!$D:$E,MATCH(AD59,REFERENTES!$E:$E,0),1))","v":""},{"$f":"IF(AD59=\"\",\"\",INDEX(REFERENTES!$D:$L,MATCH(AD59,REFERENTES!$E:$E,0),6))","v":""}]
[null,null,1,{"$f":"IF(Q60=\"\",\"\",IF(COUNTIF($Q60:Q60, Q60)>1, \"\", Q60))","v":""},null,null,"","","",null,{"$f":"IF(J60=\"\",\"\",INDEX(REFERENTES!$V:$W,MATCH(J60,REFERENTES!$W:$W,0),1))","v":""},"",null,null,56,"",{"$f":"IF(E60<>\"\",CONCATENATE($A$2,DIGITADOR!$B$2,DIGITADOR!$M$1,C60),\"\")","v":""},null,{"$f":"IF(R60=\"\",\"\",INDEX('OTRAS REFERENCIAS'!$L$5:$M$152,MATCH(R60,'OTRAS REFERENCIAS'!$L$5:$L$157,0),2))","v":""},null,{"$f":"IF(T60=\"\",\"\",VLOOKUP(T60,'OTRAS REFERENCIAS'!$A$7:$B$9,2,FALSE))","v":""},null,"",null,null,null,{"$f":"IF(Z60=\"\",\"\",INDEX(REFERENTES!$A:$B,MATCH(Z60,REFERENTES!$B:$B,0),1))","v":""},"",null,null,{"$f":"IF(AD60=\"\",\"\",INDEX(REFERENTES!$D:$E,MATCH(AD60,REFERENTES!$E:$E,0),1))","v":""},{"$f":"IF(AD60=\"\",\"\",INDEX(REFERENTES!$D:$L,MATCH(AD60,REFERENTES!$E:$E,0),6))","v":""}]
[null,null,1,{"$f":"IF(Q61=\"\",\"\",IF(COUNTIF($Q61:Q61, Q61)>1, \"\", Q61))","v":""},null,null,"","","",null,{"$f":"IF(J61=\"\",\"\",INDEX(REFERENTES!$V:$W,MATCH(J61,REFERENTES!$W:$W,0),1))","v":""},"",null,null,57,"",{"$f":"IF(E61<>\"\",CONCATENATE($A$2,DIGITADOR!$B$2,DIGITADOR!$M$1,C61),\"\")","v":""},null,{"$f":"IF(R61=\"\",\"\",INDEX('OTRAS REFERENCIAS'!$L$5:$M$152,MATCH(R61,'OTRAS REFERENCIAS'!$L$5:$L$157,0),2))","v":""},null,{"$f":"IF(T61=\"\",\"\",VLOOKUP(T61,'OTRAS REFERENCIAS'!$A$7:$B$9,2,FALSE))","v":""},null,"",null,null,null,{"$f":"IF(Z61=\"\",\"\",INDEX(REFERENTES!$A:$B,MATCH(Z61,REFERENTES!$B:$B,0),1))","v":""},"",null,null,{"$f":"IF(AD61=\"\",\"\",INDEX(REFERENTES!$D:$E,MATCH(AD61,REFERENTES!$E:$E,0),1))","v":""},{"$f":"IF(AD61=\"\",\"\",INDEX(REFERENTES!$D:$L,MATCH(AD61,REFERENTES!$E:$E,0),6))","v":""}]
[null,null,1,{"$f":"IF(Q62=\"\",\"\",IF(COUNTIF($Q62:Q62, Q62)>1, \"\", Q62))","v":""},null,null,"","","",null,{"$f":"IF(J62=\"\",\"\",INDEX(REFERENTES!$V:$W,MATCH(J62,REFERENTES!$W:$W,0),1))","v":""},"",null,null,58,"",{"$f":"IF(E62<>\"\",CONCATENATE($A$2,DIGITADOR!$B$2,DIGITADOR!$M$1,C62),\"\")","v":""},null,{"$f":"IF(R62=\"\",\"\",INDEX('OTRAS REFERENCIAS'!$L$5:$M$152,MATCH(R62,'OTRAS REFERENCIAS'!$L$5:$L$157,0),2))","v":""},null,{"$f":"IF(T62=\"\",\"\",VLOOKUP(T62,'OTRAS REFERENCIAS'!$A$7:$B$9,2,FALSE))","v":""},null,"",null,null,null,{"$f":"IF(Z62=\"\",\"\",INDEX(REFERENTES!$A:$B,MATCH(Z62,REFERENTES!$B:$B,0),1))","v":""},"",null,null,{"$f":"IF(AD62=\"\",\"\",INDEX(REFERENTES!$D:$E,MATCH(AD62,REFERENTES!$E:$E,0),1))","v":""},{"$f":"IF(AD62=\"\",\"\",INDEX(REFERENTES!$D:$L,MATCH(AD62,REFERENTES!$E:$E,0),6))","v":""}]
[null,null,1,{"$f":"IF(Q63=\"\",\"\",IF(COUNTIF($Q63:Q63, Q63)>1, \"\", Q63))","v":""},null,null,"","","",null,{"$f":"IF(J63=\"\",\"\",INDEX(REFERENTES!$V:$W,MATCH(J63,REFERENTES!$W:$W,0),1))","v":""},"",null,null,59,"",{"$f":"IF(E63<>\"\",CONCATENATE($A$2,DIGITADOR!$B$2,DIGITADOR!$M$1,C63),\"\")","v":""},null,{"$f":"IF(R63=\"\",\"\",INDEX('OTRAS REFERENCIAS'!$L$5:$M$152,MATCH(R63,'OTRAS REFERENCIAS'!$L$5:$L$157,0),2))","v":""},null,{"$f":"IF(T63=\"\",\"\",VLOOKUP(T63,'OTRAS REFERENCIAS'!$A$7:$B$9,2,FALSE))","v":""},null,"",null,null,null,{"$f":"IF(Z63=\"\",\"\",INDEX(REFERENTES!$A:$B,MATCH(Z63,REFERENTES!$B:$B,0),1))","v":""},"",null,null,{"$f":"IF(AD63=\"\",\"\",INDEX(REFERENTES!$D:$E,MATCH(AD63,REFERENTES!$E:$E,0),1))","v":""},{"$f":"IF(AD63=\"\",\"\",INDEX(REFERENTES!$D:$L,MATCH(AD63,REFERENTES!$E:$E,0),6))","v":""}]
[null,null,1,{"$f":"IF(Q64=\"\",\"\",IF(COUNTIF($Q64:Q64, Q64)>1, \"\", Q64))","v":""},null,null,"","","",null,{"$f":"IF(J64=\"\",\"\",INDEX(REFERENTES!$V:$W,MATCH(J64,REFERENTES!$W:$W,0),1))","v":""},"",null,null,60,"",{"$f":"IF(E64<>\"\",CONCATENATE($A$2,DIGITADOR!$B$2,DIGITADOR!$M$1,C64),\"\")","v":""},null,{"$f":"IF(R64=\"\",\"\",INDEX('OTRAS REFERENCIAS'!$L$5:$M$152,MATCH(R64,'OTRAS REFERENCIAS'!$L$5:$L$157,0),2))","v":""},null,{"$f":"IF(T64=\"\",\"\",VLOOKUP(T64,'OTRAS REFERENCIAS'!$A$7:$B$9,2,FALSE))","v":""},null,"",null,null,null,{"$f":"IF(Z64=\"\",\"\",INDEX(REFERENTES!$A:$B,MATCH(Z64,REFERENTES!$B:$B,0),1))","v":""},"",null,null,{"$f":"IF(AD64=\"\",\"\",INDEX(REFERENTES!$D:$E,MATCH(AD64,REFERENTES!$E:$E,0),1))","v":""},{"$f":"IF(AD64=\"\",\"\",INDEX(REFERENTES!$D:$L,MATCH(AD64,REFERENTES!$E:$E,0),6))","v":""}]
[null,null,1,{"$f":"IF(Q65=\"\",\"\",IF(COUNTIF($Q65:Q65, Q65)>1, \"\", Q65))","v":""},null,null,"","","",null,{"$f":"IF(J65=\"\",\"\",INDEX(REFERENTES!$V:$W,MATCH(J65,REFERENTES!$W:$W,0),1))","v":""},"",null,null,61,"",{"$f":"IF(E65<>\"\",CONCATENATE($A$2,DIGITADOR!$B$2,DIGITADOR!$M$1,C65),\"\")","v":""},null,{"$f":"IF(R65=\"\",\"\",INDEX('OTRAS REFERENCIAS'!$L$5:$M$152,MATCH(R65,'OTRAS REFERENCIAS'!$L$5:$L$157,0),2))","v":""},null,{"$f":"IF(T65=\"\",\"\",VLOOKUP(T65,'OTRAS REFERENCIAS'!$A$7:$B$9,2,FALSE))","v":""},null,"",null,null,null,{"$f":"IF(Z65=\"\",\"\",INDEX(REFERENTES!$A:$B,MATCH(Z65,REFERENTES!$B:$B,0),1))","v":""},"",null,null,{"$f":"IF(AD65=\"\",\"\",INDEX(REFERENTES!$D:$E,MATCH(AD65,REFERENTES!$E:$E,0),1))","v":""},{"$f":"IF(AD65=\"\",\"\",INDEX(REFERENTES!$D:$L,MATCH(AD65,REFERENTES!$E:$E,0),6))","v":""}]
[null,null,1,{"$f":"IF(Q66=\"\",\"\",IF(COUNTIF($Q66:Q66, Q66)>1, \"\", Q66))","v":""},null,null,"","","",null,{"$f":"IF(J66=\"\",\"\",INDEX(REFERENTES!$V:$W,MATCH(J66,REFERENTES!$W:$W,0),1))","v":""},"",null,null,62,"",{"$f":"IF(E66<>\"\",CONCATENATE($A$2,DIGITADOR!$B$2,DIGITADOR!$M$1,C66),\"\")","v":""},null,{"$f":"IF(R66=\"\",\"\",INDEX('OTRAS REFERENCIAS'!$L$5:$M$152,MATCH(R66,'OTRAS REFERENCIAS'!$L$5:$L$157,0),2))","v":""},null,{"$f":"IF(T66=\"\",\"\",VLOOKUP(T66,'OTRAS REFERENCIAS'!$A$7:$B$9,2,FALSE))","v":""},null,"",null,null,null,{"$f":"IF(Z66=\"\",\"\",INDEX(REFERENTES!$A:$B,MATCH(Z66,REFERENTES!$B:$B,0),1))","v":""},"",null,null,{"$f":"IF(AD66=\"\",\"\",INDEX(REFERENTES!$D:$E,MATCH(AD66,REFERENTES!$E:$E,0),1))","v":""},{"$f":"IF(AD66=\"\",\"\",INDEX(REFERENTES!$D:$L,MATCH(AD66,REFERENTES!$E:$E,0),6))","v":""}]
[null,null,1,{"$f":"IF(Q67=\"\",\"\",IF(COUNTIF($Q67:Q67, Q67)>1, \"\", Q67))","v":""},null,null,"","","",null,{"$f":"IF(J67=\"\",\"\",INDEX(REFERENTES!$V:$W,MATCH(J67,REFERENTES!$W:$W,0),1))","v":""},"",null,null,63,"",{"$f":"IF(E67<>\"\",CONCATENATE($A$2,DIGITADOR!$B$2,DIGITADOR!$M$1,C67),\"\")","v":""},null,{"$f":"IF(R67=\"\",\"\",INDEX('OTRAS REFERENCIAS'!$L$5:$M$152,MATCH(R67,'OTRAS REFERENCIAS'!$L$5:$L$157,0),2))","v":""},null,{"$f":"IF(T67=\"\",\"\",VLOOKUP(T67,'OTRAS REFERENCIAS'!$A$7:$B$9,2,FALSE))","v":""},null,"",null,null,null,{"$f":"IF(Z67=\"\",\"\",INDEX(REFERENTES!$A:$B,MATCH(Z67,REFERENTES!$B:$B,0),1))","v":""},"",null,null,{"$f":"IF(AD67=\"\",\"\",INDEX(REFERENTES!$D:$E,MATCH(AD67,REFERENTES!$E:$E,0),1))","v":""},{"$f":"IF(AD67=\"\",\"\",INDEX(REFERENTES!$D:$L,MATCH(AD67,REFERENTES!$E:$E,0),6))","v":""}]
[null,null,1,{"$f":"IF(Q68=\"\",\"\",IF(COUNTIF($Q68:Q68, Q68)>1, \"\", Q68))","v":""},null,null,"","","",null,{"$f":"IF(J68=\"\",\"\",INDEX(REFERENTES!$V:$W,MATCH(J68,REFERENTES!$W:$W,0),1))","v":""},"",null,null,63,"",{"$f":"IF(E68<>\"\",CONCATENATE($A$2,DIGITADOR!$B$2,DIGITADOR!$M$1,C68),\"\")","v":""},null,{"$f":"IF(R68=\"\",\"\",INDEX('OTRAS REFERENCIAS'!$L$5:$M$152,MATCH(R68,'OTRAS REFERENCIAS'!$L$5:$L$157,0),2))","v":""},null,{"$f":"IF(T68=\"\",\"\",VLOOKUP(T68,'OTRAS REFERENCIAS'!$A$7:$B$9,2,FALSE))","v":""},null,"",null,null,null,{"$f":"IF(Z68=\"\",\"\",INDEX(REFERENTES!$A:$B,MATCH(Z68,REFERENTES!$B:$B,0),1))","v":""},"",null,null,{"$f":"IF(AD68=\"\",\"\",INDEX(REFERENTES!$D:$E,MATCH(AD68,REFERENTES!$E:$E,0),1))","v":""},{"$f":"IF(AD68=\"\",\"\",INDEX(REFERENTES!$D:$L,MATCH(AD68,REFERENTES!$E:$E,0),6))","v":""}]
[null,null,{"$f":"IF(L69=L68,C68,C68+1)","v":1},{"$f":"IF(Q69=\"\",\"\",IF(COUNTIF($Q69:Q69, Q69)>1, \"\", Q69))","v":""},null,null,"",{"$f":"IF(G69<>\"\",MONTH(G69),\"\")","v":""},"",null,{"$f":"IF(J69=\"\",\"\",INDEX(REFERENTES!$V:$W,MATCH(J69,REFERENTES!$W:$W,0),1))","v":""},{"$f":"IF(G69=\"\",\"\",CONCATENATE(G69,S69,K69,X69))","v":""},null,null,65,"",{"$f":"IF(E69<>\"\",CONCATENATE($A$2,DIGITADOR!$B$2,DIGITADOR!$M$1,C69),\"\")","v":""},null,{"$f":"IF(R69=\"\",\"\",INDEX('OTRAS REFERENCIAS'!$L$5:$M$152,MATCH(R69,'OTRAS REFERENCIAS'!$L$5:$L$157,0),2))","v":""},null,{"$f":"IF(T69=\"\",\"\",VLOOKUP(T69,'OTRAS REFERENCIAS'!$A$7:$B$9,2,FALSE))","v":""},null,"",null,null,null,{"$f":"IF(Z69=\"\",\"\",INDEX(REFERENTES!$A:$B,MATCH(Z69,REFERENTES!$B:$B,0),1))","v":""},"",null,null,{"$f":"IF(AD69=\"\",\"\",INDEX(REFERENTES!$D:$E,MATCH(AD69,REFERENTES!$E:$E,0),1))","v":""},{"$f":"IF(AD69=\"\",\"\",INDEX(REFERENTES!$D:$L,MATCH(AD69,REFERENTES!$E:$E,0),6))","v":""}]
[null,null,1,{"$f":"IF(Q70=\"\",\"\",IF(COUNTIF($Q70:Q70, Q70)>1, \"\", Q70))","v":""},null,null,{"$f":"IF(E70=\"\",\"\",E70+F70)","v":""},"",{"$f":"IF(D70=\"\",\"\",1)","v":""},null,{"$f":"IF(J70=\"\",\"\",INDEX(REFERENTES!$V:$W,MATCH(J70,REFERENTES!$W:$W,0),1))","v":""},"",null,null,66,{"$f":"IF(Q70=\"\",\"\",CONCATENATE(Q70,ROW()-2))","v":""},{"$f":"IF(E70<>\"\",CONCATENATE($A$2,DIGITADOR!$B$2,DIGITADOR!$M$1,C70),\"\")","v":""},null,{"$f":"IF(R70=\"\",\"\",INDEX('OTRAS REFERENCIAS'!$L$5:$M$152,MATCH(R70,'OTRAS REFERENCIAS'!$L$5:$L$157,0),2))","v":""},null,{"$f":"IF(T70=\"\",\"\",VLOOKUP(T70,'OTRAS REFERENCIAS'!$A$7:$B$9,2,FALSE))","v":""},null,{"$f":"CONCATENATE(T70,V70)","v":""},null,null,null,{"$f":"IF(Z70=\"\",\"\",INDEX(REFERENTES!$A:$B,MATCH(Z70,REFERENTES!$B:$B,0),1))","v":""},{"$f":"UPPER(AD70)","v":""},null,null,{"$f":"IF(AD70=\"\",\"\",INDEX(REFERENTES!$D:$E,MATCH(AD70,REFERENTES!$E:$E,0),1))","v":""},{"$f":"IF(AD70=\"\",\"\",INDEX(REFERENTES!$D:$L,MATCH(AD70,REFERENTES!$E:$E,0),6))","v":""}]
[null,null,1,{"$f":"IF(Q71=\"\",\"\",IF(COUNTIF($Q71:Q71, Q71)>1, \"\", Q71))","v":""},null,null,"","","",null,{"$f":"IF(J71=\"\",\"\",INDEX(REFERENTES!$V:$W,MATCH(J71,REFERENTES!$W:$W,0),1))","v":""},"",null,null,67,"",{"$f":"IF(E71<>\"\",CONCATENATE($A$2,DIGITADOR!$B$2,DIGITADOR!$M$1,C71),\"\")","v":""},null,{"$f":"IF(R71=\"\",\"\",INDEX('OTRAS REFERENCIAS'!$L$5:$M$152,MATCH(R71,'OTRAS REFERENCIAS'!$L$5:$L$157,0),2))","v":""},null,{"$f":"IF(T71=\"\",\"\",VLOOKUP(T71,'OTRAS REFERENCIAS'!$A$7:$B$9,2,FALSE))","v":""},null,"",null,null,null,{"$f":"IF(Z71=\"\",\"\",INDEX(REFERENTES!$A:$B,MATCH(Z71,REFERENTES!$B:$B,0),1))","v":""},"",null,null,{"$f":"IF(AD71=\"\",\"\",INDEX(REFERENTES!$D:$E,MATCH(AD71,REFERENTES!$E:$E,0),1))","v":""},{"$f":"IF(AD71=\"\",\"\",INDEX(REFERENTES!$D:$L,MATCH(AD71,REFERENTES!$E:$E,0),6))","v":""}]
[null,null,1,{"$f":"IF(Q72=\"\",\"\",IF(COUNTIF($Q72:Q72, Q72)>1, \"\", Q72))","v":""},null,null,"","","",null,{"$f":"IF(J72=\"\",\"\",INDEX(REFERENTES!$V:$W,MATCH(J72,REFERENTES!$W:$W,0),1))","v":""},"",null,null,68,"",{"$f":"IF(E72<>\"\",CONCATENATE($A$2,DIGITADOR!$B$2,DIGITADOR!$M$1,C72),\"\")","v":""},null,{"$f":"IF(R72=\"\",\"\",INDEX('OTRAS REFERENCIAS'!$L$5:$M$152,MATCH(R72,'OTRAS REFERENCIAS'!$L$5:$L$157,0),2))","v":""},null,{"$f":"IF(T72=\"\",\"\",VLOOKUP(T72,'OTRAS REFERENCIAS'!$A$7:$B$9,2,FALSE))","v":""},null,"",null,null,null,{"$f":"IF(Z72=\"\",\"\",INDEX(REFERENTES!$A:$B,MATCH(Z72,REFERENTES!$B:$B,0),1))","v":""},"",null,null,{"$f":"IF(AD72=\"\",\"\",INDEX(REFERENTES!$D:$E,MATCH(AD72,REFERENTES!$E:$E,0),1))","v":""},{"$f":"IF(AD72=\"\",\"\",INDEX(REFERENTES!$D:$L,MATCH(AD72,REFERENTES!$E:$E,0),6))","v":""}]
[null,null,1,{"$f":"IF(Q73=\"\",\"\",IF(COUNTIF($Q73:Q73, Q73)>1, \"\", Q73))","v":""},null,null,"","","",null,{"$f":"IF(J73=\"\",\"\",INDEX(REFERENTES!$V:$W,MATCH(J73,REFERENTES!$W:$W,0),1))","v":""},"",null,null,69,"",{"$f":"IF(E73<>\"\",CONCATENATE($A$2,DIGITADOR!$B$2,DIGITADOR!$M$1,C73),\"\")","v":""},null,{"$f":"IF(R73=\"\",\"\",INDEX('OTRAS REFERENCIAS'!$L$5:$M$152,MATCH(R73,'OTRAS REFERENCIAS'!$L$5:$L$157,0),2))","v":""},null,{"$f":"IF(T73=\"\",\"\",VLOOKUP(T73,'OTRAS REFERENCIAS'!$A$7:$B$9,2,FALSE))","v":""},null,"",null,null,null,{"$f":"IF(Z73=\"\",\"\",INDEX(REFERENTES!$A:$B,MATCH(Z73,REFERENTES!$B:$B,0),1))","v":""},"",null,null,{"$f":"IF(AD73=\"\",\"\",INDEX(REFERENTES!$D:$E,MATCH(AD73,REFERENTES!$E:$E,0),1))","v":""},{"$f":"IF(AD73=\"\",\"\",INDEX(REFERENTES!$D:$L,MATCH(AD73,REFERENTES!$E:$E,0),6))","v":""}]
[null,null,1,{"$f":"IF(Q74=\"\",\"\",IF(COUNTIF($Q74:Q74, Q74)>1, \"\", Q74))","v":""},null,null,"","","",null,{"$f":"IF(J74=\"\",\"\",INDEX(REFERENTES!$V:$W,MATCH(J74,REFERENTES!$W:$W,0),1))","v":""},"",null,null,70,"",{"$f":"IF(E74<>\"\",CONCATENATE($A$2,DIGITADOR!$B$2,DIGITADOR!$M$1,C74),\"\")","v":""},null,{"$f":"IF(R74=\"\",\"\",INDEX('OTRAS REFERENCIAS'!$L$5:$M$152,MATCH(R74,'OTRAS REFERENCIAS'!$L$5:$L$157,0),2))","v":""},null,{"$f":"IF(T74=\"\",\"\",VLOOKUP(T74,'OTRAS REFERENCIAS'!$A$7:$B$9,2,FALSE))","v":""},null,"",null,null,null,{"$f":"IF(Z74=\"\",\"\",INDEX(REFERENTES!$A:$B,MATCH(Z74,REFERENTES!$B:$B,0),1))","v":""},"",null,null,{"$f":"IF(AD74=\"\",\"\",INDEX(REFERENTES!$D:$E,MATCH(AD74,REFERENTES!$E:$E,0),1))","v":""},{"$f":"IF(AD74=\"\",\"\",INDEX(REFERENTES!$D:$L,MATCH(AD74,REFERENTES!$E:$E,0),6))","v":""}]
[null,null,1,{"$f":"IF(Q75=\"\",\"\",IF(COUNTIF($Q75:Q75, Q75)>1, \"\", Q75))","v":""},null,null,"","","",null,{"$f":"IF(J75=\"\",\"\",INDEX(REFERENTES!$V:$W,MATCH(J75,REFERENTES!$W:$W,0),1))","v":""},"",null,null,71,"",{"$f":"IF(E75<>\"\",CONCATENATE($A$2,DIGITADOR!$B$2,DIGITADOR!$M$1,C75),\"\")","v":""},null,{"$f":"IF(R75=\"\",\"\",INDEX('OTRAS REFERENCIAS'!$L$5:$M$152,MATCH(R75,'OTRAS REFERENCIAS'!$L$5:$L$157,0),2))","v":""},null,{"$f":"IF(T75=\"\",\"\",VLOOKUP(T75,'OTRAS REFERENCIAS'!$A$7:$B$9,2,FALSE))","v":""},null,"",null,null,null,{"$f":"IF(Z75=\"\",\"\",INDEX(REFERENTES!$A:$B,MATCH(Z75,REFERENTES!$B:$B,0),1))","v":""},"",null,null,{"$f":"IF(AD75=\"\",\"\",INDEX(REFERENTES!$D:$E,MATCH(AD75,REFERENTES!$E:$E,0),1))","v":""},{"$f":"IF(AD75=\"\",\"\",INDEX(REFERENTES!$D:$L,MATCH(AD75,REFERENTES!$E:$E,0),6))","v":""}]
[null,null,1,{"$f":"IF(Q76=\"\",\"\",IF(COUNTIF($Q76:Q76, Q76)>1, \"\", Q76))","v":""},null,null,"","","",null,{"$f":"IF(J76=\"\",\"\",INDEX(REFERENTES!$V:$W,MATCH(J76,REFERENTES!$W:$W,0),1))","v":""},"",null,null,72,"",{"$f":"IF(E76<>\"\",CONCATENATE($A$2,DIGITADOR!$B$2,DIGITADOR!$M$1,C76),\"\")","v":""},null,{"$f":"IF(R76=\"\",\"\",INDEX('OTRAS REFERENCIAS'!$L$5:$M$152,MATCH(R76,'OTRAS REFERENCIAS'!$L$5:$L$157,0),2))","v":""},null,{"$f":"IF(T76=\"\",\"\",VLOOKUP(T76,'OTRAS REFERENCIAS'!$A$7:$B$9,2,FALSE))","v":""},null,"",null,null,null,{"$f":"IF(Z76=\"\",\"\",INDEX(REFERENTES!$A:$B,MATCH(Z76,REFERENTES!$B:$B,0),1))","v":""},"",null,null,{"$f":"IF(AD76=\"\",\"\",INDEX(REFERENTES!$D:$E,MATCH(AD76,REFERENTES!$E:$E,0),1))","v":""},{"$f":"IF(AD76=\"\",\"\",INDEX(REFERENTES!$D:$L,MATCH(AD76,REFERENTES!$E:$E,0),6))","v":""}]
[null,null,1,{"$f":"IF(Q77=\"\",\"\",IF(COUNTIF($Q77:Q77, Q77)>1, \"\", Q77))","v":""},null,null,"","","",null,{"$f":"IF(J77=\"\",\"\",INDEX(REFERENTES!$V:$W,MATCH(J77,REFERENTES!$W:$W,0),1))","v":""},"",null,null,73,"",{"$f":"IF(E77<>\"\",CONCATENATE($A$2,DIGITADOR!$B$2,DIGITADOR!$M$1,C77),\"\")","v":""},null,{"$f":"IF(R77=\"\",\"\",INDEX('OTRAS REFERENCIAS'!$L$5:$M$152,MATCH(R77,'OTRAS REFERENCIAS'!$L$5:$L$157,0),2))","v":""},null,{"$f":"IF(T77=\"\",\"\",VLOOKUP(T77,'OTRAS REFERENCIAS'!$A$7:$B$9,2,FALSE))","v":""},null,"",null,null,null,{"$f":"IF(Z77=\"\",\"\",INDEX(REFERENTES!$A:$B,MATCH(Z77,REFERENTES!$B:$B,0),1))","v":""},"",null,null,{"$f":"IF(AD77=\"\",\"\",INDEX(REFERENTES!$D:$E,MATCH(AD77,REFERENTES!$E:$E,0),1))","v":""},{"$f":"IF(AD77=\"\",\"\",INDEX(REFERENTES!$D:$L,MATCH(AD77,REFERENTES!$E:$E,0),6))","v":""}]
[null,null,1,{"$f":"IF(Q78=\"\",\"\",IF(COUNTIF($Q78:Q78, Q78)>1, \"\", Q78))","v":""},null,null,"","","",null,{"$f":"IF(J78=\"\",\"\",INDEX(REFERENTES!$V:$W,MATCH(J78,REFERENTES!$W:$W,0),1))","v":""},"",null,null,74,"",{"$f":"IF(E78<>\"\",CONCATENATE($A$2,DIGITADOR!$B$2,DIGITADOR!$M$1,C78),\"\")","v":""},null,{"$f":"IF(R78=\"\",\"\",INDEX('OTRAS REFERENCIAS'!$L$5:$M$152,MATCH(R78,'OTRAS REFERENCIAS'!$L$5:$L$157,0),2))","v":""},null,{"$f":"IF(T78=\"\",\"\",VLOOKUP(T78,'OTRAS REFERENCIAS'!$A$7:$B$9,2,FALSE))","v":""},null,"",null,null,null,{"$f":"IF(Z78=\"\",\"\",INDEX(REFERENTES!$A:$B,MATCH(Z78,REFERENTES!$B:$B,0),1))","v":""},"",null,null,{"$f":"IF(AD78=\"\",\"\",INDEX(REFERENTES!$D:$E,MATCH(AD78,REFERENTES!$E:$E,0),1))","v":""},{"$f":"IF(AD78=\"\",\"\",INDEX(REFERENTES!$D:$L,MATCH(AD78,REFERENTES!$E:$E,0),6))","v":""}]
[null,null,1,{"$f":"IF(Q79=\"\",\"\",IF(COUNTIF($Q79:Q79, Q79)>1, \"\", Q79))","v":""},null,null,"","","",null,{"$f":"IF(J79=\"\",\"\",INDEX(REFERENTES!$V:$W,MATCH(J79,REFERENTES!$W:$W,0),1))","v":""},"",null,null,75,"",{"$f":"IF(E79<>\"\",CONCATENATE($A$2,DIGITADOR!$B$2,DIGITADOR!$M$1,C79),\"\")","v":""},null,{"$f":"IF(R79=\"\",\"\",INDEX('OTRAS REFERENCIAS'!$L$5:$M$152,MATCH(R79,'OTRAS REFERENCIAS'!$L$5:$L$157,0),2))","v":""},null,{"$f":"IF(T79=\"\",\"\",VLOOKUP(T79,'OTRAS REFERENCIAS'!$A$7:$B$9,2,FALSE))","v":""},null,"",null,null,null,{"$f":"IF(Z79=\"\",\"\",INDEX(REFERENTES!$A:$B,MATCH(Z79,REFERENTES!$B:$B,0),1))","v":""},"",null,null,{"$f":"IF(AD79=\"\",\"\",INDEX(REFERENTES!$D:$E,MATCH(AD79,REFERENTES!$E:$E,0),1))","v":""},{"$f":"IF(AD79=\"\",\"\",INDEX(REFERENTES!$D:$L,MATCH(AD79,REFERENTES!$E:$E,0),6))","v":""}]
[null,null,1,{"$f":"IF(Q80=\"\",\"\",IF(COUNTIF($Q80:Q80, Q80)>1, \"\", Q80))","v":""},null,null,"","","",null,{"$f":"IF(J80=\"\",\"\",INDEX(REFERENTES!$V:$W,MATCH(J80,REFERENTES!$W:$W,0),1))","v":""},"",null,null,76,"",{"$f":"IF(E80<>\"\",CONCATENATE($A$2,DIGITADOR!$B$2,DIGITADOR!$M$1,C80),\"\")","v":""},null,{"$f":"IF(R80=\"\",\"\",INDEX('OTRAS REFERENCIAS'!$L$5:$M$152,MATCH(R80,'OTRAS REFERENCIAS'!$L$5:$L$157,0),2))","v":""},null,{"$f":"IF(T80=\"\",\"\",VLOOKUP(T80,'OTRAS REFERENCIAS'!$A$7:$B$9,2,FALSE))","v":""},null,"",null,null,null,{"$f":"IF(Z80=\"\",\"\",INDEX(REFERENTES!$A:$B,MATCH(Z80,REFERENTES!$B:$B,0),1))","v":""},"",null,null,{"$f":"IF(AD80=\"\",\"\",INDEX(REFERENTES!$D:$E,MATCH(AD80,REFERENTES!$E:$E,0),1))","v":""},{"$f":"IF(AD80=\"\",\"\",INDEX(REFERENTES!$D:$L,MATCH(AD80,REFERENTES!$E:$E,0),6))","v":""}]
[null,null,1,{"$f":"IF(Q81=\"\",\"\",IF(COUNTIF($Q81:Q81, Q81)>1, \"\", Q81))","v":""},null,null,"","","",null,{"$f":"IF(J81=\"\",\"\",INDEX(REFERENTES!$V:$W,MATCH(J81,REFERENTES!$W:$W,0),1))","v":""},"",null,null,77,"",{"$f":"IF(E81<>\"\",CONCATENATE($A$2,DIGITADOR!$B$2,DIGITADOR!$M$1,C81),\"\")","v":""},null,{"$f":"IF(R81=\"\",\"\",INDEX('OTRAS REFERENCIAS'!$L$5:$M$152,MATCH(R81,'OTRAS REFERENCIAS'!$L$5:$L$157,0),2))","v":""},null,{"$f":"IF(T81=\"\",\"\",VLOOKUP(T81,'OTRAS REFERENCIAS'!$A$7:$B$9,2,FALSE))","v":""},null,"",null,null,null,{"$f":"IF(Z81=\"\",\"\",INDEX(REFERENTES!$A:$B,MATCH(Z81,REFERENTES!$B:$B,0),1))","v":""},"",null,null,{"$f":"IF(AD81=\"\",\"\",INDEX(REFERENTES!$D:$E,MATCH(AD81,REFERENTES!$E:$E,0),1))","v":""},{"$f":"IF(AD81=\"\",\"\",INDEX(REFERENTES!$D:$L,MATCH(AD81,REFERENTES!$E:$E,0),6))","v":""}]
[null,null,1,{"$f":"IF(Q82=\"\",\"\",IF(COUNTIF($Q82:Q82, Q82)>1, \"\", Q82))","v":""},null,null,"","","",null,{"$f":"IF(J82=\"\",\"\",INDEX(REFERENTES!$V:$W,MATCH(J82,REFERENTES!$W:$W,0),1))","v":""},"",null,null,78,"",{"$f":"IF(E82<>\"\",CONCATENATE($A$2,DIGITADOR!$B$2,DIGITADOR!$M$1,C82),\"\")","v":""},null,{"$f":"IF(R82=\"\",\"\",INDEX('OTRAS REFERENCIAS'!$L$5:$M$152,MATCH(R82,'OTRAS REFERENCIAS'!$L$5:$L$157,0),2))","v":""},null,{"$f":"IF(T82=\"\",\"\",VLOOKUP(T82,'OTRAS REFERENCIAS'!$A$7:$B$9,2,FALSE))","v":""},null,"",null,null,null,{"$f":"IF(Z82=\"\",\"\",INDEX(REFERENTES!$A:$B,MATCH(Z82,REFERENTES!$B:$B,0),1))","v":""},"",null,null,{"$f":"IF(AD82=\"\",\"\",INDEX(REFERENTES!$D:$E,MATCH(AD82,REFERENTES!$E:$E,0),1))","v":""},{"$f":"IF(AD82=\"\",\"\",INDEX(REFERENTES!$D:$L,MATCH(AD82,REFERENTES!$E:$E,0),6))","v":""}]
[null,null,1,{"$f":"IF(Q83=\"\",\"\",IF(COUNTIF($Q83:Q83, Q83)>1, \"\", Q83))","v":""},null,null,"","","",null,{"$f":"IF(J83=\"\",\"\",INDEX(REFERENTES!$V:$W,MATCH(J83,REFERENTES!$W:$W,0),1))","v":""},"",null,null,79,"",{"$f":"IF(E83<>\"\",CONCATENATE($A$2,DIGITADOR!$B$2,DIGITADOR!$M$1,C83),\"\")","v":""},null,{"$f":"IF(R83=\"\",\"\",INDEX('OTRAS REFERENCIAS'!$L$5:$M$152,MATCH(R83,'OTRAS REFERENCIAS'!$L$5:$L$157,0),2))","v":""},null,{"$f":"IF(T83=\"\",\"\",VLOOKUP(T83,'OTRAS REFERENCIAS'!$A$7:$B$9,2,FALSE))","v":""},null,"",null,null,null,{"$f":"IF(Z83=\"\",\"\",INDEX(REFERENTES!$A:$B,MATCH(Z83,REFERENTES!$B:$B,0),1))","v":""},"",null,null,{"$f":"IF(AD83=\"\",\"\",INDEX(REFERENTES!$D:$E,MATCH(AD83,REFERENTES!$E:$E,0),1))","v":""},{"$f":"IF(AD83=\"\",\"\",INDEX(REFERENTES!$D:$L,MATCH(AD83,REFERENTES!$E:$E,0),6))","v":""}]
[null,null,1,{"$f":"IF(Q84=\"\",\"\",IF(COUNTIF($Q84:Q84, Q84)>1, \"\", Q84))","v":""},null,null,"","","",null,{"$f":"IF(J84=\"\",\"\",INDEX(REFERENTES!$V:$W,MATCH(J84,REFERENTES!$W:$W,0),1))","v":""},"",null,null,80,"",{"$f":"IF(E84<>\"\",CONCATENATE($A$2,DIGITADOR!$B$2,DIGITADOR!$M$1,C84),\"\")","v":""},null,{"$f":"IF(R84=\"\",\"\",INDEX('OTRAS REFERENCIAS'!$L$5:$M$152,MATCH(R84,'OTRAS REFERENCIAS'!$L$5:$L$157,0),2))","v":""},null,{"$f":"IF(T84=\"\",\"\",VLOOKUP(T84,'OTRAS REFERENCIAS'!$A$7:$B$9,2,FALSE))","v":""},null,"",null,null,null,{"$f":"IF(Z84=\"\",\"\",INDEX(REFERENTES!$A:$B,MATCH(Z84,REFERENTES!$B:$B,0),1))","v":""},"",null,null,{"$f":"IF(AD84=\"\",\"\",INDEX(REFERENTES!$D:$E,MATCH(AD84,REFERENTES!$E:$E,0),1))","v":""},{"$f":"IF(AD84=\"\",\"\",INDEX(REFERENTES!$D:$L,MATCH(AD84,REFERENTES!$E:$E,0),6))","v":""}]
[null,null,1,{"$f":"IF(Q85=\"\",\"\",IF(COUNTIF($Q85:Q85, Q85)>1, \"\", Q85))","v":""},null,null,"","","",null,{"$f":"IF(J85=\"\",\"\",INDEX(REFERENTES!$V:$W,MATCH(J85,REFERENTES!$W:$W,0),1))","v":""},"",null,null,81,"",{"$f":"IF(E85<>\"\",CONCATENATE($A$2,DIGITADOR!$B$2,DIGITADOR!$M$1,C85),\"\")","v":""},null,{"$f":"IF(R85=\"\",\"\",INDEX('OTRAS REFERENCIAS'!$L$5:$M$152,MATCH(R85,'OTRAS REFERENCIAS'!$L$5:$L$157,0),2))","v":""},null,{"$f":"IF(T85=\"\",\"\",VLOOKUP(T85,'OTRAS REFERENCIAS'!$A$7:$B$9,2,FALSE))","v":""},null,"",null,null,null,{"$f":"IF(Z85=\"\",\"\",INDEX(REFERENTES!$A:$B,MATCH(Z85,REFERENTES!$B:$B,0),1))","v":""},"",null,null,{"$f":"IF(AD85=\"\",\"\",INDEX(REFERENTES!$D:$E,MATCH(AD85,REFERENTES!$E:$E,0),1))","v":""},{"$f":"IF(AD85=\"\",\"\",INDEX(REFERENTES!$D:$L,MATCH(AD85,REFERENTES!$E:$E,0),6))","v":""}]
[null,null,1,{"$f":"IF(Q86=\"\",\"\",IF(COUNTIF($Q86:Q86, Q86)>1, \"\", Q86))","v":""},null,null,"","","",null,{"$f":"IF(J86=\"\",\"\",INDEX(REFERENTES!$V:$W,MATCH(J86,REFERENTES!$W:$W,0),1))","v":""},"",null,null,82,"",{"$f":"IF(E86<>\"\",CONCATENATE($A$2,DIGITADOR!$B$2,DIGITADOR!$M$1,C86),\"\")","v":""},null,{"$f":"IF(R86=\"\",\"\",INDEX('OTRAS REFERENCIAS'!$L$5:$M$152,MATCH(R86,'OTRAS REFERENCIAS'!$L$5:$L$157,0),2))","v":""},null,{"$f":"IF(T86=\"\",\"\",VLOOKUP(T86,'OTRAS REFERENCIAS'!$A$7:$B$9,2,FALSE))","v":""},null,"",null,null,null,{"$f":"IF(Z86=\"\",\"\",INDEX(REFERENTES!$A:$B,MATCH(Z86,REFERENTES!$B:$B,0),1))","v":""},"",null,null,{"$f":"IF(AD86=\"\",\"\",INDEX(REFERENTES!$D:$E,MATCH(AD86,REFERENTES!$E:$E,0),1))","v":""},{"$f":"IF(AD86=\"\",\"\",INDEX(REFERENTES!$D:$L,MATCH(AD86,REFERENTES!$E:$E,0),6))","v":""}]
[null,null,1,{"$f":"IF(Q87=\"\",\"\",IF(COUNTIF($Q87:Q87, Q87)>1, \"\", Q87))","v":""},null,null,"","","",null,{"$f":"IF(J87=\"\",\"\",INDEX(REFERENTES!$V:$W,MATCH(J87,REFERENTES!$W:$W,0),1))","v":""},"",null,null,83,"",{"$f":"IF(E87<>\"\",CONCATENATE($A$2,DIGITADOR!$B$2,DIGITADOR!$M$1,C87),\"\")","v":""},null,{"$f":"IF(R87=\"\",\"\",INDEX('OTRAS REFERENCIAS'!$L$5:$M$152,MATCH(R87,'OTRAS REFERENCIAS'!$L$5:$L$157,0),2))","v":""},null,{"$f":"IF(T87=\"\",\"\",VLOOKUP(T87,'OTRAS REFERENCIAS'!$A$7:$B$9,2,FALSE))","v":""},null,"",null,null,null,{"$f":"IF(Z87=\"\",\"\",INDEX(REFERENTES!$A:$B,MATCH(Z87,REFERENTES!$B:$B,0),1))","v":""},"",null,null,{"$f":"IF(AD87=\"\",\"\",INDEX(REFERENTES!$D:$E,MATCH(AD87,REFERENTES!$E:$E,0),1))","v":""},{"$f":"IF(AD87=\"\",\"\",INDEX(REFERENTES!$D:$L,MATCH(AD87,REFERENTES!$E:$E,0),6))","v":""}]
[null,null,1,{"$f":"IF(Q88=\"\",\"\",IF(COUNTIF($Q88:Q88, Q88)>1, \"\", Q88))","v":""},null,null,"","","",null,{"$f":"IF(J88=\"\",\"\",INDEX(REFERENTES!$V:$W,MATCH(J88,REFERENTES!$W:$W,0),1))","v":""},"",null,null,84,"",{"$f":"IF(E88<>\"\",CONCATENATE($A$2,DIGITADOR!$B$2,DIGITADOR!$M$1,C88),\"\")","v":""},null,{"$f":"IF(R88=\"\",\"\",INDEX('OTRAS REFERENCIAS'!$L$5:$M$152,MATCH(R88,'OTRAS REFERENCIAS'!$L$5:$L$157,0),2))","v":""},null,{"$f":"IF(T88=\"\",\"\",VLOOKUP(T88,'OTRAS REFERENCIAS'!$A$7:$B$9,2,FALSE))","v":""},null,"",null,null,null,{"$f":"IF(Z88=\"\",\"\",INDEX(REFERENTES!$A:$B,MATCH(Z88,REFERENTES!$B:$B,0),1))","v":""},"",null,null,{"$f":"IF(AD88=\"\",\"\",INDEX(REFERENTES!$D:$E,MATCH(AD88,REFERENTES!$E:$E,0),1))","v":""},{"$f":"IF(AD88=\"\",\"\",INDEX(REFERENTES!$D:$L,MATCH(AD88,REFERENTES!$E:$E,0),6))","v":""}]
[null,null,1,{"$f":"IF(Q89=\"\",\"\",IF(COUNTIF($Q89:Q89, Q89)>1, \"\", Q89))","v":""},null,null,"","","",null,{"$f":"IF(J89=\"\",\"\",INDEX(REFERENTES!$V:$W,MATCH(J89,REFERENTES!$W:$W,0),1))","v":""},"",null,null,85,"",{"$f":"IF(E89<>\"\",CONCATENATE($A$2,DIGITADOR!$B$2,DIGITADOR!$M$1,C89),\"\")","v":""},null,{"$f":"IF(R89=\"\",\"\",INDEX('OTRAS REFERENCIAS'!$L$5:$M$152,MATCH(R89,'OTRAS REFERENCIAS'!$L$5:$L$157,0),2))","v":""},null,{"$f":"IF(T89=\"\",\"\",VLOOKUP(T89,'OTRAS REFERENCIAS'!$A$7:$B$9,2,FALSE))","v":""},null,"",null,null,null,{"$f":"IF(Z89=\"\",\"\",INDEX(REFERENTES!$A:$B,MATCH(Z89,REFERENTES!$B:$B,0),1))","v":""},"",null,null,{"$f":"IF(AD89=\"\",\"\",INDEX(REFERENTES!$D:$E,MATCH(AD89,REFERENTES!$E:$E,0),1))","v":""},{"$f":"IF(AD89=\"\",\"\",INDEX(REFERENTES!$D:$L,MATCH(AD89,REFERENTES!$E:$E,0),6))","v":""}]
[null,null,1,{"$f":"IF(Q90=\"\",\"\",IF(COUNTIF($Q90:Q90, Q90)>1, \"\", Q90))","v":""},null,null,"","","",null,{"$f":"IF(J90=\"\",\"\",INDEX(REFERENTES!$V:$W,MATCH(J90,REFERENTES!$W:$W,0),1))","v":""},"",null,null,86,"",{"$f":"IF(E90<>\"\",CONCATENATE($A$2,DIGITADOR!$B$2,DIGITADOR!$M$1,C90),\"\")","v":""},null,{"$f":"IF(R90=\"\",\"\",INDEX('OTRAS REFERENCIAS'!$L$5:$M$152,MATCH(R90,'OTRAS REFERENCIAS'!$L$5:$L$157,0),2))","v":""},null,{"$f":"IF(T90=\"\",\"\",VLOOKUP(T90,'OTRAS REFERENCIAS'!$A$7:$B$9,2,FALSE))","v":""},null,"",null,null,null,{"$f":"IF(Z90=\"\",\"\",INDEX(REFERENTES!$A:$B,MATCH(Z90,REFERENTES!$B:$B,0),1))","v":""},"",null,null,{"$f":"IF(AD90=\"\",\"\",INDEX(REFERENTES!$D:$E,MATCH(AD90,REFERENTES!$E:$E,0),1))","v":""},{"$f":"IF(AD90=\"\",\"\",INDEX(REFERENTES!$D:$L,MATCH(AD90,REFERENTES!$E:$E,0),6))","v":""}]
[null,null,1,{"$f":"IF(Q91=\"\",\"\",IF(COUNTIF($Q91:Q91, Q91)>1, \"\", Q91))","v":""},null,null,"","","",null,{"$f":"IF(J91=\"\",\"\",INDEX(REFERENTES!$V:$W,MATCH(J91,REFERENTES!$W:$W,0),1))","v":""},"",null,null,87,"",{"$f":"IF(E91<>\"\",CONCATENATE($A$2,DIGITADOR!$B$2,DIGITADOR!$M$1,C91),\"\")","v":""},null,{"$f":"IF(R91=\"\",\"\",INDEX('OTRAS REFERENCIAS'!$L$5:$M$152,MATCH(R91,'OTRAS REFERENCIAS'!$L$5:$L$157,0),2))","v":""},null,{"$f":"IF(T91=\"\",\"\",VLOOKUP(T91,'OTRAS REFERENCIAS'!$A$7:$B$9,2,FALSE))","v":""},null,"",null,null,null,{"$f":"IF(Z91=\"\",\"\",INDEX(REFERENTES!$A:$B,MATCH(Z91,REFERENTES!$B:$B,0),1))","v":""},"",null,null,{"$f":"IF(AD91=\"\",\"\",INDEX(REFERENTES!$D:$E,MATCH(AD91,REFERENTES!$E:$E,0),1))","v":""},{"$f":"IF(AD91=\"\",\"\",INDEX(REFERENTES!$D:$L,MATCH(AD91,REFERENTES!$E:$E,0),6))","v":""}]
[null,null,1,{"$f":"IF(Q92=\"\",\"\",IF(COUNTIF($Q92:Q92, Q92)>1, \"\", Q92))","v":""},null,null,"","","",null,{"$f":"IF(J92=\"\",\"\",INDEX(REFERENTES!$V:$W,MATCH(J92,REFERENTES!$W:$W,0),1))","v":""},"",null,null,88,"",{"$f":"IF(E92<>\"\",CONCATENATE($A$2,DIGITADOR!$B$2,DIGITADOR!$M$1,C92),\"\")","v":""},null,{"$f":"IF(R92=\"\",\"\",INDEX('OTRAS REFERENCIAS'!$L$5:$M$152,MATCH(R92,'OTRAS REFERENCIAS'!$L$5:$L$157,0),2))","v":""},null,{"$f":"IF(T92=\"\",\"\",VLOOKUP(T92,'OTRAS REFERENCIAS'!$A$7:$B$9,2,FALSE))","v":""},null,"",null,null,null,{"$f":"IF(Z92=\"\",\"\",INDEX(REFERENTES!$A:$B,MATCH(Z92,REFERENTES!$B:$B,0),1))","v":""},"",null,null,{"$f":"IF(AD92=\"\",\"\",INDEX(REFERENTES!$D:$E,MATCH(AD92,REFERENTES!$E:$E,0),1))","v":""},{"$f":"IF(AD92=\"\",\"\",INDEX(REFERENTES!$D:$L,MATCH(AD92,REFERENTES!$E:$E,0),6))","v":""}]
[null,null,1,{"$f":"IF(Q93=\"\",\"\",IF(COUNTIF($Q93:Q93, Q93)>1, \"\", Q93))","v":""},null,null,"","","",null,{"$f":"IF(J93=\"\",\"\",INDEX(REFERENTES!$V:$W,MATCH(J93,REFERENTES!$W:$W,0),1))","v":""},"",null,null,89,"",{"$f":"IF(E93<>\"\",CONCATENATE($A$2,DIGITADOR!$B$2,DIGITADOR!$M$1,C93),\"\")","v":""},null,{"$f":"IF(R93=\"\",\"\",INDEX('OTRAS REFERENCIAS'!$L$5:$M$152,MATCH(R93,'OTRAS REFERENCIAS'!$L$5:$L$157,0),2))","v":""},null,{"$f":"IF(T93=\"\",\"\",VLOOKUP(T93,'OTRAS REFERENCIAS'!$A$7:$B$9,2,FALSE))","v":""},null,"",null,null,null,{"$f":"IF(Z93=\"\",\"\",INDEX(REFERENTES!$A:$B,MATCH(Z93,REFERENTES!$B:$B,0),1))","v":""},"",null,null,{"$f":"IF(AD93=\"\",\"\",INDEX(REFERENTES!$D:$E,MATCH(AD93,REFERENTES!$E:$E,0),1))","v":""},{"$f":"IF(AD93=\"\",\"\",INDEX(REFERENTES!$D:$L,MATCH(AD93,REFERENTES!$E:$E,0),6))","v":""}]
[null,null,1,{"$f":"IF(Q94=\"\",\"\",IF(COUNTIF($Q94:Q94, Q94)>1, \"\", Q94))","v":""},null,null,"","","",null,{"$f":"IF(J94=\"\",\"\",INDEX(REFERENTES!$V:$W,MATCH(J94,REFERENTES!$W:$W,0),1))","v":""},"",null,null,90,"",{"$f":"IF(E94<>\"\",CONCATENATE($A$2,DIGITADOR!$B$2,DIGITADOR!$M$1,C94),\"\")","v":""},null,{"$f":"IF(R94=\"\",\"\",INDEX('OTRAS REFERENCIAS'!$L$5:$M$152,MATCH(R94,'OTRAS REFERENCIAS'!$L$5:$L$157,0),2))","v":""},null,{"$f":"IF(T94=\"\",\"\",VLOOKUP(T94,'OTRAS REFERENCIAS'!$A$7:$B$9,2,FALSE))","v":""},null,"",null,null,null,{"$f":"IF(Z94=\"\",\"\",INDEX(REFERENTES!$A:$B,MATCH(Z94,REFERENTES!$B:$B,0),1))","v":""},"",null,null,{"$f":"IF(AD94=\"\",\"\",INDEX(REFERENTES!$D:$E,MATCH(AD94,REFERENTES!$E:$E,0),1))","v":""},{"$f":"IF(AD94=\"\",\"\",INDEX(REFERENTES!$D:$L,MATCH(AD94,REFERENTES!$E:$E,0),6))","v":""}]
[null,null,1,{"$f":"IF(Q95=\"\",\"\",IF(COUNTIF($Q95:Q95, Q95)>1, \"\", Q95))","v":""},null,null,"","","",null,{"$f":"IF(J95=\"\",\"\",INDEX(REFERENTES!$V:$W,MATCH(J95,REFERENTES!$W:$W,0),1))","v":""},"",null,null,91,"",{"$f":"IF(E95<>\"\",CONCATENATE($A$2,DIGITADOR!$B$2,DIGITADOR!$M$1,C95),\"\")","v":""},null,{"$f":"IF(R95=\"\",\"\",INDEX('OTRAS REFERENCIAS'!$L$5:$M$152,MATCH(R95,'OTRAS REFERENCIAS'!$L$5:$L$157,0),2))","v":""},null,{"$f":"IF(T95=\"\",\"\",VLOOKUP(T95,'OTRAS REFERENCIAS'!$A$7:$B$9,2,FALSE))","v":""},null,"",null,null,null,{"$f":"IF(Z95=\"\",\"\",INDEX(REFERENTES!$A:$B,MATCH(Z95,REFERENTES!$B:$B,0),1))","v":""},"",null,null,{"$f":"IF(AD95=\"\",\"\",INDEX(REFERENTES!$D:$E,MATCH(AD95,REFERENTES!$E:$E,0),1))","v":""},{"$f":"IF(AD95=\"\",\"\",INDEX(REFERENTES!$D:$L,MATCH(AD95,REFERENTES!$E:$E,0),6))","v":""}]
[null,null,1,{"$f":"IF(Q96=\"\",\"\",IF(COUNTIF($Q96:Q96, Q96)>1, \"\", Q96))","v":""},null,null,"","","",null,{"$f":"IF(J96=\"\",\"\",INDEX(REFERENTES!$V:$W,MATCH(J96,REFERENTES!$W:$W,0),1))","v":""},"",null,null,92,"",{"$f":"IF(E96<>\"\",CONCATENATE($A$2,DIGITADOR!$B$2,DIGITADOR!$M$1,C96),\"\")","v":""},null,{"$f":"IF(R96=\"\",\"\",INDEX('OTRAS REFERENCIAS'!$L$5:$M$152,MATCH(R96,'OTRAS REFERENCIAS'!$L$5:$L$157,0),2))","v":""},null,{"$f":"IF(T96=\"\",\"\",VLOOKUP(T96,'OTRAS REFERENCIAS'!$A$7:$B$9,2,FALSE))","v":""},null,"",null,null,null,{"$f":"IF(Z96=\"\",\"\",INDEX(REFERENTES!$A:$B,MATCH(Z96,REFERENTES!$B:$B,0),1))","v":""},"",null,null,{"$f":"IF(AD96=\"\",\"\",INDEX(REFERENTES!$D:$E,MATCH(AD96,REFERENTES!$E:$E,0),1))","v":""},{"$f":"IF(AD96=\"\",\"\",INDEX(REFERENTES!$D:$L,MATCH(AD96,REFERENTES!$E:$E,0),6))","v":""}]
[null,null,1,{"$f":"IF(Q97=\"\",\"\",IF(COUNTIF($Q97:Q97, Q97)>1, \"\", Q97))","v":""},null,null,"","","",null,{"$f":"IF(J97=\"\",\"\",INDEX(REFERENTES!$V:$W,MATCH(J97,REFERENTES!$W:$W,0),1))","v":""},"",null,null,93,"",{"$f":"IF(E97<>\"\",CONCATENATE($A$2,DIGITADOR!$B$2,DIGITADOR!$M$1,C97),\"\")","v":""},null,{"$f":"IF(R97=\"\",\"\",INDEX('OTRAS REFERENCIAS'!$L$5:$M$152,MATCH(R97,'OTRAS REFERENCIAS'!$L$5:$L$157,0),2))","v":""},null,{"$f":"IF(T97=\"\",\"\",VLOOKUP(T97,'OTRAS REFERENCIAS'!$A$7:$B$9,2,FALSE))","v":""},null,"",null,null,null,{"$f":"IF(Z97=\"\",\"\",INDEX(REFERENTES!$A:$B,MATCH(Z97,REFERENTES!$B:$B,0),1))","v":""},"",null,null,{"$f":"IF(AD97=\"\",\"\",INDEX(REFERENTES!$D:$E,MATCH(AD97,REFERENTES!$E:$E,0),1))","v":""},{"$f":"IF(AD97=\"\",\"\",INDEX(REFERENTES!$D:$L,MATCH(AD97,REFERENTES!$E:$E,0),6))","v":""}]
[null,null,1,{"$f":"IF(Q98=\"\",\"\",IF(COUNTIF($Q98:Q98, Q98)>1, \"\", Q98))","v":""},null,null,"","","",null,{"$f":"IF(J98=\"\",\"\",INDEX(REFERENTES!$V:$W,MATCH(J98,REFERENTES!$W:$W,0),1))","v":""},"",null,null,94,"",{"$f":"IF(E98<>\"\",CONCATENATE($A$2,DIGITADOR!$B$2,DIGITADOR!$M$1,C98),\"\")","v":""},null,{"$f":"IF(R98=\"\",\"\",INDEX('OTRAS REFERENCIAS'!$L$5:$M$152,MATCH(R98,'OTRAS REFERENCIAS'!$L$5:$L$157,0),2))","v":""},null,{"$f":"IF(T98=\"\",\"\",VLOOKUP(T98,'OTRAS REFERENCIAS'!$A$7:$B$9,2,FALSE))","v":""},null,"",null,null,null,{"$f":"IF(Z98=\"\",\"\",INDEX(REFERENTES!$A:$B,MATCH(Z98,REFERENTES!$B:$B,0),1))","v":""},"",null,null,{"$f":"IF(AD98=\"\",\"\",INDEX(REFERENTES!$D:$E,MATCH(AD98,REFERENTES!$E:$E,0),1))","v":""},{"$f":"IF(AD98=\"\",\"\",INDEX(REFERENTES!$D:$L,MATCH(AD98,REFERENTES!$E:$E,0),6))","v":""}]
[null,null,1,{"$f":"IF(Q99=\"\",\"\",IF(COUNTIF($Q99:Q99, Q99)>1, \"\", Q99))","v":""},null,null,"","","",null,{"$f":"IF(J99=\"\",\"\",INDEX(REFERENTES!$V:$W,MATCH(J99,REFERENTES!$W:$W,0),1))","v":""},"",null,null,95,"",{"$f":"IF(E99<>\"\",CONCATENATE($A$2,DIGITADOR!$B$2,DIGITADOR!$M$1,C99),\"\")","v":""},null,{"$f":"IF(R99=\"\",\"\",INDEX('OTRAS REFERENCIAS'!$L$5:$M$152,MATCH(R99,'OTRAS REFERENCIAS'!$L$5:$L$157,0),2))","v":""},null,{"$f":"IF(T99=\"\",\"\",VLOOKUP(T99,'OTRAS REFERENCIAS'!$A$7:$B$9,2,FALSE))","v":""},null,"",null,null,null,{"$f":"IF(Z99=\"\",\"\",INDEX(REFERENTES!$A:$B,MATCH(Z99,REFERENTES!$B:$B,0),1))","v":""},"",null,null,{"$f":"IF(AD99=\"\",\"\",INDEX(REFERENTES!$D:$E,MATCH(AD99,REFERENTES!$E:$E,0),1))","v":""},{"$f":"IF(AD99=\"\",\"\",INDEX(REFERENTES!$D:$L,MATCH(AD99,REFERENTES!$E:$E,0),6))","v":""}]
[null,null,1,{"$f":"IF(Q100=\"\",\"\",IF(COUNTIF($Q100:Q100, Q100)>1, \"\", Q100))","v":""},null,null,"","","",null,{"$f":"IF(J100=\"\",\"\",INDEX(REFERENTES!$V:$W,MATCH(J100,REFERENTES!$W:$W,0),1))","v":""},"",null,null,96,"",{"$f":"IF(E100<>\"\",CONCATENATE($A$2,DIGITADOR!$B$2,DIGITADOR!$M$1,C100),\"\")","v":""},null,{"$f":"IF(R100=\"\",\"\",INDEX('OTRAS REFERENCIAS'!$L$5:$M$152,MATCH(R100,'OTRAS REFERENCIAS'!$L$5:$L$157,0),2))","v":""},null,{"$f":"IF(T100=\"\",\"\",VLOOKUP(T100,'OTRAS REFERENCIAS'!$A$7:$B$9,2,FALSE))","v":""},null,"",null,null,null,{"$f":"IF(Z100=\"\",\"\",INDEX(REFERENTES!$A:$B,MATCH(Z100,REFERENTES!$B:$B,0),1))","v":""},"",null,null,{"$f":"IF(AD100=\"\",\"\",INDEX(REFERENTES!$D:$E,MATCH(AD100,REFERENTES!$E:$E,0),1))","v":""},{"$f":"IF(AD100=\"\",\"\",INDEX(REFERENTES!$D:$L,MATCH(AD100,REFERENTES!$E:$E,0),6))","v":""}]
[null,null,1,{"$f":"IF(Q101=\"\",\"\",IF(COUNTIF($Q101:Q101, Q101)>1, \"\", Q101))","v":""},null,null,"","","",null,{"$f":"IF(J101=\"\",\"\",INDEX(REFERENTES!$V:$W,MATCH(J101,REFERENTES!$W:$W,0),1))","v":""},"",null,null,97,"",{"$f":"IF(E101<>\"\",CONCATENATE($A$2,DIGITADOR!$B$2,DIGITADOR!$M$1,C101),\"\")","v":""},null,{"$f":"IF(R101=\"\",\"\",INDEX('OTRAS REFERENCIAS'!$L$5:$M$152,MATCH(R101,'OTRAS REFERENCIAS'!$L$5:$L$157,0),2))","v":""},null,{"$f":"IF(T101=\"\",\"\",VLOOKUP(T101,'OTRAS REFERENCIAS'!$A$7:$B$9,2,FALSE))","v":""},null,"",null,null,null,{"$f":"IF(Z101=\"\",\"\",INDEX(REFERENTES!$A:$B,MATCH(Z101,REFERENTES!$B:$B,0),1))","v":""},"",null,null,{"$f":"IF(AD101=\"\",\"\",INDEX(REFERENTES!$D:$E,MATCH(AD101,REFERENTES!$E:$E,0),1))","v":""},{"$f":"IF(AD101=\"\",\"\",INDEX(REFERENTES!$D:$L,MATCH(AD101,REFERENTES!$E:$E,0),6))","v":""}]
[null,null,1,{"$f":"IF(Q102=\"\",\"\",IF(COUNTIF($Q102:Q102, Q102)>1, \"\", Q102))","v":""},null,null,"","","",null,{"$f":"IF(J102=\"\",\"\",INDEX(REFERENTES!$V:$W,MATCH(J102,REFERENTES!$W:$W,0),1))","v":""},"",null,null,98,"",{"$f":"IF(E102<>\"\",CONCATENATE($A$2,DIGITADOR!$B$2,DIGITADOR!$M$1,C102),\"\")","v":""},null,{"$f":"IF(R102=\"\",\"\",INDEX('OTRAS REFERENCIAS'!$L$5:$M$152,MATCH(R102,'OTRAS REFERENCIAS'!$L$5:$L$157,0),2))","v":""},null,{"$f":"IF(T102=\"\",\"\",VLOOKUP(T102,'OTRAS REFERENCIAS'!$A$7:$B$9,2,FALSE))","v":""},null,"",null,null,null,{"$f":"IF(Z102=\"\",\"\",INDEX(REFERENTES!$A:$B,MATCH(Z102,REFERENTES!$B:$B,0),1))","v":""},"",null,null,{"$f":"IF(AD102=\"\",\"\",INDEX(REFERENTES!$D:$E,MATCH(AD102,REFERENTES!$E:$E,0),1))","v":""},{"$f":"IF(AD102=\"\",\"\",INDEX(REFERENTES!$D:$L,MATCH(AD102,REFERENTES!$E:$E,0),6))","v":""}]
[null,null,1,{"$f":"IF(Q103=\"\",\"\",IF(COUNTIF($Q103:Q103, Q103)>1, \"\", Q103))","v":""},null,null,"","","",null,{"$f":"IF(J103=\"\",\"\",INDEX(REFERENTES!$V:$W,MATCH(J103,REFERENTES!$W:$W,0),1))","v":""},"",null,null,99,"",{"$f":"IF(E103<>\"\",CONCATENATE($A$2,DIGITADOR!$B$2,DIGITADOR!$M$1,C103),\"\")","v":""},null,{"$f":"IF(R103=\"\",\"\",INDEX('OTRAS REFERENCIAS'!$L$5:$M$152,MATCH(R103,'OTRAS REFERENCIAS'!$L$5:$L$157,0),2))","v":""},null,{"$f":"IF(T103=\"\",\"\",VLOOKUP(T103,'OTRAS REFERENCIAS'!$A$7:$B$9,2,FALSE))","v":""},null,"",null,null,null,{"$f":"IF(Z103=\"\",\"\",INDEX(REFERENTES!$A:$B,MATCH(Z103,REFERENTES!$B:$B,0),1))","v":""},"",null,null,{"$f":"IF(AD103=\"\",\"\",INDEX(REFERENTES!$D:$E,MATCH(AD103,REFERENTES!$E:$E,0),1))","v":""},{"$f":"IF(AD103=\"\",\"\",INDEX(REFERENTES!$D:$L,MATCH(AD103,REFERENTES!$E:$E,0),6))","v":""}]
[null,null,1,{"$f":"IF(Q104=\"\",\"\",IF(COUNTIF($Q104:Q104, Q104)>1, \"\", Q104))","v":""},null,null,"","","",null,{"$f":"IF(J104=\"\",\"\",INDEX(REFERENTES!$V:$W,MATCH(J104,REFERENTES!$W:$W,0),1))","v":""},"",null,null,100,"",{"$f":"IF(E104<>\"\",CONCATENATE($A$2,DIGITADOR!$B$2,DIGITADOR!$M$1,C104),\"\")","v":""},null,{"$f":"IF(R104=\"\",\"\",INDEX('OTRAS REFERENCIAS'!$L$5:$M$152,MATCH(R104,'OTRAS REFERENCIAS'!$L$5:$L$157,0),2))","v":""},null,{"$f":"IF(T104=\"\",\"\",VLOOKUP(T104,'OTRAS REFERENCIAS'!$A$7:$B$9,2,FALSE))","v":""},null,"",null,null,null,{"$f":"IF(Z104=\"\",\"\",INDEX(REFERENTES!$A:$B,MATCH(Z104,REFERENTES!$B:$B,0),1))","v":""},"",null,null,{"$f":"IF(AD104=\"\",\"\",INDEX(REFERENTES!$D:$E,MATCH(AD104,REFERENTES!$E:$E,0),1))","v":""},{"$f":"IF(AD104=\"\",\"\",INDEX(REFERENTES!$D:$L,MATCH(AD104,REFERENTES!$E:$E,0),6))","v":""}]
[null,null,1,{"$f":"IF(Q105=\"\",\"\",IF(COUNTIF($Q105:Q105, Q105)>1, \"\", Q105))","v":""},null,null,"",{"$f":"IF(G105<>\"\",MONTH(G105),\"\")","v":""},"",null,{"$f":"IF(J105=\"\",\"\",INDEX(REFERENTES!$V:$W,MATCH(J105,REFERENTES!$W:$W,0),1))","v":""},"",null,null,101,"",{"$f":"IF(E105<>\"\",CONCATENATE($A$2,DIGITADOR!$B$2,DIGITADOR!$M$1,C105),\"\")","v":""},null,{"$f":"IF(R105=\"\",\"\",INDEX('OTRAS REFERENCIAS'!$L$5:$M$152,MATCH(R105,'OTRAS REFERENCIAS'!$L$5:$L$157,0),2))","v":""},null,{"$f":"IF(T105=\"\",\"\",VLOOKUP(T105,'OTRAS REFERENCIAS'!$A$7:$B$9,2,FALSE))","v":""},null,"",null,null,null,{"$f":"IF(Z105=\"\",\"\",INDEX(REFERENTES!$A:$B,MATCH(Z105,REFERENTES!$B:$B,0),1))","v":""},"",null,null,{"$f":"IF(AD105=\"\",\"\",INDEX(REFERENTES!$D:$E,MATCH(AD105,REFERENTES!$E:$E,0),1))","v":""},{"$f":"IF(AD105=\"\",\"\",INDEX(REFERENTES!$D:$L,MATCH(AD105,REFERENTES!$E:$E,0),6))","v":""}]
[null,null,1,{"$f":"IF(Q106=\"\",\"\",IF(COUNTIF($Q106:Q106, Q106)>1, \"\", Q106))","v":""},null,null,"","","",null,{"$f":"IF(J106=\"\",\"\",INDEX(REFERENTES!$V:$W,MATCH(J106,REFERENTES!$W:$W,0),1))","v":""},"",null,null,102,"",{"$f":"IF(E106<>\"\",CONCATENATE($A$2,DIGITADOR!$B$2,DIGITADOR!$M$1,C106),\"\")","v":""},null,{"$f":"IF(R106=\"\",\"\",INDEX('OTRAS REFERENCIAS'!$L$5:$M$152,MATCH(R106,'OTRAS REFERENCIAS'!$L$5:$L$157,0),2))","v":""},null,{"$f":"IF(T106=\"\",\"\",VLOOKUP(T106,'OTRAS REFERENCIAS'!$A$7:$B$9,2,FALSE))","v":""},null,"",null,null,null,{"$f":"IF(Z106=\"\",\"\",INDEX(REFERENTES!$A:$B,MATCH(Z106,REFERENTES!$B:$B,0),1))","v":""},"",null,null,{"$f":"IF(AD106=\"\",\"\",INDEX(REFERENTES!$D:$E,MATCH(AD106,REFERENTES!$E:$E,0),1))","v":""},{"$f":"IF(AD106=\"\",\"\",INDEX(REFERENTES!$D:$L,MATCH(AD106,REFERENTES!$E:$E,0),6))","v":""}]
[null,null,1,{"$f":"IF(Q107=\"\",\"\",IF(COUNTIF($Q107:Q107, Q107)>1, \"\", Q107))","v":""},null,null,"","","",null,{"$f":"IF(J107=\"\",\"\",INDEX(REFERENTES!$V:$W,MATCH(J107,REFERENTES!$W:$W,0),1))","v":""},"",null,null,103,"",{"$f":"IF(E107<>\"\",CONCATENATE($A$2,DIGITADOR!$B$2,DIGITADOR!$M$1,C107),\"\")","v":""},null,{"$f":"IF(R107=\"\",\"\",INDEX('OTRAS REFERENCIAS'!$L$5:$M$152,MATCH(R107,'OTRAS REFERENCIAS'!$L$5:$L$157,0),2))","v":""},null,{"$f":"IF(T107=\"\",\"\",VLOOKUP(T107,'OTRAS REFERENCIAS'!$A$7:$B$9,2,FALSE))","v":""},null,"",null,null,null,{"$f":"IF(Z107=\"\",\"\",INDEX(REFERENTES!$A:$B,MATCH(Z107,REFERENTES!$B:$B,0),1))","v":""},"",null,null,{"$f":"IF(AD107=\"\",\"\",INDEX(REFERENTES!$D:$E,MATCH(AD107,REFERENTES!$E:$E,0),1))","v":""},{"$f":"IF(AD107=\"\",\"\",INDEX(REFERENTES!$D:$L,MATCH(AD107,REFERENTES!$E:$E,0),6))","v":""}]
[null,null,1,{"$f":"IF(Q108=\"\",\"\",IF(COUNTIF($Q108:Q108, Q108)>1, \"\", Q108))","v":""},null,null,"","","",null,{"$f":"IF(J108=\"\",\"\",INDEX(REFERENTES!$V:$W,MATCH(J108,REFERENTES!$W:$W,0),1))","v":""},"",null,null,104,"",{"$f":"IF(E108<>\"\",CONCATENATE($A$2,DIGITADOR!$B$2,DIGITADOR!$M$1,C108),\"\")","v":""},null,{"$f":"IF(R108=\"\",\"\",INDEX('OTRAS REFERENCIAS'!$L$5:$M$152,MATCH(R108,'OTRAS REFERENCIAS'!$L$5:$L$157,0),2))","v":""},null,{"$f":"IF(T108=\"\",\"\",VLOOKUP(T108,'OTRAS REFERENCIAS'!$A$7:$B$9,2,FALSE))","v":""},null,"",null,null,null,{"$f":"IF(Z108=\"\",\"\",INDEX(REFERENTES!$A:$B,MATCH(Z108,REFERENTES!$B:$B,0),1))","v":""},"",null,null,{"$f":"IF(AD108=\"\",\"\",INDEX(REFERENTES!$D:$E,MATCH(AD108,REFERENTES!$E:$E,0),1))","v":""},{"$f":"IF(AD108=\"\",\"\",INDEX(REFERENTES!$D:$L,MATCH(AD108,REFERENTES!$E:$E,0),6))","v":""}]
[null,null,1,{"$f":"IF(Q109=\"\",\"\",IF(COUNTIF($Q109:Q109, Q109)>1, \"\", Q109))","v":""},null,null,"","","",null,{"$f":"IF(J109=\"\",\"\",INDEX(REFERENTES!$V:$W,MATCH(J109,REFERENTES!$W:$W,0),1))","v":""},"",null,null,105,"",{"$f":"IF(E109<>\"\",CONCATENATE($A$2,DIGITADOR!$B$2,DIGITADOR!$M$1,C109),\"\")","v":""},null,{"$f":"IF(R109=\"\",\"\",INDEX('OTRAS REFERENCIAS'!$L$5:$M$152,MATCH(R109,'OTRAS REFERENCIAS'!$L$5:$L$157,0),2))","v":""},null,{"$f":"IF(T109=\"\",\"\",VLOOKUP(T109,'OTRAS REFERENCIAS'!$A$7:$B$9,2,FALSE))","v":""},null,"",null,null,null,{"$f":"IF(Z109=\"\",\"\",INDEX(REFERENTES!$A:$B,MATCH(Z109,REFERENTES!$B:$B,0),1))","v":""},"",null,null,{"$f":"IF(AD109=\"\",\"\",INDEX(REFERENTES!$D:$E,MATCH(AD109,REFERENTES!$E:$E,0),1))","v":""},{"$f":"IF(AD109=\"\",\"\",INDEX(REFERENTES!$D:$L,MATCH(AD109,REFERENTES!$E:$E,0),6))","v":""}]
[null,null,1,{"$f":"IF(Q110=\"\",\"\",IF(COUNTIF($Q110:Q110, Q110)>1, \"\", Q110))","v":""},null,null,"","","",null,{"$f":"IF(J110=\"\",\"\",INDEX(REFERENTES!$V:$W,MATCH(J110,REFERENTES!$W:$W,0),1))","v":""},"",null,null,106,"",{"$f":"IF(E110<>\"\",CONCATENATE($A$2,DIGITADOR!$B$2,DIGITADOR!$M$1,C110),\"\")","v":""},null,{"$f":"IF(R110=\"\",\"\",INDEX('OTRAS REFERENCIAS'!$L$5:$M$152,MATCH(R110,'OTRAS REFERENCIAS'!$L$5:$L$157,0),2))","v":""},null,{"$f":"IF(T110=\"\",\"\",VLOOKUP(T110,'OTRAS REFERENCIAS'!$A$7:$B$9,2,FALSE))","v":""},null,"",null,null,null,{"$f":"IF(Z110=\"\",\"\",INDEX(REFERENTES!$A:$B,MATCH(Z110,REFERENTES!$B:$B,0),1))","v":""},"",null,null,{"$f":"IF(AD110=\"\",\"\",INDEX(REFERENTES!$D:$E,MATCH(AD110,REFERENTES!$E:$E,0),1))","v":""},{"$f":"IF(AD110=\"\",\"\",INDEX(REFERENTES!$D:$L,MATCH(AD110,REFERENTES!$E:$E,0),6))","v":""}]
[null,null,1,{"$f":"IF(Q111=\"\",\"\",IF(COUNTIF($Q111:Q111, Q111)>1, \"\", Q111))","v":""},null,null,"","","",null,{"$f":"IF(J111=\"\",\"\",INDEX(REFERENTES!$V:$W,MATCH(J111,REFERENTES!$W:$W,0),1))","v":""},"",null,null,107,"",{"$f":"IF(E111<>\"\",CONCATENATE($A$2,DIGITADOR!$B$2,DIGITADOR!$M$1,C111),\"\")","v":""},null,{"$f":"IF(R111=\"\",\"\",INDEX('OTRAS REFERENCIAS'!$L$5:$M$152,MATCH(R111,'OTRAS REFERENCIAS'!$L$5:$L$157,0),2))","v":""},null,{"$f":"IF(T111=\"\",\"\",VLOOKUP(T111,'OTRAS REFERENCIAS'!$A$7:$B$9,2,FALSE))","v":""},null,"",null,null,null,{"$f":"IF(Z111=\"\",\"\",INDEX(REFERENTES!$A:$B,MATCH(Z111,REFERENTES!$B:$B,0),1))","v":""},"",null,null,{"$f":"IF(AD111=\"\",\"\",INDEX(REFERENTES!$D:$E,MATCH(AD111,REFERENTES!$E:$E,0),1))","v":""},{"$f":"IF(AD111=\"\",\"\",INDEX(REFERENTES!$D:$L,MATCH(AD111,REFERENTES!$E:$E,0),6))","v":""}]
[null,null,1,{"$f":"IF(Q112=\"\",\"\",IF(COUNTIF($Q112:Q112, Q112)>1, \"\", Q112))","v":""},null,null,"","","",null,{"$f":"IF(J112=\"\",\"\",INDEX(REFERENTES!$V:$W,MATCH(J112,REFERENTES!$W:$W,0),1))","v":""},"",null,null,108,"",{"$f":"IF(E112<>\"\",CONCATENATE($A$2,DIGITADOR!$B$2,DIGITADOR!$M$1,C112),\"\")","v":""},null,{"$f":"IF(R112=\"\",\"\",INDEX('OTRAS REFERENCIAS'!$L$5:$M$152,MATCH(R112,'OTRAS REFERENCIAS'!$L$5:$L$157,0),2))","v":""},null,{"$f":"IF(T112=\"\",\"\",VLOOKUP(T112,'OTRAS REFERENCIAS'!$A$7:$B$9,2,FALSE))","v":""},null,"",null,null,null,{"$f":"IF(Z112=\"\",\"\",INDEX(REFERENTES!$A:$B,MATCH(Z112,REFERENTES!$B:$B,0),1))","v":""},"",null,null,{"$f":"IF(AD112=\"\",\"\",INDEX(REFERENTES!$D:$E,MATCH(AD112,REFERENTES!$E:$E,0),1))","v":""},{"$f":"IF(AD112=\"\",\"\",INDEX(REFERENTES!$D:$L,MATCH(AD112,REFERENTES!$E:$E,0),6))","v":""}]
[null,null,1,{"$f":"IF(Q113=\"\",\"\",IF(COUNTIF($Q113:Q113, Q113)>1, \"\", Q113))","v":""},null,null,"","","",null,{"$f":"IF(J113=\"\",\"\",INDEX(REFERENTES!$V:$W,MATCH(J113,REFERENTES!$W:$W,0),1))","v":""},"",null,null,109,"",{"$f":"IF(E113<>\"\",CONCATENATE($A$2,DIGITADOR!$B$2,DIGITADOR!$M$1,C113),\"\")","v":""},null,{"$f":"IF(R113=\"\",\"\",INDEX('OTRAS REFERENCIAS'!$L$5:$M$152,MATCH(R113,'OTRAS REFERENCIAS'!$L$5:$L$157,0),2))","v":""},null,{"$f":"IF(T113=\"\",\"\",VLOOKUP(T113,'OTRAS REFERENCIAS'!$A$7:$B$9,2,FALSE))","v":""},null,"",null,null,null,{"$f":"IF(Z113=\"\",\"\",INDEX(REFERENTES!$A:$B,MATCH(Z113,REFERENTES!$B:$B,0),1))","v":""},"",null,null,{"$f":"IF(AD113=\"\",\"\",INDEX(REFERENTES!$D:$E,MATCH(AD113,REFERENTES!$E:$E,0),1))","v":""},{"$f":"IF(AD113=\"\",\"\",INDEX(REFERENTES!$D:$L,MATCH(AD113,REFERENTES!$E:$E,0),6))","v":""}]
[null,null,1,{"$f":"IF(Q114=\"\",\"\",IF(COUNTIF($Q114:Q114, Q114)>1, \"\", Q114))","v":""},null,null,"","","",null,{"$f":"IF(J114=\"\",\"\",INDEX(REFERENTES!$V:$W,MATCH(J114,REFERENTES!$W:$W,0),1))","v":""},"",null,null,110,"",{"$f":"IF(E114<>\"\",CONCATENATE($A$2,DIGITADOR!$B$2,DIGITADOR!$M$1,C114),\"\")","v":""},null,{"$f":"IF(R114=\"\",\"\",INDEX('OTRAS REFERENCIAS'!$L$5:$M$152,MATCH(R114,'OTRAS REFERENCIAS'!$L$5:$L$157,0),2))","v":""},null,{"$f":"IF(T114=\"\",\"\",VLOOKUP(T114,'OTRAS REFERENCIAS'!$A$7:$B$9,2,FALSE))","v":""},null,"",null,null,null,{"$f":"IF(Z114=\"\",\"\",INDEX(REFERENTES!$A:$B,MATCH(Z114,REFERENTES!$B:$B,0),1))","v":""},"",null,null,{"$f":"IF(AD114=\"\",\"\",INDEX(REFERENTES!$D:$E,MATCH(AD114,REFERENTES!$E:$E,0),1))","v":""},{"$f":"IF(AD114=\"\",\"\",INDEX(REFERENTES!$D:$L,MATCH(AD114,REFERENTES!$E:$E,0),6))","v":""}]
[null,null,1,{"$f":"IF(Q115=\"\",\"\",IF(COUNTIF($Q115:Q115, Q115)>1, \"\", Q115))","v":""},null,null,"","","",null,{"$f":"IF(J115=\"\",\"\",INDEX(REFERENTES!$V:$W,MATCH(J115,REFERENTES!$W:$W,0),1))","v":""},"",null,null,111,"",{"$f":"IF(E115<>\"\",CONCATENATE($A$2,DIGITADOR!$B$2,DIGITADOR!$M$1,C115),\"\")","v":""},null,{"$f":"IF(R115=\"\",\"\",INDEX('OTRAS REFERENCIAS'!$L$5:$M$152,MATCH(R115,'OTRAS REFERENCIAS'!$L$5:$L$157,0),2))","v":""},null,{"$f":"IF(T115=\"\",\"\",VLOOKUP(T115,'OTRAS REFERENCIAS'!$A$7:$B$9,2,FALSE))","v":""},null,"",null,null,null,{"$f":"IF(Z115=\"\",\"\",INDEX(REFERENTES!$A:$B,MATCH(Z115,REFERENTES!$B:$B,0),1))","v":""},"",null,null,{"$f":"IF(AD115=\"\",\"\",INDEX(REFERENTES!$D:$E,MATCH(AD115,REFERENTES!$E:$E,0),1))","v":""},{"$f":"IF(AD115=\"\",\"\",INDEX(REFERENTES!$D:$L,MATCH(AD115,REFERENTES!$E:$E,0),6))","v":""}]
[null,null,1,{"$f":"IF(Q116=\"\",\"\",IF(COUNTIF($Q116:Q116, Q116)>1, \"\", Q116))","v":""},null,null,"","","",null,{"$f":"IF(J116=\"\",\"\",INDEX(REFERENTES!$V:$W,MATCH(J116,REFERENTES!$W:$W,0),1))","v":""},"",null,null,112,"",{"$f":"IF(E116<>\"\",CONCATENATE($A$2,DIGITADOR!$B$2,DIGITADOR!$M$1,C116),\"\")","v":""},null,{"$f":"IF(R116=\"\",\"\",INDEX('OTRAS REFERENCIAS'!$L$5:$M$152,MATCH(R116,'OTRAS REFERENCIAS'!$L$5:$L$157,0),2))","v":""},null,{"$f":"IF(T116=\"\",\"\",VLOOKUP(T116,'OTRAS REFERENCIAS'!$A$7:$B$9,2,FALSE))","v":""},null,"",null,null,null,{"$f":"IF(Z116=\"\",\"\",INDEX(REFERENTES!$A:$B,MATCH(Z116,REFERENTES!$B:$B,0),1))","v":""},"",null,null,{"$f":"IF(AD116=\"\",\"\",INDEX(REFERENTES!$D:$E,MATCH(AD116,REFERENTES!$E:$E,0),1))","v":""},{"$f":"IF(AD116=\"\",\"\",INDEX(REFERENTES!$D:$L,MATCH(AD116,REFERENTES!$E:$E,0),6))","v":""}]
[null,null,1,{"$f":"IF(Q117=\"\",\"\",IF(COUNTIF($Q117:Q117, Q117)>1, \"\", Q117))","v":""},null,null,"","","",null,{"$f":"IF(J117=\"\",\"\",INDEX(REFERENTES!$V:$W,MATCH(J117,REFERENTES!$W:$W,0),1))","v":""},"",null,null,113,"",{"$f":"IF(E117<>\"\",CONCATENATE($A$2,DIGITADOR!$B$2,DIGITADOR!$M$1,C117),\"\")","v":""},null,{"$f":"IF(R117=\"\",\"\",INDEX('OTRAS REFERENCIAS'!$L$5:$M$152,MATCH(R117,'OTRAS REFERENCIAS'!$L$5:$L$157,0),2))","v":""},null,{"$f":"IF(T117=\"\",\"\",VLOOKUP(T117,'OTRAS REFERENCIAS'!$A$7:$B$9,2,FALSE))","v":""},null,"",null,null,null,{"$f":"IF(Z117=\"\",\"\",INDEX(REFERENTES!$A:$B,MATCH(Z117,REFERENTES!$B:$B,0),1))","v":""},"",null,null,{"$f":"IF(AD117=\"\",\"\",INDEX(REFERENTES!$D:$E,MATCH(AD117,REFERENTES!$E:$E,0),1))","v":""},{"$f":"IF(AD117=\"\",\"\",INDEX(REFERENTES!$D:$L,MATCH(AD117,REFERENTES!$E:$E,0),6))","v":""}]
[null,null,1,{"$f":"IF(Q118=\"\",\"\",IF(COUNTIF($Q118:Q118, Q118)>1, \"\", Q118))","v":""},null,null,"","","",null,{"$f":"IF(J118=\"\",\"\",INDEX(REFERENTES!$V:$W,MATCH(J118,REFERENTES!$W:$W,0),1))","v":""},"",null,null,114,"",{"$f":"IF(E118<>\"\",CONCATENATE($A$2,DIGITADOR!$B$2,DIGITADOR!$M$1,C118),\"\")","v":""},null,{"$f":"IF(R118=\"\",\"\",INDEX('OTRAS REFERENCIAS'!$L$5:$M$152,MATCH(R118,'OTRAS REFERENCIAS'!$L$5:$L$157,0),2))","v":""},null,{"$f":"IF(T118=\"\",\"\",VLOOKUP(T118,'OTRAS REFERENCIAS'!$A$7:$B$9,2,FALSE))","v":""},null,"",null,null,null,{"$f":"IF(Z118=\"\",\"\",INDEX(REFERENTES!$A:$B,MATCH(Z118,REFERENTES!$B:$B,0),1))","v":""},"",null,null,{"$f":"IF(AD118=\"\",\"\",INDEX(REFERENTES!$D:$E,MATCH(AD118,REFERENTES!$E:$E,0),1))","v":""},{"$f":"IF(AD118=\"\",\"\",INDEX(REFERENTES!$D:$L,MATCH(AD118,REFERENTES!$E:$E,0),6))","v":""}]
[null,null,1,{"$f":"IF(Q119=\"\",\"\",IF(COUNTIF($Q119:Q119, Q119)>1, \"\", Q119))","v":""},null,null,"","","",null,{"$f":"IF(J119=\"\",\"\",INDEX(REFERENTES!$V:$W,MATCH(J119,REFERENTES!$W:$W,0),1))","v":""},"",null,null,115,"",{"$f":"IF(E119<>\"\",CONCATENATE($A$2,DIGITADOR!$B$2,DIGITADOR!$M$1,C119),\"\")","v":""},null,{"$f":"IF(R119=\"\",\"\",INDEX('OTRAS REFERENCIAS'!$L$5:$M$152,MATCH(R119,'OTRAS REFERENCIAS'!$L$5:$L$157,0),2))","v":""},null,{"$f":"IF(T119=\"\",\"\",VLOOKUP(T119,'OTRAS REFERENCIAS'!$A$7:$B$9,2,FALSE))","v":""},null,"",null,null,null,{"$f":"IF(Z119=\"\",\"\",INDEX(REFERENTES!$A:$B,MATCH(Z119,REFERENTES!$B:$B,0),1))","v":""},"",null,null,{"$f":"IF(AD119=\"\",\"\",INDEX(REFERENTES!$D:$E,MATCH(AD119,REFERENTES!$E:$E,0),1))","v":""},{"$f":"IF(AD119=\"\",\"\",INDEX(REFERENTES!$D:$L,MATCH(AD119,REFERENTES!$E:$E,0),6))","v":""}]
[null,null,1,{"$f":"IF(Q120=\"\",\"\",IF(COUNTIF($Q120:Q120, Q120)>1, \"\", Q120))","v":""},null,null,"","","",null,{"$f":"IF(J120=\"\",\"\",INDEX(REFERENTES!$V:$W,MATCH(J120,REFERENTES!$W:$W,0),1))","v":""},"",null,null,116,"",{"$f":"IF(E120<>\"\",CONCATENATE($A$2,DIGITADOR!$B$2,DIGITADOR!$M$1,C120),\"\")","v":""},null,{"$f":"IF(R120=\"\",\"\",INDEX('OTRAS REFERENCIAS'!$L$5:$M$152,MATCH(R120,'OTRAS REFERENCIAS'!$L$5:$L$157,0),2))","v":""},null,{"$f":"IF(T120=\"\",\"\",VLOOKUP(T120,'OTRAS REFERENCIAS'!$A$7:$B$9,2,FALSE))","v":""},null,"",null,null,null,{"$f":"IF(Z120=\"\",\"\",INDEX(REFERENTES!$A:$B,MATCH(Z120,REFERENTES!$B:$B,0),1))","v":""},"",null,null,{"$f":"IF(AD120=\"\",\"\",INDEX(REFERENTES!$D:$E,MATCH(AD120,REFERENTES!$E:$E,0),1))","v":""},{"$f":"IF(AD120=\"\",\"\",INDEX(REFERENTES!$D:$L,MATCH(AD120,REFERENTES!$E:$E,0),6))","v":""}]
[null,null,1,{"$f":"IF(Q121=\"\",\"\",IF(COUNTIF($Q121:Q121, Q121)>1, \"\", Q121))","v":""},null,null,"","","",null,{"$f":"IF(J121=\"\",\"\",INDEX(REFERENTES!$V:$W,MATCH(J121,REFERENTES!$W:$W,0),1))","v":""},"",null,null,117,"",{"$f":"IF(E121<>\"\",CONCATENATE($A$2,DIGITADOR!$B$2,DIGITADOR!$M$1,C121),\"\")","v":""},null,{"$f":"IF(R121=\"\",\"\",INDEX('OTRAS REFERENCIAS'!$L$5:$M$152,MATCH(R121,'OTRAS REFERENCIAS'!$L$5:$L$157,0),2))","v":""},null,{"$f":"IF(T121=\"\",\"\",VLOOKUP(T121,'OTRAS REFERENCIAS'!$A$7:$B$9,2,FALSE))","v":""},null,"",null,null,null,{"$f":"IF(Z121=\"\",\"\",INDEX(REFERENTES!$A:$B,MATCH(Z121,REFERENTES!$B:$B,0),1))","v":""},"",null,null,{"$f":"IF(AD121=\"\",\"\",INDEX(REFERENTES!$D:$E,MATCH(AD121,REFERENTES!$E:$E,0),1))","v":""},{"$f":"IF(AD121=\"\",\"\",INDEX(REFERENTES!$D:$L,MATCH(AD121,REFERENTES!$E:$E,0),6))","v":""}]
[null,null,1,{"$f":"IF(Q122=\"\",\"\",IF(COUNTIF($Q122:Q122, Q122)>1, \"\", Q122))","v":""},null,null,"","","",null,{"$f":"IF(J122=\"\",\"\",INDEX(REFERENTES!$V:$W,MATCH(J122,REFERENTES!$W:$W,0),1))","v":""},"",null,null,118,"",{"$f":"IF(E122<>\"\",CONCATENATE($A$2,DIGITADOR!$B$2,DIGITADOR!$M$1,C122),\"\")","v":""},null,{"$f":"IF(R122=\"\",\"\",INDEX('OTRAS REFERENCIAS'!$L$5:$M$152,MATCH(R122,'OTRAS REFERENCIAS'!$L$5:$L$157,0),2))","v":""},null,{"$f":"IF(T122=\"\",\"\",VLOOKUP(T122,'OTRAS REFERENCIAS'!$A$7:$B$9,2,FALSE))","v":""},null,"",null,null,null,{"$f":"IF(Z122=\"\",\"\",INDEX(REFERENTES!$A:$B,MATCH(Z122,REFERENTES!$B:$B,0),1))","v":""},"",null,null,{"$f":"IF(AD122=\"\",\"\",INDEX(REFERENTES!$D:$E,MATCH(AD122,REFERENTES!$E:$E,0),1))","v":""},{"$f":"IF(AD122=\"\",\"\",INDEX(REFERENTES!$D:$L,MATCH(AD122,REFERENTES!$E:$E,0),6))","v":""}]
[null,null,1,{"$f":"IF(Q123=\"\",\"\",IF(COUNTIF($Q123:Q123, Q123)>1, \"\", Q123))","v":""},null,null,"","","",null,{"$f":"IF(J123=\"\",\"\",INDEX(REFERENTES!$V:$W,MATCH(J123,REFERENTES!$W:$W,0),1))","v":""},"",null,null,119,"",{"$f":"IF(E123<>\"\",CONCATENATE($A$2,DIGITADOR!$B$2,DIGITADOR!$M$1,C123),\"\")","v":""},null,{"$f":"IF(R123=\"\",\"\",INDEX('OTRAS REFERENCIAS'!$L$5:$M$152,MATCH(R123,'OTRAS REFERENCIAS'!$L$5:$L$157,0),2))","v":""},null,{"$f":"IF(T123=\"\",\"\",VLOOKUP(T123,'OTRAS REFERENCIAS'!$A$7:$B$9,2,FALSE))","v":""},null,"",null,null,null,{"$f":"IF(Z123=\"\",\"\",INDEX(REFERENTES!$A:$B,MATCH(Z123,REFERENTES!$B:$B,0),1))","v":""},"",null,null,{"$f":"IF(AD123=\"\",\"\",INDEX(REFERENTES!$D:$E,MATCH(AD123,REFERENTES!$E:$E,0),1))","v":""},{"$f":"IF(AD123=\"\",\"\",INDEX(REFERENTES!$D:$L,MATCH(AD123,REFERENTES!$E:$E,0),6))","v":""}]
[null,null,1,{"$f":"IF(Q124=\"\",\"\",IF(COUNTIF($Q124:Q124, Q124)>1, \"\", Q124))","v":""},null,null,"","","",null,{"$f":"IF(J124=\"\",\"\",INDEX(REFERENTES!$V:$W,MATCH(J124,REFERENTES!$W:$W,0),1))","v":""},"",null,null,120,"",{"$f":"IF(E124<>\"\",CONCATENATE($A$2,DIGITADOR!$B$2,DIGITADOR!$M$1,C124),\"\")","v":""},null,{"$f":"IF(R124=\"\",\"\",INDEX('OTRAS REFERENCIAS'!$L$5:$M$152,MATCH(R124,'OTRAS REFERENCIAS'!$L$5:$L$157,0),2))","v":""},null,{"$f":"IF(T124=\"\",\"\",VLOOKUP(T124,'OTRAS REFERENCIAS'!$A$7:$B$9,2,FALSE))","v":""},null,"",null,null,null,{"$f":"IF(Z124=\"\",\"\",INDEX(REFERENTES!$A:$B,MATCH(Z124,REFERENTES!$B:$B,0),1))","v":""},"",null,null,{"$f":"IF(AD124=\"\",\"\",INDEX(REFERENTES!$D:$E,MATCH(AD124,REFERENTES!$E:$E,0),1))","v":""},{"$f":"IF(AD124=\"\",\"\",INDEX(REFERENTES!$D:$L,MATCH(AD124,REFERENTES!$E:$E,0),6))","v":""}]
[null,null,1,{"$f":"IF(Q125=\"\",\"\",IF(COUNTIF($Q125:Q125, Q125)>1, \"\", Q125))","v":""},null,null,"","","",null,{"$f":"IF(J125=\"\",\"\",INDEX(REFERENTES!$V:$W,MATCH(J125,REFERENTES!$W:$W,0),1))","v":""},"",null,null,121,"",{"$f":"IF(E125<>\"\",CONCATENATE($A$2,DIGITADOR!$B$2,DIGITADOR!$M$1,C125),\"\")","v":""},null,{"$f":"IF(R125=\"\",\"\",INDEX('OTRAS REFERENCIAS'!$L$5:$M$152,MATCH(R125,'OTRAS REFERENCIAS'!$L$5:$L$157,0),2))","v":""},null,{"$f":"IF(T125=\"\",\"\",VLOOKUP(T125,'OTRAS REFERENCIAS'!$A$7:$B$9,2,FALSE))","v":""},null,"",null,null,null,{"$f":"IF(Z125=\"\",\"\",INDEX(REFERENTES!$A:$B,MATCH(Z125,REFERENTES!$B:$B,0),1))","v":""},"",null,null,{"$f":"IF(AD125=\"\",\"\",INDEX(REFERENTES!$D:$E,MATCH(AD125,REFERENTES!$E:$E,0),1))","v":""},{"$f":"IF(AD125=\"\",\"\",INDEX(REFERENTES!$D:$L,MATCH(AD125,REFERENTES!$E:$E,0),6))","v":""}]
[null,null,1,{"$f":"IF(Q126=\"\",\"\",IF(COUNTIF($Q126:Q126, Q126)>1, \"\", Q126))","v":""},null,null,"","","",null,{"$f":"IF(J126=\"\",\"\",INDEX(REFERENTES!$V:$W,MATCH(J126,REFERENTES!$W:$W,0),1))","v":""},"",null,null,122,"",{"$f":"IF(E126<>\"\",CONCATENATE($A$2,DIGITADOR!$B$2,DIGITADOR!$M$1,C126),\"\")","v":""},null,{"$f":"IF(R126=\"\",\"\",INDEX('OTRAS REFERENCIAS'!$L$5:$M$152,MATCH(R126,'OTRAS REFERENCIAS'!$L$5:$L$157,0),2))","v":""},null,{"$f":"IF(T126=\"\",\"\",VLOOKUP(T126,'OTRAS REFERENCIAS'!$A$7:$B$9,2,FALSE))","v":""},null,"",null,null,null,{"$f":"IF(Z126=\"\",\"\",INDEX(REFERENTES!$A:$B,MATCH(Z126,REFERENTES!$B:$B,0),1))","v":""},"",null,null,{"$f":"IF(AD126=\"\",\"\",INDEX(REFERENTES!$D:$E,MATCH(AD126,REFERENTES!$E:$E,0),1))","v":""},{"$f":"IF(AD126=\"\",\"\",INDEX(REFERENTES!$D:$L,MATCH(AD126,REFERENTES!$E:$E,0),6))","v":""}]
[null,null,1,{"$f":"IF(Q127=\"\",\"\",IF(COUNTIF($Q127:Q127, Q127)>1, \"\", Q127))","v":""},null,null,"","","",null,{"$f":"IF(J127=\"\",\"\",INDEX(REFERENTES!$V:$W,MATCH(J127,REFERENTES!$W:$W,0),1))","v":""},"",null,null,123,"",{"$f":"IF(E127<>\"\",CONCATENATE($A$2,DIGITADOR!$B$2,DIGITADOR!$M$1,C127),\"\")","v":""},null,{"$f":"IF(R127=\"\",\"\",INDEX('OTRAS REFERENCIAS'!$L$5:$M$152,MATCH(R127,'OTRAS REFERENCIAS'!$L$5:$L$157,0),2))","v":""},null,{"$f":"IF(T127=\"\",\"\",VLOOKUP(T127,'OTRAS REFERENCIAS'!$A$7:$B$9,2,FALSE))","v":""},null,"",null,null,null,{"$f":"IF(Z127=\"\",\"\",INDEX(REFERENTES!$A:$B,MATCH(Z127,REFERENTES!$B:$B,0),1))","v":""},"",null,null,{"$f":"IF(AD127=\"\",\"\",INDEX(REFERENTES!$D:$E,MATCH(AD127,REFERENTES!$E:$E,0),1))","v":""},{"$f":"IF(AD127=\"\",\"\",INDEX(REFERENTES!$D:$L,MATCH(AD127,REFERENTES!$E:$E,0),6))","v":""}]
[null,null,1,{"$f":"IF(Q128=\"\",\"\",IF(COUNTIF($Q128:Q128, Q128)>1, \"\", Q128))","v":""},null,null,"","","",null,{"$f":"IF(J128=\"\",\"\",INDEX(REFERENTES!$V:$W,MATCH(J128,REFERENTES!$W:$W,0),1))","v":""},"",null,null,124,"",{"$f":"IF(E128<>\"\",CONCATENATE($A$2,DIGITADOR!$B$2,DIGITADOR!$M$1,C128),\"\")","v":""},null,{"$f":"IF(R128=\"\",\"\",INDEX('OTRAS REFERENCIAS'!$L$5:$M$152,MATCH(R128,'OTRAS REFERENCIAS'!$L$5:$L$157,0),2))","v":""},null,{"$f":"IF(T128=\"\",\"\",VLOOKUP(T128,'OTRAS REFERENCIAS'!$A$7:$B$9,2,FALSE))","v":""},null,"",null,null,null,{"$f":"IF(Z128=\"\",\"\",INDEX(REFERENTES!$A:$B,MATCH(Z128,REFERENTES!$B:$B,0),1))","v":""},"",null,null,{"$f":"IF(AD128=\"\",\"\",INDEX(REFERENTES!$D:$E,MATCH(AD128,REFERENTES!$E:$E,0),1))","v":""},{"$f":"IF(AD128=\"\",\"\",INDEX(REFERENTES!$D:$L,MATCH(AD128,REFERENTES!$E:$E,0),6))","v":""}]
[null,null,1,{"$f":"IF(Q129=\"\",\"\",IF(COUNTIF($Q129:Q129, Q129)>1, \"\", Q129))","v":""},null,null,"","","",null,{"$f":"IF(J129=\"\",\"\",INDEX(REFERENTES!$V:$W,MATCH(J129,REFERENTES!$W:$W,0),1))","v":""},"",null,null,125,"",{"$f":"IF(E129<>\"\",CONCATENATE($A$2,DIGITADOR!$B$2,DIGITADOR!$M$1,C129),\"\")","v":""},null,{"$f":"IF(R129=\"\",\"\",INDEX('OTRAS REFERENCIAS'!$L$5:$M$152,MATCH(R129,'OTRAS REFERENCIAS'!$L$5:$L$157,0),2))","v":""},null,{"$f":"IF(T129=\"\",\"\",VLOOKUP(T129,'OTRAS REFERENCIAS'!$A$7:$B$9,2,FALSE))","v":""},null,"",null,null,null,{"$f":"IF(Z129=\"\",\"\",INDEX(REFERENTES!$A:$B,MATCH(Z129,REFERENTES!$B:$B,0),1))","v":""},"",null,null,{"$f":"IF(AD129=\"\",\"\",INDEX(REFERENTES!$D:$E,MATCH(AD129,REFERENTES!$E:$E,0),1))","v":""},{"$f":"IF(AD129=\"\",\"\",INDEX(REFERENTES!$D:$L,MATCH(AD129,REFERENTES!$E:$E,0),6))","v":""}]
[null,null,1,{"$f":"IF(Q130=\"\",\"\",IF(COUNTIF($Q130:Q130, Q130)>1, \"\", Q130))","v":""},null,null,"","","",null,{"$f":"IF(J130=\"\",\"\",INDEX(REFERENTES!$V:$W,MATCH(J130,REFERENTES!$W:$W,0),1))","v":""},"",null,null,126,"",{"$f":"IF(E130<>\"\",CONCATENATE($A$2,DIGITADOR!$B$2,DIGITADOR!$M$1,C130),\"\")","v":""},null,{"$f":"IF(R130=\"\",\"\",INDEX('OTRAS REFERENCIAS'!$L$5:$M$152,MATCH(R130,'OTRAS REFERENCIAS'!$L$5:$L$157,0),2))","v":""},null,{"$f":"IF(T130=\"\",\"\",VLOOKUP(T130,'OTRAS REFERENCIAS'!$A$7:$B$9,2,FALSE))","v":""},null,"",null,null,null,{"$f":"IF(Z130=\"\",\"\",INDEX(REFERENTES!$A:$B,MATCH(Z130,REFERENTES!$B:$B,0),1))","v":""},"",null,null,{"$f":"IF(AD130=\"\",\"\",INDEX(REFERENTES!$D:$E,MATCH(AD130,REFERENTES!$E:$E,0),1))","v":""},{"$f":"IF(AD130=\"\",\"\",INDEX(REFERENTES!$D:$L,MATCH(AD130,REFERENTES!$E:$E,0),6))","v":""}]
[null,null,1,{"$f":"IF(Q131=\"\",\"\",IF(COUNTIF($Q131:Q131, Q131)>1, \"\", Q131))","v":""},null,null,"","","",null,{"$f":"IF(J131=\"\",\"\",INDEX(REFERENTES!$V:$W,MATCH(J131,REFERENTES!$W:$W,0),1))","v":""},"",null,null,127,"",{"$f":"IF(E131<>\"\",CONCATENATE($A$2,DIGITADOR!$B$2,DIGITADOR!$M$1,C131),\"\")","v":""},null,{"$f":"IF(R131=\"\",\"\",INDEX('OTRAS REFERENCIAS'!$L$5:$M$152,MATCH(R131,'OTRAS REFERENCIAS'!$L$5:$L$157,0),2))","v":""},null,{"$f":"IF(T131=\"\",\"\",VLOOKUP(T131,'OTRAS REFERENCIAS'!$A$7:$B$9,2,FALSE))","v":""},null,"",null,null,null,{"$f":"IF(Z131=\"\",\"\",INDEX(REFERENTES!$A:$B,MATCH(Z131,REFERENTES!$B:$B,0),1))","v":""},"",null,null,{"$f":"IF(AD131=\"\",\"\",INDEX(REFERENTES!$D:$E,MATCH(AD131,REFERENTES!$E:$E,0),1))","v":""},{"$f":"IF(AD131=\"\",\"\",INDEX(REFERENTES!$D:$L,MATCH(AD131,REFERENTES!$E:$E,0),6))","v":""}]
[null,null,1,{"$f":"IF(Q132=\"\",\"\",IF(COUNTIF($Q132:Q132, Q132)>1, \"\", Q132))","v":""},null,null,"","","",null,{"$f":"IF(J132=\"\",\"\",INDEX(REFERENTES!$V:$W,MATCH(J132,REFERENTES!$W:$W,0),1))","v":""},"",null,null,128,"",{"$f":"IF(E132<>\"\",CONCATENATE($A$2,DIGITADOR!$B$2,DIGITADOR!$M$1,C132),\"\")","v":""},null,{"$f":"IF(R132=\"\",\"\",INDEX('OTRAS REFERENCIAS'!$L$5:$M$152,MATCH(R132,'OTRAS REFERENCIAS'!$L$5:$L$157,0),2))","v":""},null,{"$f":"IF(T132=\"\",\"\",VLOOKUP(T132,'OTRAS REFERENCIAS'!$A$7:$B$9,2,FALSE))","v":""},null,"",null,null,null,{"$f":"IF(Z132=\"\",\"\",INDEX(REFERENTES!$A:$B,MATCH(Z132,REFERENTES!$B:$B,0),1))","v":""},"",null,null,{"$f":"IF(AD132=\"\",\"\",INDEX(REFERENTES!$D:$E,MATCH(AD132,REFERENTES!$E:$E,0),1))","v":""},{"$f":"IF(AD132=\"\",\"\",INDEX(REFERENTES!$D:$L,MATCH(AD132,REFERENTES!$E:$E,0),6))","v":""}]
[null,null,{"$f":"IF(L133=L132,C132,C132+1)","v":1},{"$f":"IF(Q133=\"\",\"\",IF(COUNTIF($Q133:Q133, Q133)>1, \"\", Q133))","v":""},null,null,"","","",null,{"$f":"IF(J133=\"\",\"\",INDEX(REFERENTES!$V:$W,MATCH(J133,REFERENTES!$W:$W,0),1))","v":""},{"$f":"IF(G133=\"\",\"\",CONCATENATE(G133,S133,K133,X133))","v":""},null,null,129,"",{"$f":"IF(E133<>\"\",CONCATENATE($A$2,DIGITADOR!$B$2,DIGITADOR!$M$1,C133),\"\")","v":""},null,{"$f":"IF(R133=\"\",\"\",INDEX('OTRAS REFERENCIAS'!$L$5:$M$152,MATCH(R133,'OTRAS REFERENCIAS'!$L$5:$L$157,0),2))","v":""},null,{"$f":"IF(T133=\"\",\"\",VLOOKUP(T133,'OTRAS REFERENCIAS'!$A$7:$B$9,2,FALSE))","v":""},null,"",null,null,null,{"$f":"IF(Z133=\"\",\"\",INDEX(REFERENTES!$A:$B,MATCH(Z133,REFERENTES!$B:$B,0),1))","v":""},"",null,null,{"$f":"IF(AD133=\"\",\"\",INDEX(REFERENTES!$D:$E,MATCH(AD133,REFERENTES!$E:$E,0),1))","v":""},{"$f":"IF(AD133=\"\",\"\",INDEX(REFERENTES!$D:$L,MATCH(AD133,REFERENTES!$E:$E,0),6))","v":""}]
[null,null,1,{"$f":"IF(Q134=\"\",\"\",IF(COUNTIF($Q134:Q134, Q134)>1, \"\", Q134))","v":""},null,null,{"$f":"IF(E134=\"\",\"\",E134+F134)","v":""},"",{"$f":"IF(D134=\"\",\"\",1)","v":""},null,{"$f":"IF(J134=\"\",\"\",INDEX(REFERENTES!$V:$W,MATCH(J134,REFERENTES!$W:$W,0),1))","v":""},"",null,null,130,{"$f":"IF(Q134=\"\",\"\",CONCATENATE(Q134,ROW()-2))","v":""},{"$f":"IF(E134<>\"\",CONCATENATE($A$2,DIGITADOR!$B$2,DIGITADOR!$M$1,C134),\"\")","v":""},null,{"$f":"IF(R134=\"\",\"\",INDEX('OTRAS REFERENCIAS'!$L$5:$M$152,MATCH(R134,'OTRAS REFERENCIAS'!$L$5:$L$157,0),2))","v":""},null,{"$f":"IF(T134=\"\",\"\",VLOOKUP(T134,'OTRAS REFERENCIAS'!$A$7:$B$9,2,FALSE))","v":""},null,{"$f":"CONCATENATE(T134,V134)","v":""},null,null,null,{"$f":"IF(Z134=\"\",\"\",INDEX(REFERENTES!$A:$B,MATCH(Z134,REFERENTES!$B:$B,0),1))","v":""},{"$f":"UPPER(AD134)","v":""},null,null,{"$f":"IF(AD134=\"\",\"\",INDEX(REFERENTES!$D:$E,MATCH(AD134,REFERENTES!$E:$E,0),1))","v":""},{"$f":"IF(AD134=\"\",\"\",INDEX(REFERENTES!$D:$L,MATCH(AD134,REFERENTES!$E:$E,0),6))","v":""}]
[null,null,1,{"$f":"IF(Q135=\"\",\"\",IF(COUNTIF($Q135:Q135, Q135)>1, \"\", Q135))","v":""},null,null,"","","",null,{"$f":"IF(J135=\"\",\"\",INDEX(REFERENTES!$V:$W,MATCH(J135,REFERENTES!$W:$W,0),1))","v":""},"",null,null,131,"",{"$f":"IF(E135<>\"\",CONCATENATE($A$2,DIGITADOR!$B$2,DIGITADOR!$M$1,C135),\"\")","v":""},null,{"$f":"IF(R135=\"\",\"\",INDEX('OTRAS REFERENCIAS'!$L$5:$M$152,MATCH(R135,'OTRAS REFERENCIAS'!$L$5:$L$157,0),2))","v":""},null,{"$f":"IF(T135=\"\",\"\",VLOOKUP(T135,'OTRAS REFERENCIAS'!$A$7:$B$9,2,FALSE))","v":""},null,"",null,null,null,{"$f":"IF(Z135=\"\",\"\",INDEX(REFERENTES!$A:$B,MATCH(Z135,REFERENTES!$B:$B,0),1))","v":""},"",null,null,{"$f":"IF(AD135=\"\",\"\",INDEX(REFERENTES!$D:$E,MATCH(AD135,REFERENTES!$E:$E,0),1))","v":""},{"$f":"IF(AD135=\"\",\"\",INDEX(REFERENTES!$D:$L,MATCH(AD135,REFERENTES!$E:$E,0),6))","v":""}]
[null,null,1,{"$f":"IF(Q136=\"\",\"\",IF(COUNTIF($Q136:Q136, Q136)>1, \"\", Q136))","v":""},null,null,"","","",null,{"$f":"IF(J136=\"\",\"\",INDEX(REFERENTES!$V:$W,MATCH(J136,REFERENTES!$W:$W,0),1))","v":""},"",null,null,132,"",{"$f":"IF(E136<>\"\",CONCATENATE($A$2,DIGITADOR!$B$2,DIGITADOR!$M$1,C136),\"\")","v":""},null,{"$f":"IF(R136=\"\",\"\",INDEX('OTRAS REFERENCIAS'!$L$5:$M$152,MATCH(R136,'OTRAS REFERENCIAS'!$L$5:$L$157,0),2))","v":""},null,{"$f":"IF(T136=\"\",\"\",VLOOKUP(T136,'OTRAS REFERENCIAS'!$A$7:$B$9,2,FALSE))","v":""},null,"",null,null,null,{"$f":"IF(Z136=\"\",\"\",INDEX(REFERENTES!$A:$B,MATCH(Z136,REFERENTES!$B:$B,0),1))","v":""},"",null,null,{"$f":"IF(AD136=\"\",\"\",INDEX(REFERENTES!$D:$E,MATCH(AD136,REFERENTES!$E:$E,0),1))","v":""},{"$f":"IF(AD136=\"\",\"\",INDEX(REFERENTES!$D:$L,MATCH(AD136,REFERENTES!$E:$E,0),6))","v":""}]
[null,null,1,{"$f":"IF(Q137=\"\",\"\",IF(COUNTIF($Q137:Q137, Q137)>1, \"\", Q137))","v":""},null,null,"","","",null,{"$f":"IF(J137=\"\",\"\",INDEX(REFERENTES!$V:$W,MATCH(J137,REFERENTES!$W:$W,0),1))","v":""},"",null,null,133,"",{"$f":"IF(E137<>\"\",CONCATENATE($A$2,DIGITADOR!$B$2,DIGITADOR!$M$1,C137),\"\")","v":""},null,{"$f":"IF(R137=\"\",\"\",INDEX('OTRAS REFERENCIAS'!$L$5:$M$152,MATCH(R137,'OTRAS REFERENCIAS'!$L$5:$L$157,0),2))","v":""},null,{"$f":"IF(T137=\"\",\"\",VLOOKUP(T137,'OTRAS REFERENCIAS'!$A$7:$B$9,2,FALSE))","v":""},null,"",null,null,null,{"$f":"IF(Z137=\"\",\"\",INDEX(REFERENTES!$A:$B,MATCH(Z137,REFERENTES!$B:$B,0),1))","v":""},"",null,null,{"$f":"IF(AD137=\"\",\"\",INDEX(REFERENTES!$D:$E,MATCH(AD137,REFERENTES!$E:$E,0),1))","v":""},{"$f":"IF(AD137=\"\",\"\",INDEX(REFERENTES!$D:$L,MATCH(AD137,REFERENTES!$E:$E,0),6))","v":""}]
[null,null,1,{"$f":"IF(Q138=\"\",\"\",IF(COUNTIF($Q138:Q138, Q138)>1, \"\", Q138))","v":""},null,null,"","","",null,{"$f":"IF(J138=\"\",\"\",INDEX(REFERENTES!$V:$W,MATCH(J138,REFERENTES!$W:$W,0),1))","v":""},"",null,null,134,"",{"$f":"IF(E138<>\"\",CONCATENATE($A$2,DIGITADOR!$B$2,DIGITADOR!$M$1,C138),\"\")","v":""},null,{"$f":"IF(R138=\"\",\"\",INDEX('OTRAS REFERENCIAS'!$L$5:$M$152,MATCH(R138,'OTRAS REFERENCIAS'!$L$5:$L$157,0),2))","v":""},null,{"$f":"IF(T138=\"\",\"\",VLOOKUP(T138,'OTRAS REFERENCIAS'!$A$7:$B$9,2,FALSE))","v":""},null,"",null,null,null,{"$f":"IF(Z138=\"\",\"\",INDEX(REFERENTES!$A:$B,MATCH(Z138,REFERENTES!$B:$B,0),1))","v":""},"",null,null,{"$f":"IF(AD138=\"\",\"\",INDEX(REFERENTES!$D:$E,MATCH(AD138,REFERENTES!$E:$E,0),1))","v":""},{"$f":"IF(AD138=\"\",\"\",INDEX(REFERENTES!$D:$L,MATCH(AD138,REFERENTES!$E:$E,0),6))","v":""}]
[null,null,1,{"$f":"IF(Q139=\"\",\"\",IF(COUNTIF($Q139:Q139, Q139)>1, \"\", Q139))","v":""},null,null,"","","",null,{"$f":"IF(J139=\"\",\"\",INDEX(REFERENTES!$V:$W,MATCH(J139,REFERENTES!$W:$W,0),1))","v":""},"",null,null,135,"",{"$f":"IF(E139<>\"\",CONCATENATE($A$2,DIGITADOR!$B$2,DIGITADOR!$M$1,C139),\"\")","v":""},null,{"$f":"IF(R139=\"\",\"\",INDEX('OTRAS REFERENCIAS'!$L$5:$M$152,MATCH(R139,'OTRAS REFERENCIAS'!$L$5:$L$157,0),2))","v":""},null,{"$f":"IF(T139=\"\",\"\",VLOOKUP(T139,'OTRAS REFERENCIAS'!$A$7:$B$9,2,FALSE))","v":""},null,"",null,null,null,{"$f":"IF(Z139=\"\",\"\",INDEX(REFERENTES!$A:$B,MATCH(Z139,REFERENTES!$B:$B,0),1))","v":""},"",null,null,{"$f":"IF(AD139=\"\",\"\",INDEX(REFERENTES!$D:$E,MATCH(AD139,REFERENTES!$E:$E,0),1))","v":""},{"$f":"IF(AD139=\"\",\"\",INDEX(REFERENTES!$D:$L,MATCH(AD139,REFERENTES!$E:$E,0),6))","v":""}]
[null,null,1,{"$f":"IF(Q140=\"\",\"\",IF(COUNTIF($Q140:Q140, Q140)>1, \"\", Q140))","v":""},null,null,"","","",null,{"$f":"IF(J140=\"\",\"\",INDEX(REFERENTES!$V:$W,MATCH(J140,REFERENTES!$W:$W,0),1))","v":""},"",null,null,136,"",{"$f":"IF(E140<>\"\",CONCATENATE($A$2,DIGITADOR!$B$2,DIGITADOR!$M$1,C140),\"\")","v":""},null,{"$f":"IF(R140=\"\",\"\",INDEX('OTRAS REFERENCIAS'!$L$5:$M$152,MATCH(R140,'OTRAS REFERENCIAS'!$L$5:$L$157,0),2))","v":""},null,{"$f":"IF(T140=\"\",\"\",VLOOKUP(T140,'OTRAS REFERENCIAS'!$A$7:$B$9,2,FALSE))","v":""},null,"",null,null,null,{"$f":"IF(Z140=\"\",\"\",INDEX(REFERENTES!$A:$B,MATCH(Z140,REFERENTES!$B:$B,0),1))","v":""},"",null,null,{"$f":"IF(AD140=\"\",\"\",INDEX(REFERENTES!$D:$E,MATCH(AD140,REFERENTES!$E:$E,0),1))","v":""},{"$f":"IF(AD140=\"\",\"\",INDEX(REFERENTES!$D:$L,MATCH(AD140,REFERENTES!$E:$E,0),6))","v":""}]
[null,null,1,{"$f":"IF(Q141=\"\",\"\",IF(COUNTIF($Q141:Q141, Q141)>1, \"\", Q141))","v":""},null,null,"","","",null,{"$f":"IF(J141=\"\",\"\",INDEX(REFERENTES!$V:$W,MATCH(J141,REFERENTES!$W:$W,0),1))","v":""},"",null,null,137,"",{"$f":"IF(E141<>\"\",CONCATENATE($A$2,DIGITADOR!$B$2,DIGITADOR!$M$1,C141),\"\")","v":""},null,{"$f":"IF(R141=\"\",\"\",INDEX('OTRAS REFERENCIAS'!$L$5:$M$152,MATCH(R141,'OTRAS REFERENCIAS'!$L$5:$L$157,0),2))","v":""},null,{"$f":"IF(T141=\"\",\"\",VLOOKUP(T141,'OTRAS REFERENCIAS'!$A$7:$B$9,2,FALSE))","v":""},null,"",null,null,null,{"$f":"IF(Z141=\"\",\"\",INDEX(REFERENTES!$A:$B,MATCH(Z141,REFERENTES!$B:$B,0),1))","v":""},"",null,null,{"$f":"IF(AD141=\"\",\"\",INDEX(REFERENTES!$D:$E,MATCH(AD141,REFERENTES!$E:$E,0),1))","v":""},{"$f":"IF(AD141=\"\",\"\",INDEX(REFERENTES!$D:$L,MATCH(AD141,REFERENTES!$E:$E,0),6))","v":""}]
[null,null,1,{"$f":"IF(Q142=\"\",\"\",IF(COUNTIF($Q142:Q142, Q142)>1, \"\", Q142))","v":""},null,null,"","","",null,{"$f":"IF(J142=\"\",\"\",INDEX(REFERENTES!$V:$W,MATCH(J142,REFERENTES!$W:$W,0),1))","v":""},"",null,null,138,"",{"$f":"IF(E142<>\"\",CONCATENATE($A$2,DIGITADOR!$B$2,DIGITADOR!$M$1,C142),\"\")","v":""},null,{"$f":"IF(R142=\"\",\"\",INDEX('OTRAS REFERENCIAS'!$L$5:$M$152,MATCH(R142,'OTRAS REFERENCIAS'!$L$5:$L$157,0),2))","v":""},null,{"$f":"IF(T142=\"\",\"\",VLOOKUP(T142,'OTRAS REFERENCIAS'!$A$7:$B$9,2,FALSE))","v":""},null,"",null,null,null,{"$f":"IF(Z142=\"\",\"\",INDEX(REFERENTES!$A:$B,MATCH(Z142,REFERENTES!$B:$B,0),1))","v":""},"",null,null,{"$f":"IF(AD142=\"\",\"\",INDEX(REFERENTES!$D:$E,MATCH(AD142,REFERENTES!$E:$E,0),1))","v":""},{"$f":"IF(AD142=\"\",\"\",INDEX(REFERENTES!$D:$L,MATCH(AD142,REFERENTES!$E:$E,0),6))","v":""}]
[null,null,1,{"$f":"IF(Q143=\"\",\"\",IF(COUNTIF($Q143:Q143, Q143)>1, \"\", Q143))","v":""},null,null,"","","",null,{"$f":"IF(J143=\"\",\"\",INDEX(REFERENTES!$V:$W,MATCH(J143,REFERENTES!$W:$W,0),1))","v":""},"",null,null,139,"",{"$f":"IF(E143<>\"\",CONCATENATE($A$2,DIGITADOR!$B$2,DIGITADOR!$M$1,C143),\"\")","v":""},null,{"$f":"IF(R143=\"\",\"\",INDEX('OTRAS REFERENCIAS'!$L$5:$M$152,MATCH(R143,'OTRAS REFERENCIAS'!$L$5:$L$157,0),2))","v":""},null,{"$f":"IF(T143=\"\",\"\",VLOOKUP(T143,'OTRAS REFERENCIAS'!$A$7:$B$9,2,FALSE))","v":""},null,"",null,null,null,{"$f":"IF(Z143=\"\",\"\",INDEX(REFERENTES!$A:$B,MATCH(Z143,REFERENTES!$B:$B,0),1))","v":""},"",null,null,{"$f":"IF(AD143=\"\",\"\",INDEX(REFERENTES!$D:$E,MATCH(AD143,REFERENTES!$E:$E,0),1))","v":""},{"$f":"IF(AD143=\"\",\"\",INDEX(REFERENTES!$D:$L,MATCH(AD143,REFERENTES!$E:$E,0),6))","v":""}]
[null,null,1,{"$f":"IF(Q144=\"\",\"\",IF(COUNTIF($Q144:Q144, Q144)>1, \"\", Q144))","v":""},null,null,"","","",null,{"$f":"IF(J144=\"\",\"\",INDEX(REFERENTES!$V:$W,MATCH(J144,REFERENTES!$W:$W,0),1))","v":""},"",null,null,140,"",{"$f":"IF(E144<>\"\",CONCATENATE($A$2,DIGITADOR!$B$2,DIGITADOR!$M$1,C144),\"\")","v":""},null,{"$f":"IF(R144=\"\",\"\",INDEX('OTRAS REFERENCIAS'!$L$5:$M$152,MATCH(R144,'OTRAS REFERENCIAS'!$L$5:$L$157,0),2))","v":""},null,{"$f":"IF(T144=\"\",\"\",VLOOKUP(T144,'OTRAS REFERENCIAS'!$A$7:$B$9,2,FALSE))","v":""},null,"",null,null,null,{"$f":"IF(Z144=\"\",\"\",INDEX(REFERENTES!$A:$B,MATCH(Z144,REFERENTES!$B:$B,0),1))","v":""},"",null,null,{"$f":"IF(AD144=\"\",\"\",INDEX(REFERENTES!$D:$E,MATCH(AD144,REFERENTES!$E:$E,0),1))","v":""},{"$f":"IF(AD144=\"\",\"\",INDEX(REFERENTES!$D:$L,MATCH(AD144,REFERENTES!$E:$E,0),6))","v":""}]
[null,null,1,{"$f":"IF(Q145=\"\",\"\",IF(COUNTIF($Q145:Q145, Q145)>1, \"\", Q145))","v":""},null,null,"","","",null,{"$f":"IF(J145=\"\",\"\",INDEX(REFERENTES!$V:$W,MATCH(J145,REFERENTES!$W:$W,0),1))","v":""},"",null,null,141,"",{"$f":"IF(E145<>\"\",CONCATENATE($A$2,DIGITADOR!$B$2,DIGITADOR!$M$1,C145),\"\")","v":""},null,{"$f":"IF(R145=\"\",\"\",INDEX('OTRAS REFERENCIAS'!$L$5:$M$152,MATCH(R145,'OTRAS REFERENCIAS'!$L$5:$L$157,0),2))","v":""},null,{"$f":"IF(T145=\"\",\"\",VLOOKUP(T145,'OTRAS REFERENCIAS'!$A$7:$B$9,2,FALSE))","v":""},null,"",null,null,null,{"$f":"IF(Z145=\"\",\"\",INDEX(REFERENTES!$A:$B,MATCH(Z145,REFERENTES!$B:$B,0),1))","v":""},"",null,null,{"$f":"IF(AD145=\"\",\"\",INDEX(REFERENTES!$D:$E,MATCH(AD145,REFERENTES!$E:$E,0),1))","v":""},{"$f":"IF(AD145=\"\",\"\",INDEX(REFERENTES!$D:$L,MATCH(AD145,REFERENTES!$E:$E,0),6))","v":""}]
[null,null,1,{"$f":"IF(Q146=\"\",\"\",IF(COUNTIF($Q146:Q146, Q146)>1, \"\", Q146))","v":""},null,null,"","","",null,{"$f":"IF(J146=\"\",\"\",INDEX(REFERENTES!$V:$W,MATCH(J146,REFERENTES!$W:$W,0),1))","v":""},"",null,null,142,"",{"$f":"IF(E146<>\"\",CONCATENATE($A$2,DIGITADOR!$B$2,DIGITADOR!$M$1,C146),\"\")","v":""},null,{"$f":"IF(R146=\"\",\"\",INDEX('OTRAS REFERENCIAS'!$L$5:$M$152,MATCH(R146,'OTRAS REFERENCIAS'!$L$5:$L$157,0),2))","v":""},null,{"$f":"IF(T146=\"\",\"\",VLOOKUP(T146,'OTRAS REFERENCIAS'!$A$7:$B$9,2,FALSE))","v":""},null,"",null,null,null,{"$f":"IF(Z146=\"\",\"\",INDEX(REFERENTES!$A:$B,MATCH(Z146,REFERENTES!$B:$B,0),1))","v":""},"",null,null,{"$f":"IF(AD146=\"\",\"\",INDEX(REFERENTES!$D:$E,MATCH(AD146,REFERENTES!$E:$E,0),1))","v":""},{"$f":"IF(AD146=\"\",\"\",INDEX(REFERENTES!$D:$L,MATCH(AD146,REFERENTES!$E:$E,0),6))","v":""}]
[null,null,1,{"$f":"IF(Q147=\"\",\"\",IF(COUNTIF($Q147:Q147, Q147)>1, \"\", Q147))","v":""},null,null,"","","",null,{"$f":"IF(J147=\"\",\"\",INDEX(REFERENTES!$V:$W,MATCH(J147,REFERENTES!$W:$W,0),1))","v":""},"",null,null,143,"",{"$f":"IF(E147<>\"\",CONCATENATE($A$2,DIGITADOR!$B$2,DIGITADOR!$M$1,C147),\"\")","v":""},null,{"$f":"IF(R147=\"\",\"\",INDEX('OTRAS REFERENCIAS'!$L$5:$M$152,MATCH(R147,'OTRAS REFERENCIAS'!$L$5:$L$157,0),2))","v":""},null,{"$f":"IF(T147=\"\",\"\",VLOOKUP(T147,'OTRAS REFERENCIAS'!$A$7:$B$9,2,FALSE))","v":""},null,"",null,null,null,{"$f":"IF(Z147=\"\",\"\",INDEX(REFERENTES!$A:$B,MATCH(Z147,REFERENTES!$B:$B,0),1))","v":""},"",null,null,{"$f":"IF(AD147=\"\",\"\",INDEX(REFERENTES!$D:$E,MATCH(AD147,REFERENTES!$E:$E,0),1))","v":""},{"$f":"IF(AD147=\"\",\"\",INDEX(REFERENTES!$D:$L,MATCH(AD147,REFERENTES!$E:$E,0),6))","v":""}]
[null,null,1,{"$f":"IF(Q148=\"\",\"\",IF(COUNTIF($Q148:Q148, Q148)>1, \"\", Q148))","v":""},null,null,"","","",null,{"$f":"IF(J148=\"\",\"\",INDEX(REFERENTES!$V:$W,MATCH(J148,REFERENTES!$W:$W,0),1))","v":""},"",null,null,144,"",{"$f":"IF(E148<>\"\",CONCATENATE($A$2,DIGITADOR!$B$2,DIGITADOR!$M$1,C148),\"\")","v":""},null,{"$f":"IF(R148=\"\",\"\",INDEX('OTRAS REFERENCIAS'!$L$5:$M$152,MATCH(R148,'OTRAS REFERENCIAS'!$L$5:$L$157,0),2))","v":""},null,{"$f":"IF(T148=\"\",\"\",VLOOKUP(T148,'OTRAS REFERENCIAS'!$A$7:$B$9,2,FALSE))","v":""},null,"",null,null,null,{"$f":"IF(Z148=\"\",\"\",INDEX(REFERENTES!$A:$B,MATCH(Z148,REFERENTES!$B:$B,0),1))","v":""},"",null,null,{"$f":"IF(AD148=\"\",\"\",INDEX(REFERENTES!$D:$E,MATCH(AD148,REFERENTES!$E:$E,0),1))","v":""},{"$f":"IF(AD148=\"\",\"\",INDEX(REFERENTES!$D:$L,MATCH(AD148,REFERENTES!$E:$E,0),6))","v":""}]
[null,null,1,{"$f":"IF(Q149=\"\",\"\",IF(COUNTIF($Q149:Q149, Q149)>1, \"\", Q149))","v":""},null,null,"","","",null,{"$f":"IF(J149=\"\",\"\",INDEX(REFERENTES!$V:$W,MATCH(J149,REFERENTES!$W:$W,0),1))","v":""},"",null,null,145,"",{"$f":"IF(E149<>\"\",CONCATENATE($A$2,DIGITADOR!$B$2,DIGITADOR!$M$1,C149),\"\")","v":""},null,{"$f":"IF(R149=\"\",\"\",INDEX('OTRAS REFERENCIAS'!$L$5:$M$152,MATCH(R149,'OTRAS REFERENCIAS'!$L$5:$L$157,0),2))","v":""},null,{"$f":"IF(T149=\"\",\"\",VLOOKUP(T149,'OTRAS REFERENCIAS'!$A$7:$B$9,2,FALSE))","v":""},null,"",null,null,null,{"$f":"IF(Z149=\"\",\"\",INDEX(REFERENTES!$A:$B,MATCH(Z149,REFERENTES!$B:$B,0),1))","v":""},"",null,null,{"$f":"IF(AD149=\"\",\"\",INDEX(REFERENTES!$D:$E,MATCH(AD149,REFERENTES!$E:$E,0),1))","v":""},{"$f":"IF(AD149=\"\",\"\",INDEX(REFERENTES!$D:$L,MATCH(AD149,REFERENTES!$E:$E,0),6))","v":""}]
[null,null,1,{"$f":"IF(Q150=\"\",\"\",IF(COUNTIF($Q150:Q150, Q150)>1, \"\", Q150))","v":""},null,null,"","","",null,{"$f":"IF(J150=\"\",\"\",INDEX(REFERENTES!$V:$W,MATCH(J150,REFERENTES!$W:$W,0),1))","v":""},"",null,null,146,"",{"$f":"IF(E150<>\"\",CONCATENATE($A$2,DIGITADOR!$B$2,DIGITADOR!$M$1,C150),\"\")","v":""},null,{"$f":"IF(R150=\"\",\"\",INDEX('OTRAS REFERENCIAS'!$L$5:$M$152,MATCH(R150,'OTRAS REFERENCIAS'!$L$5:$L$157,0),2))","v":""},null,{"$f":"IF(T150=\"\",\"\",VLOOKUP(T150,'OTRAS REFERENCIAS'!$A$7:$B$9,2,FALSE))","v":""},null,"",null,null,null,{"$f":"IF(Z150=\"\",\"\",INDEX(REFERENTES!$A:$B,MATCH(Z150,REFERENTES!$B:$B,0),1))","v":""},"",null,null,{"$f":"IF(AD150=\"\",\"\",INDEX(REFERENTES!$D:$E,MATCH(AD150,REFERENTES!$E:$E,0),1))","v":""},{"$f":"IF(AD150=\"\",\"\",INDEX(REFERENTES!$D:$L,MATCH(AD150,REFERENTES!$E:$E,0),6))","v":""}]
[null,null,1,{"$f":"IF(Q151=\"\",\"\",IF(COUNTIF($Q151:Q151, Q151)>1, \"\", Q151))","v":""},null,null,"","","",null,{"$f":"IF(J151=\"\",\"\",INDEX(REFERENTES!$V:$W,MATCH(J151,REFERENTES!$W:$W,0),1))","v":""},"",null,null,147,"",{"$f":"IF(E151<>\"\",CONCATENATE($A$2,DIGITADOR!$B$2,DIGITADOR!$M$1,C151),\"\")","v":""},null,{"$f":"IF(R151=\"\",\"\",INDEX('OTRAS REFERENCIAS'!$L$5:$M$152,MATCH(R151,'OTRAS REFERENCIAS'!$L$5:$L$157,0),2))","v":""},null,{"$f":"IF(T151=\"\",\"\",VLOOKUP(T151,'OTRAS REFERENCIAS'!$A$7:$B$9,2,FALSE))","v":""},null,"",null,null,null,{"$f":"IF(Z151=\"\",\"\",INDEX(REFERENTES!$A:$B,MATCH(Z151,REFERENTES!$B:$B,0),1))","v":""},"",null,null,{"$f":"IF(AD151=\"\",\"\",INDEX(REFERENTES!$D:$E,MATCH(AD151,REFERENTES!$E:$E,0),1))","v":""},{"$f":"IF(AD151=\"\",\"\",INDEX(REFERENTES!$D:$L,MATCH(AD151,REFERENTES!$E:$E,0),6))","v":""}]
[null,null,1,{"$f":"IF(Q152=\"\",\"\",IF(COUNTIF($Q152:Q152, Q152)>1, \"\", Q152))","v":""},null,null,"","","",null,{"$f":"IF(J152=\"\",\"\",INDEX(REFERENTES!$V:$W,MATCH(J152,REFERENTES!$W:$W,0),1))","v":""},"",null,null,148,"",{"$f":"IF(E152<>\"\",CONCATENATE($A$2,DIGITADOR!$B$2,DIGITADOR!$M$1,C152),\"\")","v":""},null,{"$f":"IF(R152=\"\",\"\",INDEX('OTRAS REFERENCIAS'!$L$5:$M$152,MATCH(R152,'OTRAS REFERENCIAS'!$L$5:$L$157,0),2))","v":""},null,{"$f":"IF(T152=\"\",\"\",VLOOKUP(T152,'OTRAS REFERENCIAS'!$A$7:$B$9,2,FALSE))","v":""},null,"",null,null,null,{"$f":"IF(Z152=\"\",\"\",INDEX(REFERENTES!$A:$B,MATCH(Z152,REFERENTES!$B:$B,0),1))","v":""},"",null,null,{"$f":"IF(AD152=\"\",\"\",INDEX(REFERENTES!$D:$E,MATCH(AD152,REFERENTES!$E:$E,0),1))","v":""},{"$f":"IF(AD152=\"\",\"\",INDEX(REFERENTES!$D:$L,MATCH(AD152,REFERENTES!$E:$E,0),6))","v":""}]
[null,null,1,{"$f":"IF(Q153=\"\",\"\",IF(COUNTIF($Q153:Q153, Q153)>1, \"\", Q153))","v":""},null,null,"","","",null,{"$f":"IF(J153=\"\",\"\",INDEX(REFERENTES!$V:$W,MATCH(J153,REFERENTES!$W:$W,0),1))","v":""},"",null,null,149,"",{"$f":"IF(E153<>\"\",CONCATENATE($A$2,DIGITADOR!$B$2,DIGITADOR!$M$1,C153),\"\")","v":""},null,{"$f":"IF(R153=\"\",\"\",INDEX('OTRAS REFERENCIAS'!$L$5:$M$152,MATCH(R153,'OTRAS REFERENCIAS'!$L$5:$L$157,0),2))","v":""},null,{"$f":"IF(T153=\"\",\"\",VLOOKUP(T153,'OTRAS REFERENCIAS'!$A$7:$B$9,2,FALSE))","v":""},null,"",null,null,null,{"$f":"IF(Z153=\"\",\"\",INDEX(REFERENTES!$A:$B,MATCH(Z153,REFERENTES!$B:$B,0),1))","v":""},"",null,null,{"$f":"IF(AD153=\"\",\"\",INDEX(REFERENTES!$D:$E,MATCH(AD153,REFERENTES!$E:$E,0),1))","v":""},{"$f":"IF(AD153=\"\",\"\",INDEX(REFERENTES!$D:$L,MATCH(AD153,REFERENTES!$E:$E,0),6))","v":""}]
[null,null,1,{"$f":"IF(Q154=\"\",\"\",IF(COUNTIF($Q154:Q154, Q154)>1, \"\", Q154))","v":""},null,null,"","","",null,{"$f":"IF(J154=\"\",\"\",INDEX(REFERENTES!$V:$W,MATCH(J154,REFERENTES!$W:$W,0),1))","v":""},"",null,null,150,"",{"$f":"IF(E154<>\"\",CONCATENATE($A$2,DIGITADOR!$B$2,DIGITADOR!$M$1,C154),\"\")","v":""},null,{"$f":"IF(R154=\"\",\"\",INDEX('OTRAS REFERENCIAS'!$L$5:$M$152,MATCH(R154,'OTRAS REFERENCIAS'!$L$5:$L$157,0),2))","v":""},null,{"$f":"IF(T154=\"\",\"\",VLOOKUP(T154,'OTRAS REFERENCIAS'!$A$7:$B$9,2,FALSE))","v":""},null,"",null,null,null,{"$f":"IF(Z154=\"\",\"\",INDEX(REFERENTES!$A:$B,MATCH(Z154,REFERENTES!$B:$B,0),1))","v":""},"",null,null,{"$f":"IF(AD154=\"\",\"\",INDEX(REFERENTES!$D:$E,MATCH(AD154,REFERENTES!$E:$E,0),1))","v":""},{"$f":"IF(AD154=\"\",\"\",INDEX(REFERENTES!$D:$L,MATCH(AD154,REFERENTES!$E:$E,0),6))","v":""}]
[null,null,1,{"$f":"IF(Q155=\"\",\"\",IF(COUNTIF($Q155:Q155, Q155)>1, \"\", Q155))","v":""},null,null,"","","",null,{"$f":"IF(J155=\"\",\"\",INDEX(REFERENTES!$V:$W,MATCH(J155,REFERENTES!$W:$W,0),1))","v":""},"",null,null,151,"",{"$f":"IF(E155<>\"\",CONCATENATE($A$2,DIGITADOR!$B$2,DIGITADOR!$M$1,C155),\"\")","v":""},null,{"$f":"IF(R155=\"\",\"\",INDEX('OTRAS REFERENCIAS'!$L$5:$M$152,MATCH(R155,'OTRAS REFERENCIAS'!$L$5:$L$157,0),2))","v":""},null,{"$f":"IF(T155=\"\",\"\",VLOOKUP(T155,'OTRAS REFERENCIAS'!$A$7:$B$9,2,FALSE))","v":""},null,"",null,null,null,{"$f":"IF(Z155=\"\",\"\",INDEX(REFERENTES!$A:$B,MATCH(Z155,REFERENTES!$B:$B,0),1))","v":""},"",null,null,{"$f":"IF(AD155=\"\",\"\",INDEX(REFERENTES!$D:$E,MATCH(AD155,REFERENTES!$E:$E,0),1))","v":""},{"$f":"IF(AD155=\"\",\"\",INDEX(REFERENTES!$D:$L,MATCH(AD155,REFERENTES!$E:$E,0),6))","v":""}]
[null,null,1,{"$f":"IF(Q156=\"\",\"\",IF(COUNTIF($Q156:Q156, Q156)>1, \"\", Q156))","v":""},null,null,"","","",null,{"$f":"IF(J156=\"\",\"\",INDEX(REFERENTES!$V:$W,MATCH(J156,REFERENTES!$W:$W,0),1))","v":""},"",null,null,152,"",{"$f":"IF(E156<>\"\",CONCATENATE($A$2,DIGITADOR!$B$2,DIGITADOR!$M$1,C156),\"\")","v":""},null,{"$f":"IF(R156=\"\",\"\",INDEX('OTRAS REFERENCIAS'!$L$5:$M$152,MATCH(R156,'OTRAS REFERENCIAS'!$L$5:$L$157,0),2))","v":""},null,{"$f":"IF(T156=\"\",\"\",VLOOKUP(T156,'OTRAS REFERENCIAS'!$A$7:$B$9,2,FALSE))","v":""},null,"",null,null,null,{"$f":"IF(Z156=\"\",\"\",INDEX(REFERENTES!$A:$B,MATCH(Z156,REFERENTES!$B:$B,0),1))","v":""},"",null,null,{"$f":"IF(AD156=\"\",\"\",INDEX(REFERENTES!$D:$E,MATCH(AD156,REFERENTES!$E:$E,0),1))","v":""},{"$f":"IF(AD156=\"\",\"\",INDEX(REFERENTES!$D:$L,MATCH(AD156,REFERENTES!$E:$E,0),6))","v":""}]
[null,null,1,{"$f":"IF(Q157=\"\",\"\",IF(COUNTIF($Q157:Q157, Q157)>1, \"\", Q157))","v":""},null,null,"","","",null,{"$f":"IF(J157=\"\",\"\",INDEX(REFERENTES!$V:$W,MATCH(J157,REFERENTES!$W:$W,0),1))","v":""},"",null,null,153,"",{"$f":"IF(E157<>\"\",CONCATENATE($A$2,DIGITADOR!$B$2,DIGITADOR!$M$1,C157),\"\")","v":""},null,{"$f":"IF(R157=\"\",\"\",INDEX('OTRAS REFERENCIAS'!$L$5:$M$152,MATCH(R157,'OTRAS REFERENCIAS'!$L$5:$L$157,0),2))","v":""},null,{"$f":"IF(T157=\"\",\"\",VLOOKUP(T157,'OTRAS REFERENCIAS'!$A$7:$B$9,2,FALSE))","v":""},null,"",null,null,null,{"$f":"IF(Z157=\"\",\"\",INDEX(REFERENTES!$A:$B,MATCH(Z157,REFERENTES!$B:$B,0),1))","v":""},"",null,null,{"$f":"IF(AD157=\"\",\"\",INDEX(REFERENTES!$D:$E,MATCH(AD157,REFERENTES!$E:$E,0),1))","v":""},{"$f":"IF(AD157=\"\",\"\",INDEX(REFERENTES!$D:$L,MATCH(AD157,REFERENTES!$E:$E,0),6))","v":""}]
[null,null,1,{"$f":"IF(Q158=\"\",\"\",IF(COUNTIF($Q158:Q158, Q158)>1, \"\", Q158))","v":""},null,null,"","","",null,{"$f":"IF(J158=\"\",\"\",INDEX(REFERENTES!$V:$W,MATCH(J158,REFERENTES!$W:$W,0),1))","v":""},"",null,null,154,"",{"$f":"IF(E158<>\"\",CONCATENATE($A$2,DIGITADOR!$B$2,DIGITADOR!$M$1,C158),\"\")","v":""},null,{"$f":"IF(R158=\"\",\"\",INDEX('OTRAS REFERENCIAS'!$L$5:$M$152,MATCH(R158,'OTRAS REFERENCIAS'!$L$5:$L$157,0),2))","v":""},null,{"$f":"IF(T158=\"\",\"\",VLOOKUP(T158,'OTRAS REFERENCIAS'!$A$7:$B$9,2,FALSE))","v":""},null,"",null,null,null,{"$f":"IF(Z158=\"\",\"\",INDEX(REFERENTES!$A:$B,MATCH(Z158,REFERENTES!$B:$B,0),1))","v":""},"",null,null,{"$f":"IF(AD158=\"\",\"\",INDEX(REFERENTES!$D:$E,MATCH(AD158,REFERENTES!$E:$E,0),1))","v":""},{"$f":"IF(AD158=\"\",\"\",INDEX(REFERENTES!$D:$L,MATCH(AD158,REFERENTES!$E:$E,0),6))","v":""}]
[null,null,1,{"$f":"IF(Q159=\"\",\"\",IF(COUNTIF($Q159:Q159, Q159)>1, \"\", Q159))","v":""},null,null,"","","",null,{"$f":"IF(J159=\"\",\"\",INDEX(REFERENTES!$V:$W,MATCH(J159,REFERENTES!$W:$W,0),1))","v":""},"",null,null,155,"",{"$f":"IF(E159<>\"\",CONCATENATE($A$2,DIGITADOR!$B$2,DIGITADOR!$M$1,C159),\"\")","v":""},null,{"$f":"IF(R159=\"\",\"\",INDEX('OTRAS REFERENCIAS'!$L$5:$M$152,MATCH(R159,'OTRAS REFERENCIAS'!$L$5:$L$157,0),2))","v":""},null,{"$f":"IF(T159=\"\",\"\",VLOOKUP(T159,'OTRAS REFERENCIAS'!$A$7:$B$9,2,FALSE))","v":""},null,"",null,null,null,{"$f":"IF(Z159=\"\",\"\",INDEX(REFERENTES!$A:$B,MATCH(Z159,REFERENTES!$B:$B,0),1))","v":""},"",null,null,{"$f":"IF(AD159=\"\",\"\",INDEX(REFERENTES!$D:$E,MATCH(AD159,REFERENTES!$E:$E,0),1))","v":""},{"$f":"IF(AD159=\"\",\"\",INDEX(REFERENTES!$D:$L,MATCH(AD159,REFERENTES!$E:$E,0),6))","v":""}]
[null,null,1,{"$f":"IF(Q160=\"\",\"\",IF(COUNTIF($Q160:Q160, Q160)>1, \"\", Q160))","v":""},null,null,"","","",null,{"$f":"IF(J160=\"\",\"\",INDEX(REFERENTES!$V:$W,MATCH(J160,REFERENTES!$W:$W,0),1))","v":""},"",null,null,156,"",{"$f":"IF(E160<>\"\",CONCATENATE($A$2,DIGITADOR!$B$2,DIGITADOR!$M$1,C160),\"\")","v":""},null,{"$f":"IF(R160=\"\",\"\",INDEX('OTRAS REFERENCIAS'!$L$5:$M$152,MATCH(R160,'OTRAS REFERENCIAS'!$L$5:$L$157,0),2))","v":""},null,{"$f":"IF(T160=\"\",\"\",VLOOKUP(T160,'OTRAS REFERENCIAS'!$A$7:$B$9,2,FALSE))","v":""},null,"",null,null,null,{"$f":"IF(Z160=\"\",\"\",INDEX(REFERENTES!$A:$B,MATCH(Z160,REFERENTES!$B:$B,0),1))","v":""},"",null,null,{"$f":"IF(AD160=\"\",\"\",INDEX(REFERENTES!$D:$E,MATCH(AD160,REFERENTES!$E:$E,0),1))","v":""},{"$f":"IF(AD160=\"\",\"\",INDEX(REFERENTES!$D:$L,MATCH(AD160,REFERENTES!$E:$E,0),6))","v":""}]
[null,null,1,{"$f":"IF(Q161=\"\",\"\",IF(COUNTIF($Q161:Q161, Q161)>1, \"\", Q161))","v":""},null,null,"","","",null,{"$f":"IF(J161=\"\",\"\",INDEX(REFERENTES!$V:$W,MATCH(J161,REFERENTES!$W:$W,0),1))","v":""},"",null,null,157,"",{"$f":"IF(E161<>\"\",CONCATENATE($A$2,DIGITADOR!$B$2,DIGITADOR!$M$1,C161),\"\")","v":""},null,{"$f":"IF(R161=\"\",\"\",INDEX('OTRAS REFERENCIAS'!$L$5:$M$152,MATCH(R161,'OTRAS REFERENCIAS'!$L$5:$L$157,0),2))","v":""},null,{"$f":"IF(T161=\"\",\"\",VLOOKUP(T161,'OTRAS REFERENCIAS'!$A$7:$B$9,2,FALSE))","v":""},null,"",null,null,null,{"$f":"IF(Z161=\"\",\"\",INDEX(REFERENTES!$A:$B,MATCH(Z161,REFERENTES!$B:$B,0),1))","v":""},"",null,null,{"$f":"IF(AD161=\"\",\"\",INDEX(REFERENTES!$D:$E,MATCH(AD161,REFERENTES!$E:$E,0),1))","v":""},{"$f":"IF(AD161=\"\",\"\",INDEX(REFERENTES!$D:$L,MATCH(AD161,REFERENTES!$E:$E,0),6))","v":""}]
[null,null,1,{"$f":"IF(Q162=\"\",\"\",IF(COUNTIF($Q162:Q162, Q162)>1, \"\", Q162))","v":""},null,null,"","","",null,{"$f":"IF(J162=\"\",\"\",INDEX(REFERENTES!$V:$W,MATCH(J162,REFERENTES!$W:$W,0),1))","v":""},"",null,null,158,"",{"$f":"IF(E162<>\"\",CONCATENATE($A$2,DIGITADOR!$B$2,DIGITADOR!$M$1,C162),\"\")","v":""},null,{"$f":"IF(R162=\"\",\"\",INDEX('OTRAS REFERENCIAS'!$L$5:$M$152,MATCH(R162,'OTRAS REFERENCIAS'!$L$5:$L$157,0),2))","v":""},null,{"$f":"IF(T162=\"\",\"\",VLOOKUP(T162,'OTRAS REFERENCIAS'!$A$7:$B$9,2,FALSE))","v":""},null,"",null,null,null,{"$f":"IF(Z162=\"\",\"\",INDEX(REFERENTES!$A:$B,MATCH(Z162,REFERENTES!$B:$B,0),1))","v":""},"",null,null,{"$f":"IF(AD162=\"\",\"\",INDEX(REFERENTES!$D:$E,MATCH(AD162,REFERENTES!$E:$E,0),1))","v":""},{"$f":"IF(AD162=\"\",\"\",INDEX(REFERENTES!$D:$L,MATCH(AD162,REFERENTES!$E:$E,0),6))","v":""}]
[null,null,1,{"$f":"IF(Q163=\"\",\"\",IF(COUNTIF($Q163:Q163, Q163)>1, \"\", Q163))","v":""},null,null,"","","",null,{"$f":"IF(J163=\"\",\"\",INDEX(REFERENTES!$V:$W,MATCH(J163,REFERENTES!$W:$W,0),1))","v":""},"",null,null,159,"",{"$f":"IF(E163<>\"\",CONCATENATE($A$2,DIGITADOR!$B$2,DIGITADOR!$M$1,C163),\"\")","v":""},null,{"$f":"IF(R163=\"\",\"\",INDEX('OTRAS REFERENCIAS'!$L$5:$M$152,MATCH(R163,'OTRAS REFERENCIAS'!$L$5:$L$157,0),2))","v":""},null,{"$f":"IF(T163=\"\",\"\",VLOOKUP(T163,'OTRAS REFERENCIAS'!$A$7:$B$9,2,FALSE))","v":""},null,"",null,null,null,{"$f":"IF(Z163=\"\",\"\",INDEX(REFERENTES!$A:$B,MATCH(Z163,REFERENTES!$B:$B,0),1))","v":""},"",null,null,{"$f":"IF(AD163=\"\",\"\",INDEX(REFERENTES!$D:$E,MATCH(AD163,REFERENTES!$E:$E,0),1))","v":""},{"$f":"IF(AD163=\"\",\"\",INDEX(REFERENTES!$D:$L,MATCH(AD163,REFERENTES!$E:$E,0),6))","v":""}]
[null,null,1,{"$f":"IF(Q164=\"\",\"\",IF(COUNTIF($Q164:Q164, Q164)>1, \"\", Q164))","v":""},null,null,"","","",null,{"$f":"IF(J164=\"\",\"\",INDEX(REFERENTES!$V:$W,MATCH(J164,REFERENTES!$W:$W,0),1))","v":""},"",null,null,160,"",{"$f":"IF(E164<>\"\",CONCATENATE($A$2,DIGITADOR!$B$2,DIGITADOR!$M$1,C164),\"\")","v":""},null,{"$f":"IF(R164=\"\",\"\",INDEX('OTRAS REFERENCIAS'!$L$5:$M$152,MATCH(R164,'OTRAS REFERENCIAS'!$L$5:$L$157,0),2))","v":""},null,{"$f":"IF(T164=\"\",\"\",VLOOKUP(T164,'OTRAS REFERENCIAS'!$A$7:$B$9,2,FALSE))","v":""},null,"",null,null,null,{"$f":"IF(Z164=\"\",\"\",INDEX(REFERENTES!$A:$B,MATCH(Z164,REFERENTES!$B:$B,0),1))","v":""},"",null,null,{"$f":"IF(AD164=\"\",\"\",INDEX(REFERENTES!$D:$E,MATCH(AD164,REFERENTES!$E:$E,0),1))","v":""},{"$f":"IF(AD164=\"\",\"\",INDEX(REFERENTES!$D:$L,MATCH(AD164,REFERENTES!$E:$E,0),6))","v":""}]
[null,null,1,{"$f":"IF(Q165=\"\",\"\",IF(COUNTIF($Q165:Q165, Q165)>1, \"\", Q165))","v":""},null,null,"","","",null,{"$f":"IF(J165=\"\",\"\",INDEX(REFERENTES!$V:$W,MATCH(J165,REFERENTES!$W:$W,0),1))","v":""},"",null,null,161,"",{"$f":"IF(E165<>\"\",CONCATENATE($A$2,DIGITADOR!$B$2,DIGITADOR!$M$1,C165),\"\")","v":""},null,{"$f":"IF(R165=\"\",\"\",INDEX('OTRAS REFERENCIAS'!$L$5:$M$152,MATCH(R165,'OTRAS REFERENCIAS'!$L$5:$L$157,0),2))","v":""},null,{"$f":"IF(T165=\"\",\"\",VLOOKUP(T165,'OTRAS REFERENCIAS'!$A$7:$B$9,2,FALSE))","v":""},null,"",null,null,null,{"$f":"IF(Z165=\"\",\"\",INDEX(REFERENTES!$A:$B,MATCH(Z165,REFERENTES!$B:$B,0),1))","v":""},"",null,null,{"$f":"IF(AD165=\"\",\"\",INDEX(REFERENTES!$D:$E,MATCH(AD165,REFERENTES!$E:$E,0),1))","v":""},{"$f":"IF(AD165=\"\",\"\",INDEX(REFERENTES!$D:$L,MATCH(AD165,REFERENTES!$E:$E,0),6))","v":""}]
[null,null,1,{"$f":"IF(Q166=\"\",\"\",IF(COUNTIF($Q166:Q166, Q166)>1, \"\", Q166))","v":""},null,null,"","","",null,{"$f":"IF(J166=\"\",\"\",INDEX(REFERENTES!$V:$W,MATCH(J166,REFERENTES!$W:$W,0),1))","v":""},"",null,null,162,"",{"$f":"IF(E166<>\"\",CONCATENATE($A$2,DIGITADOR!$B$2,DIGITADOR!$M$1,C166),\"\")","v":""},null,{"$f":"IF(R166=\"\",\"\",INDEX('OTRAS REFERENCIAS'!$L$5:$M$152,MATCH(R166,'OTRAS REFERENCIAS'!$L$5:$L$157,0),2))","v":""},null,{"$f":"IF(T166=\"\",\"\",VLOOKUP(T166,'OTRAS REFERENCIAS'!$A$7:$B$9,2,FALSE))","v":""},null,"",null,null,null,{"$f":"IF(Z166=\"\",\"\",INDEX(REFERENTES!$A:$B,MATCH(Z166,REFERENTES!$B:$B,0),1))","v":""},"",null,null,{"$f":"IF(AD166=\"\",\"\",INDEX(REFERENTES!$D:$E,MATCH(AD166,REFERENTES!$E:$E,0),1))","v":""},{"$f":"IF(AD166=\"\",\"\",INDEX(REFERENTES!$D:$L,MATCH(AD166,REFERENTES!$E:$E,0),6))","v":""}]
[null,null,1,{"$f":"IF(Q167=\"\",\"\",IF(COUNTIF($Q167:Q167, Q167)>1, \"\", Q167))","v":""},null,null,"","","",null,{"$f":"IF(J167=\"\",\"\",INDEX(REFERENTES!$V:$W,MATCH(J167,REFERENTES!$W:$W,0),1))","v":""},"",null,null,163,"",{"$f":"IF(E167<>\"\",CONCATENATE($A$2,DIGITADOR!$B$2,DIGITADOR!$M$1,C167),\"\")","v":""},null,{"$f":"IF(R167=\"\",\"\",INDEX('OTRAS REFERENCIAS'!$L$5:$M$152,MATCH(R167,'OTRAS REFERENCIAS'!$L$5:$L$157,0),2))","v":""},null,{"$f":"IF(T167=\"\",\"\",VLOOKUP(T167,'OTRAS REFERENCIAS'!$A$7:$B$9,2,FALSE))","v":""},null,"",null,null,null,{"$f":"IF(Z167=\"\",\"\",INDEX(REFERENTES!$A:$B,MATCH(Z167,REFERENTES!$B:$B,0),1))","v":""},"",null,null,{"$f":"IF(AD167=\"\",\"\",INDEX(REFERENTES!$D:$E,MATCH(AD167,REFERENTES!$E:$E,0),1))","v":""},{"$f":"IF(AD167=\"\",\"\",INDEX(REFERENTES!$D:$L,MATCH(AD167,REFERENTES!$E:$E,0),6))","v":""}]
[null,null,1,{"$f":"IF(Q168=\"\",\"\",IF(COUNTIF($Q168:Q168, Q168)>1, \"\", Q168))","v":""},null,null,"","","",null,{"$f":"IF(J168=\"\",\"\",INDEX(REFERENTES!$V:$W,MATCH(J168,REFERENTES!$W:$W,0),1))","v":""},"",null,null,164,"",{"$f":"IF(E168<>\"\",CONCATENATE($A$2,DIGITADOR!$B$2,DIGITADOR!$M$1,C168),\"\")","v":""},null,{"$f":"IF(R168=\"\",\"\",INDEX('OTRAS REFERENCIAS'!$L$5:$M$152,MATCH(R168,'OTRAS REFERENCIAS'!$L$5:$L$157,0),2))","v":""},null,{"$f":"IF(T168=\"\",\"\",VLOOKUP(T168,'OTRAS REFERENCIAS'!$A$7:$B$9,2,FALSE))","v":""},null,"",null,null,null,{"$f":"IF(Z168=\"\",\"\",INDEX(REFERENTES!$A:$B,MATCH(Z168,REFERENTES!$B:$B,0),1))","v":""},"",null,null,{"$f":"IF(AD168=\"\",\"\",INDEX(REFERENTES!$D:$E,MATCH(AD168,REFERENTES!$E:$E,0),1))","v":""},{"$f":"IF(AD168=\"\",\"\",INDEX(REFERENTES!$D:$L,MATCH(AD168,REFERENTES!$E:$E,0),6))","v":""}]
[null,null,1,{"$f":"IF(Q169=\"\",\"\",IF(COUNTIF($Q169:Q169, Q169)>1, \"\", Q169))","v":""},null,null,"",{"$f":"IF(G169<>\"\",MONTH(G169),\"\")","v":""},"",null,{"$f":"IF(J169=\"\",\"\",INDEX(REFERENTES!$V:$W,MATCH(J169,REFERENTES!$W:$W,0),1))","v":""},"",null,null,165,"",{"$f":"IF(E169<>\"\",CONCATENATE($A$2,DIGITADOR!$B$2,DIGITADOR!$M$1,C169),\"\")","v":""},null,{"$f":"IF(R169=\"\",\"\",INDEX('OTRAS REFERENCIAS'!$L$5:$M$152,MATCH(R169,'OTRAS REFERENCIAS'!$L$5:$L$157,0),2))","v":""},null,{"$f":"IF(T169=\"\",\"\",VLOOKUP(T169,'OTRAS REFERENCIAS'!$A$7:$B$9,2,FALSE))","v":""},null,"",null,null,null,{"$f":"IF(Z169=\"\",\"\",INDEX(REFERENTES!$A:$B,MATCH(Z169,REFERENTES!$B:$B,0),1))","v":""},"",null,null,{"$f":"IF(AD169=\"\",\"\",INDEX(REFERENTES!$D:$E,MATCH(AD169,REFERENTES!$E:$E,0),1))","v":""},{"$f":"IF(AD169=\"\",\"\",INDEX(REFERENTES!$D:$L,MATCH(AD169,REFERENTES!$E:$E,0),6))","v":""}]
[null,null,1,{"$f":"IF(Q170=\"\",\"\",IF(COUNTIF($Q170:Q170, Q170)>1, \"\", Q170))","v":""},null,null,"","","",null,{"$f":"IF(J170=\"\",\"\",INDEX(REFERENTES!$V:$W,MATCH(J170,REFERENTES!$W:$W,0),1))","v":""},"",null,null,166,"",{"$f":"IF(E170<>\"\",CONCATENATE($A$2,DIGITADOR!$B$2,DIGITADOR!$M$1,C170),\"\")","v":""},null,{"$f":"IF(R170=\"\",\"\",INDEX('OTRAS REFERENCIAS'!$L$5:$M$152,MATCH(R170,'OTRAS REFERENCIAS'!$L$5:$L$157,0),2))","v":""},null,{"$f":"IF(T170=\"\",\"\",VLOOKUP(T170,'OTRAS REFERENCIAS'!$A$7:$B$9,2,FALSE))","v":""},null,"",null,null,null,{"$f":"IF(Z170=\"\",\"\",INDEX(REFERENTES!$A:$B,MATCH(Z170,REFERENTES!$B:$B,0),1))","v":""},"",null,null,{"$f":"IF(AD170=\"\",\"\",INDEX(REFERENTES!$D:$E,MATCH(AD170,REFERENTES!$E:$E,0),1))","v":""},{"$f":"IF(AD170=\"\",\"\",INDEX(REFERENTES!$D:$L,MATCH(AD170,REFERENTES!$E:$E,0),6))","v":""}]
[null,null,1,{"$f":"IF(Q171=\"\",\"\",IF(COUNTIF($Q171:Q171, Q171)>1, \"\", Q171))","v":""},null,null,"","","",null,{"$f":"IF(J171=\"\",\"\",INDEX(REFERENTES!$V:$W,MATCH(J171,REFERENTES!$W:$W,0),1))","v":""},"",null,null,167,"",{"$f":"IF(E171<>\"\",CONCATENATE($A$2,DIGITADOR!$B$2,DIGITADOR!$M$1,C171),\"\")","v":""},null,{"$f":"IF(R171=\"\",\"\",INDEX('OTRAS REFERENCIAS'!$L$5:$M$152,MATCH(R171,'OTRAS REFERENCIAS'!$L$5:$L$157,0),2))","v":""},null,{"$f":"IF(T171=\"\",\"\",VLOOKUP(T171,'OTRAS REFERENCIAS'!$A$7:$B$9,2,FALSE))","v":""},null,"",null,null,null,{"$f":"IF(Z171=\"\",\"\",INDEX(REFERENTES!$A:$B,MATCH(Z171,REFERENTES!$B:$B,0),1))","v":""},"",null,null,{"$f":"IF(AD171=\"\",\"\",INDEX(REFERENTES!$D:$E,MATCH(AD171,REFERENTES!$E:$E,0),1))","v":""},{"$f":"IF(AD171=\"\",\"\",INDEX(REFERENTES!$D:$L,MATCH(AD171,REFERENTES!$E:$E,0),6))","v":""}]
[null,null,1,{"$f":"IF(Q172=\"\",\"\",IF(COUNTIF($Q172:Q172, Q172)>1, \"\", Q172))","v":""},null,null,"","","",null,{"$f":"IF(J172=\"\",\"\",INDEX(REFERENTES!$V:$W,MATCH(J172,REFERENTES!$W:$W,0),1))","v":""},"",null,null,168,"",{"$f":"IF(E172<>\"\",CONCATENATE($A$2,DIGITADOR!$B$2,DIGITADOR!$M$1,C172),\"\")","v":""},null,{"$f":"IF(R172=\"\",\"\",INDEX('OTRAS REFERENCIAS'!$L$5:$M$152,MATCH(R172,'OTRAS REFERENCIAS'!$L$5:$L$157,0),2))","v":""},null,{"$f":"IF(T172=\"\",\"\",VLOOKUP(T172,'OTRAS REFERENCIAS'!$A$7:$B$9,2,FALSE))","v":""},null,"",null,null,null,{"$f":"IF(Z172=\"\",\"\",INDEX(REFERENTES!$A:$B,MATCH(Z172,REFERENTES!$B:$B,0),1))","v":""},"",null,null,{"$f":"IF(AD172=\"\",\"\",INDEX(REFERENTES!$D:$E,MATCH(AD172,REFERENTES!$E:$E,0),1))","v":""},{"$f":"IF(AD172=\"\",\"\",INDEX(REFERENTES!$D:$L,MATCH(AD172,REFERENTES!$E:$E,0),6))","v":""}]
[null,null,1,{"$f":"IF(Q173=\"\",\"\",IF(COUNTIF($Q173:Q173, Q173)>1, \"\", Q173))","v":""},null,null,"","","",null,{"$f":"IF(J173=\"\",\"\",INDEX(REFERENTES!$V:$W,MATCH(J173,REFERENTES!$W:$W,0),1))","v":""},"",null,null,169,"",{"$f":"IF(E173<>\"\",CONCATENATE($A$2,DIGITADOR!$B$2,DIGITADOR!$M$1,C173),\"\")","v":""},null,{"$f":"IF(R173=\"\",\"\",INDEX('OTRAS REFERENCIAS'!$L$5:$M$152,MATCH(R173,'OTRAS REFERENCIAS'!$L$5:$L$157,0),2))","v":""},null,{"$f":"IF(T173=\"\",\"\",VLOOKUP(T173,'OTRAS REFERENCIAS'!$A$7:$B$9,2,FALSE))","v":""},null,"",null,null,null,{"$f":"IF(Z173=\"\",\"\",INDEX(REFERENTES!$A:$B,MATCH(Z173,REFERENTES!$B:$B,0),1))","v":""},"",null,null,{"$f":"IF(AD173=\"\",\"\",INDEX(REFERENTES!$D:$E,MATCH(AD173,REFERENTES!$E:$E,0),1))","v":""},{"$f":"IF(AD173=\"\",\"\",INDEX(REFERENTES!$D:$L,MATCH(AD173,REFERENTES!$E:$E,0),6))","v":""}]
[null,null,1,{"$f":"IF(Q174=\"\",\"\",IF(COUNTIF($Q174:Q174, Q174)>1, \"\", Q174))","v":""},null,null,"","","",null,{"$f":"IF(J174=\"\",\"\",INDEX(REFERENTES!$V:$W,MATCH(J174,REFERENTES!$W:$W,0),1))","v":""},"",null,null,170,"",{"$f":"IF(E174<>\"\",CONCATENATE($A$2,DIGITADOR!$B$2,DIGITADOR!$M$1,C174),\"\")","v":""},null,{"$f":"IF(R174=\"\",\"\",INDEX('OTRAS REFERENCIAS'!$L$5:$M$152,MATCH(R174,'OTRAS REFERENCIAS'!$L$5:$L$157,0),2))","v":""},null,{"$f":"IF(T174=\"\",\"\",VLOOKUP(T174,'OTRAS REFERENCIAS'!$A$7:$B$9,2,FALSE))","v":""},null,"",null,null,null,{"$f":"IF(Z174=\"\",\"\",INDEX(REFERENTES!$A:$B,MATCH(Z174,REFERENTES!$B:$B,0),1))","v":""},"",null,null,{"$f":"IF(AD174=\"\",\"\",INDEX(REFERENTES!$D:$E,MATCH(AD174,REFERENTES!$E:$E,0),1))","v":""},{"$f":"IF(AD174=\"\",\"\",INDEX(REFERENTES!$D:$L,MATCH(AD174,REFERENTES!$E:$E,0),6))","v":""}]
[null,null,1,{"$f":"IF(Q175=\"\",\"\",IF(COUNTIF($Q175:Q175, Q175)>1, \"\", Q175))","v":""},null,null,"","","",null,{"$f":"IF(J175=\"\",\"\",INDEX(REFERENTES!$V:$W,MATCH(J175,REFERENTES!$W:$W,0),1))","v":""},"",null,null,171,"",{"$f":"IF(E175<>\"\",CONCATENATE($A$2,DIGITADOR!$B$2,DIGITADOR!$M$1,C175),\"\")","v":""},null,{"$f":"IF(R175=\"\",\"\",INDEX('OTRAS REFERENCIAS'!$L$5:$M$152,MATCH(R175,'OTRAS REFERENCIAS'!$L$5:$L$157,0),2))","v":""},null,{"$f":"IF(T175=\"\",\"\",VLOOKUP(T175,'OTRAS REFERENCIAS'!$A$7:$B$9,2,FALSE))","v":""},null,"",null,null,null,{"$f":"IF(Z175=\"\",\"\",INDEX(REFERENTES!$A:$B,MATCH(Z175,REFERENTES!$B:$B,0),1))","v":""},"",null,null,{"$f":"IF(AD175=\"\",\"\",INDEX(REFERENTES!$D:$E,MATCH(AD175,REFERENTES!$E:$E,0),1))","v":""},{"$f":"IF(AD175=\"\",\"\",INDEX(REFERENTES!$D:$L,MATCH(AD175,REFERENTES!$E:$E,0),6))","v":""}]
[null,null,1,{"$f":"IF(Q176=\"\",\"\",IF(COUNTIF($Q176:Q176, Q176)>1, \"\", Q176))","v":""},null,null,"","","",null,{"$f":"IF(J176=\"\",\"\",INDEX(REFERENTES!$V:$W,MATCH(J176,REFERENTES!$W:$W,0),1))","v":""},"",null,null,172,"",{"$f":"IF(E176<>\"\",CONCATENATE($A$2,DIGITADOR!$B$2,DIGITADOR!$M$1,C176),\"\")","v":""},null,{"$f":"IF(R176=\"\",\"\",INDEX('OTRAS REFERENCIAS'!$L$5:$M$152,MATCH(R176,'OTRAS REFERENCIAS'!$L$5:$L$157,0),2))","v":""},null,{"$f":"IF(T176=\"\",\"\",VLOOKUP(T176,'OTRAS REFERENCIAS'!$A$7:$B$9,2,FALSE))","v":""},null,"",null,null,null,{"$f":"IF(Z176=\"\",\"\",INDEX(REFERENTES!$A:$B,MATCH(Z176,REFERENTES!$B:$B,0),1))","v":""},"",null,null,{"$f":"IF(AD176=\"\",\"\",INDEX(REFERENTES!$D:$E,MATCH(AD176,REFERENTES!$E:$E,0),1))","v":""},{"$f":"IF(AD176=\"\",\"\",INDEX(REFERENTES!$D:$L,MATCH(AD176,REFERENTES!$E:$E,0),6))","v":""}]
[null,null,1,{"$f":"IF(Q177=\"\",\"\",IF(COUNTIF($Q177:Q177, Q177)>1, \"\", Q177))","v":""},null,null,"","","",null,{"$f":"IF(J177=\"\",\"\",INDEX(REFERENTES!$V:$W,MATCH(J177,REFERENTES!$W:$W,0),1))","v":""},"",null,null,173,"",{"$f":"IF(E177<>\"\",CONCATENATE($A$2,DIGITADOR!$B$2,DIGITADOR!$M$1,C177),\"\")","v":""},null,{"$f":"IF(R177=\"\",\"\",INDEX('OTRAS REFERENCIAS'!$L$5:$M$152,MATCH(R177,'OTRAS REFERENCIAS'!$L$5:$L$157,0),2))","v":""},null,{"$f":"IF(T177=\"\",\"\",VLOOKUP(T177,'OTRAS REFERENCIAS'!$A$7:$B$9,2,FALSE))","v":""},null,"",null,null,null,{"$f":"IF(Z177=\"\",\"\",INDEX(REFERENTES!$A:$B,MATCH(Z177,REFERENTES!$B:$B,0),1))","v":""},"",null,null,{"$f":"IF(AD177=\"\",\"\",INDEX(REFERENTES!$D:$E,MATCH(AD177,REFERENTES!$E:$E,0),1))","v":""},{"$f":"IF(AD177=\"\",\"\",INDEX(REFERENTES!$D:$L,MATCH(AD177,REFERENTES!$E:$E,0),6))","v":""}]
[null,null,1,{"$f":"IF(Q178=\"\",\"\",IF(COUNTIF($Q178:Q178, Q178)>1, \"\", Q178))","v":""},null,null,"","","",null,{"$f":"IF(J178=\"\",\"\",INDEX(REFERENTES!$V:$W,MATCH(J178,REFERENTES!$W:$W,0),1))","v":""},"",null,null,174,"",{"$f":"IF(E178<>\"\",CONCATENATE($A$2,DIGITADOR!$B$2,DIGITADOR!$M$1,C178),\"\")","v":""},null,{"$f":"IF(R178=\"\",\"\",INDEX('OTRAS REFERENCIAS'!$L$5:$M$152,MATCH(R178,'OTRAS REFERENCIAS'!$L$5:$L$157,0),2))","v":""},null,{"$f":"IF(T178=\"\",\"\",VLOOKUP(T178,'OTRAS REFERENCIAS'!$A$7:$B$9,2,FALSE))","v":""},null,"",null,null,null,{"$f":"IF(Z178=\"\",\"\",INDEX(REFERENTES!$A:$B,MATCH(Z178,REFERENTES!$B:$B,0),1))","v":""},"",null,null,{"$f":"IF(AD178=\"\",\"\",INDEX(REFERENTES!$D:$E,MATCH(AD178,REFERENTES!$E:$E,0),1))","v":""},{"$f":"IF(AD178=\"\",\"\",INDEX(REFERENTES!$D:$L,MATCH(AD178,REFERENTES!$E:$E,0),6))","v":""}]
[null,null,1,{"$f":"IF(Q179=\"\",\"\",IF(COUNTIF($Q179:Q179, Q179)>1, \"\", Q179))","v":""},null,null,"","","",null,{"$f":"IF(J179=\"\",\"\",INDEX(REFERENTES!$V:$W,MATCH(J179,REFERENTES!$W:$W,0),1))","v":""},"",null,null,175,"",{"$f":"IF(E179<>\"\",CONCATENATE($A$2,DIGITADOR!$B$2,DIGITADOR!$M$1,C179),\"\")","v":""},null,{"$f":"IF(R179=\"\",\"\",INDEX('OTRAS REFERENCIAS'!$L$5:$M$152,MATCH(R179,'OTRAS REFERENCIAS'!$L$5:$L$157,0),2))","v":""},null,{"$f":"IF(T179=\"\",\"\",VLOOKUP(T179,'OTRAS REFERENCIAS'!$A$7:$B$9,2,FALSE))","v":""},null,"",null,null,null,{"$f":"IF(Z179=\"\",\"\",INDEX(REFERENTES!$A:$B,MATCH(Z179,REFERENTES!$B:$B,0),1))","v":""},"",null,null,{"$f":"IF(AD179=\"\",\"\",INDEX(REFERENTES!$D:$E,MATCH(AD179,REFERENTES!$E:$E,0),1))","v":""},{"$f":"IF(AD179=\"\",\"\",INDEX(REFERENTES!$D:$L,MATCH(AD179,REFERENTES!$E:$E,0),6))","v":""}]
[null,null,1,{"$f":"IF(Q180=\"\",\"\",IF(COUNTIF($Q180:Q180, Q180)>1, \"\", Q180))","v":""},null,null,"","","",null,{"$f":"IF(J180=\"\",\"\",INDEX(REFERENTES!$V:$W,MATCH(J180,REFERENTES!$W:$W,0),1))","v":""},"",null,null,176,"",{"$f":"IF(E180<>\"\",CONCATENATE($A$2,DIGITADOR!$B$2,DIGITADOR!$M$1,C180),\"\")","v":""},null,{"$f":"IF(R180=\"\",\"\",INDEX('OTRAS REFERENCIAS'!$L$5:$M$152,MATCH(R180,'OTRAS REFERENCIAS'!$L$5:$L$157,0),2))","v":""},null,{"$f":"IF(T180=\"\",\"\",VLOOKUP(T180,'OTRAS REFERENCIAS'!$A$7:$B$9,2,FALSE))","v":""},null,"",null,null,null,{"$f":"IF(Z180=\"\",\"\",INDEX(REFERENTES!$A:$B,MATCH(Z180,REFERENTES!$B:$B,0),1))","v":""},"",null,null,{"$f":"IF(AD180=\"\",\"\",INDEX(REFERENTES!$D:$E,MATCH(AD180,REFERENTES!$E:$E,0),1))","v":""},{"$f":"IF(AD180=\"\",\"\",INDEX(REFERENTES!$D:$L,MATCH(AD180,REFERENTES!$E:$E,0),6))","v":""}]
[null,null,1,{"$f":"IF(Q181=\"\",\"\",IF(COUNTIF($Q181:Q181, Q181)>1, \"\", Q181))","v":""},null,null,"","","",null,{"$f":"IF(J181=\"\",\"\",INDEX(REFERENTES!$V:$W,MATCH(J181,REFERENTES!$W:$W,0),1))","v":""},"",null,null,177,"",{"$f":"IF(E181<>\"\",CONCATENATE($A$2,DIGITADOR!$B$2,DIGITADOR!$M$1,C181),\"\")","v":""},null,{"$f":"IF(R181=\"\",\"\",INDEX('OTRAS REFERENCIAS'!$L$5:$M$152,MATCH(R181,'OTRAS REFERENCIAS'!$L$5:$L$157,0),2))","v":""},null,{"$f":"IF(T181=\"\",\"\",VLOOKUP(T181,'OTRAS REFERENCIAS'!$A$7:$B$9,2,FALSE))","v":""},null,"",null,null,null,{"$f":"IF(Z181=\"\",\"\",INDEX(REFERENTES!$A:$B,MATCH(Z181,REFERENTES!$B:$B,0),1))","v":""},"",null,null,{"$f":"IF(AD181=\"\",\"\",INDEX(REFERENTES!$D:$E,MATCH(AD181,REFERENTES!$E:$E,0),1))","v":""},{"$f":"IF(AD181=\"\",\"\",INDEX(REFERENTES!$D:$L,MATCH(AD181,REFERENTES!$E:$E,0),6))","v":""}]
[null,null,1,{"$f":"IF(Q182=\"\",\"\",IF(COUNTIF($Q182:Q182, Q182)>1, \"\", Q182))","v":""},null,null,"","","",null,{"$f":"IF(J182=\"\",\"\",INDEX(REFERENTES!$V:$W,MATCH(J182,REFERENTES!$W:$W,0),1))","v":""},"",null,null,178,"",{"$f":"IF(E182<>\"\",CONCATENATE($A$2,DIGITADOR!$B$2,DIGITADOR!$M$1,C182),\"\")","v":""},null,{"$f":"IF(R182=\"\",\"\",INDEX('OTRAS REFERENCIAS'!$L$5:$M$152,MATCH(R182,'OTRAS REFERENCIAS'!$L$5:$L$157,0),2))","v":""},null,{"$f":"IF(T182=\"\",\"\",VLOOKUP(T182,'OTRAS REFERENCIAS'!$A$7:$B$9,2,FALSE))","v":""},null,"",null,null,null,{"$f":"IF(Z182=\"\",\"\",INDEX(REFERENTES!$A:$B,MATCH(Z182,REFERENTES!$B:$B,0),1))","v":""},"",null,null,{"$f":"IF(AD182=\"\",\"\",INDEX(REFERENTES!$D:$E,MATCH(AD182,REFERENTES!$E:$E,0),1))","v":""},{"$f":"IF(AD182=\"\",\"\",INDEX(REFERENTES!$D:$L,MATCH(AD182,REFERENTES!$E:$E,0),6))","v":""}]
[null,null,1,{"$f":"IF(Q183=\"\",\"\",IF(COUNTIF($Q183:Q183, Q183)>1, \"\", Q183))","v":""},null,null,"","","",null,{"$f":"IF(J183=\"\",\"\",INDEX(REFERENTES!$V:$W,MATCH(J183,REFERENTES!$W:$W,0),1))","v":""},"",null,null,179,"",{"$f":"IF(E183<>\"\",CONCATENATE($A$2,DIGITADOR!$B$2,DIGITADOR!$M$1,C183),\"\")","v":""},null,{"$f":"IF(R183=\"\",\"\",INDEX('OTRAS REFERENCIAS'!$L$5:$M$152,MATCH(R183,'OTRAS REFERENCIAS'!$L$5:$L$157,0),2))","v":""},null,{"$f":"IF(T183=\"\",\"\",VLOOKUP(T183,'OTRAS REFERENCIAS'!$A$7:$B$9,2,FALSE))","v":""},null,"",null,null,null,{"$f":"IF(Z183=\"\",\"\",INDEX(REFERENTES!$A:$B,MATCH(Z183,REFERENTES!$B:$B,0),1))","v":""},"",null,null,{"$f":"IF(AD183=\"\",\"\",INDEX(REFERENTES!$D:$E,MATCH(AD183,REFERENTES!$E:$E,0),1))","v":""},{"$f":"IF(AD183=\"\",\"\",INDEX(REFERENTES!$D:$L,MATCH(AD183,REFERENTES!$E:$E,0),6))","v":""}]
[null,null,1,{"$f":"IF(Q184=\"\",\"\",IF(COUNTIF($Q184:Q184, Q184)>1, \"\", Q184))","v":""},null,null,"","","",null,{"$f":"IF(J184=\"\",\"\",INDEX(REFERENTES!$V:$W,MATCH(J184,REFERENTES!$W:$W,0),1))","v":""},"",null,null,180,"",{"$f":"IF(E184<>\"\",CONCATENATE($A$2,DIGITADOR!$B$2,DIGITADOR!$M$1,C184),\"\")","v":""},null,{"$f":"IF(R184=\"\",\"\",INDEX('OTRAS REFERENCIAS'!$L$5:$M$152,MATCH(R184,'OTRAS REFERENCIAS'!$L$5:$L$157,0),2))","v":""},null,{"$f":"IF(T184=\"\",\"\",VLOOKUP(T184,'OTRAS REFERENCIAS'!$A$7:$B$9,2,FALSE))","v":""},null,"",null,null,null,{"$f":"IF(Z184=\"\",\"\",INDEX(REFERENTES!$A:$B,MATCH(Z184,REFERENTES!$B:$B,0),1))","v":""},"",null,null,{"$f":"IF(AD184=\"\",\"\",INDEX(REFERENTES!$D:$E,MATCH(AD184,REFERENTES!$E:$E,0),1))","v":""},{"$f":"IF(AD184=\"\",\"\",INDEX(REFERENTES!$D:$L,MATCH(AD184,REFERENTES!$E:$E,0),6))","v":""}]
[null,null,1,{"$f":"IF(Q185=\"\",\"\",IF(COUNTIF($Q185:Q185, Q185)>1, \"\", Q185))","v":""},null,null,"","","",null,{"$f":"IF(J185=\"\",\"\",INDEX(REFERENTES!$V:$W,MATCH(J185,REFERENTES!$W:$W,0),1))","v":""},"",null,null,181,"",{"$f":"IF(E185<>\"\",CONCATENATE($A$2,DIGITADOR!$B$2,DIGITADOR!$M$1,C185),\"\")","v":""},null,{"$f":"IF(R185=\"\",\"\",INDEX('OTRAS REFERENCIAS'!$L$5:$M$152,MATCH(R185,'OTRAS REFERENCIAS'!$L$5:$L$157,0),2))","v":""},null,{"$f":"IF(T185=\"\",\"\",VLOOKUP(T185,'OTRAS REFERENCIAS'!$A$7:$B$9,2,FALSE))","v":""},null,"",null,null,null,{"$f":"IF(Z185=\"\",\"\",INDEX(REFERENTES!$A:$B,MATCH(Z185,REFERENTES!$B:$B,0),1))","v":""},"",null,null,{"$f":"IF(AD185=\"\",\"\",INDEX(REFERENTES!$D:$E,MATCH(AD185,REFERENTES!$E:$E,0),1))","v":""},{"$f":"IF(AD185=\"\",\"\",INDEX(REFERENTES!$D:$L,MATCH(AD185,REFERENTES!$E:$E,0),6))","v":""}]
[null,null,1,{"$f":"IF(Q186=\"\",\"\",IF(COUNTIF($Q186:Q186, Q186)>1, \"\", Q186))","v":""},null,null,"","","",null,{"$f":"IF(J186=\"\",\"\",INDEX(REFERENTES!$V:$W,MATCH(J186,REFERENTES!$W:$W,0),1))","v":""},"",null,null,182,"",{"$f":"IF(E186<>\"\",CONCATENATE($A$2,DIGITADOR!$B$2,DIGITADOR!$M$1,C186),\"\")","v":""},null,{"$f":"IF(R186=\"\",\"\",INDEX('OTRAS REFERENCIAS'!$L$5:$M$152,MATCH(R186,'OTRAS REFERENCIAS'!$L$5:$L$157,0),2))","v":""},null,{"$f":"IF(T186=\"\",\"\",VLOOKUP(T186,'OTRAS REFERENCIAS'!$A$7:$B$9,2,FALSE))","v":""},null,"",null,null,null,{"$f":"IF(Z186=\"\",\"\",INDEX(REFERENTES!$A:$B,MATCH(Z186,REFERENTES!$B:$B,0),1))","v":""},"",null,null,{"$f":"IF(AD186=\"\",\"\",INDEX(REFERENTES!$D:$E,MATCH(AD186,REFERENTES!$E:$E,0),1))","v":""},{"$f":"IF(AD186=\"\",\"\",INDEX(REFERENTES!$D:$L,MATCH(AD186,REFERENTES!$E:$E,0),6))","v":""}]
[null,null,1,{"$f":"IF(Q187=\"\",\"\",IF(COUNTIF($Q187:Q187, Q187)>1, \"\", Q187))","v":""},null,null,"","","",null,{"$f":"IF(J187=\"\",\"\",INDEX(REFERENTES!$V:$W,MATCH(J187,REFERENTES!$W:$W,0),1))","v":""},"",null,null,183,"",{"$f":"IF(E187<>\"\",CONCATENATE($A$2,DIGITADOR!$B$2,DIGITADOR!$M$1,C187),\"\")","v":""},null,{"$f":"IF(R187=\"\",\"\",INDEX('OTRAS REFERENCIAS'!$L$5:$M$152,MATCH(R187,'OTRAS REFERENCIAS'!$L$5:$L$157,0),2))","v":""},null,{"$f":"IF(T187=\"\",\"\",VLOOKUP(T187,'OTRAS REFERENCIAS'!$A$7:$B$9,2,FALSE))","v":""},null,"",null,null,null,{"$f":"IF(Z187=\"\",\"\",INDEX(REFERENTES!$A:$B,MATCH(Z187,REFERENTES!$B:$B,0),1))","v":""},"",null,null,{"$f":"IF(AD187=\"\",\"\",INDEX(REFERENTES!$D:$E,MATCH(AD187,REFERENTES!$E:$E,0),1))","v":""},{"$f":"IF(AD187=\"\",\"\",INDEX(REFERENTES!$D:$L,MATCH(AD187,REFERENTES!$E:$E,0),6))","v":""}]
[null,null,1,{"$f":"IF(Q188=\"\",\"\",IF(COUNTIF($Q188:Q188, Q188)>1, \"\", Q188))","v":""},null,null,"","","",null,{"$f":"IF(J188=\"\",\"\",INDEX(REFERENTES!$V:$W,MATCH(J188,REFERENTES!$W:$W,0),1))","v":""},"",null,null,184,"",{"$f":"IF(E188<>\"\",CONCATENATE($A$2,DIGITADOR!$B$2,DIGITADOR!$M$1,C188),\"\")","v":""},null,{"$f":"IF(R188=\"\",\"\",INDEX('OTRAS REFERENCIAS'!$L$5:$M$152,MATCH(R188,'OTRAS REFERENCIAS'!$L$5:$L$157,0),2))","v":""},null,{"$f":"IF(T188=\"\",\"\",VLOOKUP(T188,'OTRAS REFERENCIAS'!$A$7:$B$9,2,FALSE))","v":""},null,"",null,null,null,{"$f":"IF(Z188=\"\",\"\",INDEX(REFERENTES!$A:$B,MATCH(Z188,REFERENTES!$B:$B,0),1))","v":""},"",null,null,{"$f":"IF(AD188=\"\",\"\",INDEX(REFERENTES!$D:$E,MATCH(AD188,REFERENTES!$E:$E,0),1))","v":""},{"$f":"IF(AD188=\"\",\"\",INDEX(REFERENTES!$D:$L,MATCH(AD188,REFERENTES!$E:$E,0),6))","v":""}]
[null,null,1,{"$f":"IF(Q189=\"\",\"\",IF(COUNTIF($Q189:Q189, Q189)>1, \"\", Q189))","v":""},null,null,"","","",null,{"$f":"IF(J189=\"\",\"\",INDEX(REFERENTES!$V:$W,MATCH(J189,REFERENTES!$W:$W,0),1))","v":""},"",null,null,185,"",{"$f":"IF(E189<>\"\",CONCATENATE($A$2,DIGITADOR!$B$2,DIGITADOR!$M$1,C189),\"\")","v":""},null,{"$f":"IF(R189=\"\",\"\",INDEX('OTRAS REFERENCIAS'!$L$5:$M$152,MATCH(R189,'OTRAS REFERENCIAS'!$L$5:$L$157,0),2))","v":""},null,{"$f":"IF(T189=\"\",\"\",VLOOKUP(T189,'OTRAS REFERENCIAS'!$A$7:$B$9,2,FALSE))","v":""},null,"",null,null,null,{"$f":"IF(Z189=\"\",\"\",INDEX(REFERENTES!$A:$B,MATCH(Z189,REFERENTES!$B:$B,0),1))","v":""},"",null,null,{"$f":"IF(AD189=\"\",\"\",INDEX(REFERENTES!$D:$E,MATCH(AD189,REFERENTES!$E:$E,0),1))","v":""},{"$f":"IF(AD189=\"\",\"\",INDEX(REFERENTES!$D:$L,MATCH(AD189,REFERENTES!$E:$E,0),6))","v":""}]
[null,null,1,{"$f":"IF(Q190=\"\",\"\",IF(COUNTIF($Q190:Q190, Q190)>1, \"\", Q190))","v":""},null,null,"","","",null,{"$f":"IF(J190=\"\",\"\",INDEX(REFERENTES!$V:$W,MATCH(J190,REFERENTES!$W:$W,0),1))","v":""},"",null,null,186,"",{"$f":"IF(E190<>\"\",CONCATENATE($A$2,DIGITADOR!$B$2,DIGITADOR!$M$1,C190),\"\")","v":""},null,{"$f":"IF(R190=\"\",\"\",INDEX('OTRAS REFERENCIAS'!$L$5:$M$152,MATCH(R190,'OTRAS REFERENCIAS'!$L$5:$L$157,0),2))","v":""},null,{"$f":"IF(T190=\"\",\"\",VLOOKUP(T190,'OTRAS REFERENCIAS'!$A$7:$B$9,2,FALSE))","v":""},null,"",null,null,null,{"$f":"IF(Z190=\"\",\"\",INDEX(REFERENTES!$A:$B,MATCH(Z190,REFERENTES!$B:$B,0),1))","v":""},"",null,null,{"$f":"IF(AD190=\"\",\"\",INDEX(REFERENTES!$D:$E,MATCH(AD190,REFERENTES!$E:$E,0),1))","v":""},{"$f":"IF(AD190=\"\",\"\",INDEX(REFERENTES!$D:$L,MATCH(AD190,REFERENTES!$E:$E,0),6))","v":""}]
[null,null,1,{"$f":"IF(Q191=\"\",\"\",IF(COUNTIF($Q191:Q191, Q191)>1, \"\", Q191))","v":""},null,null,"","","",null,{"$f":"IF(J191=\"\",\"\",INDEX(REFERENTES!$V:$W,MATCH(J191,REFERENTES!$W:$W,0),1))","v":""},"",null,null,187,"",{"$f":"IF(E191<>\"\",CONCATENATE($A$2,DIGITADOR!$B$2,DIGITADOR!$M$1,C191),\"\")","v":""},null,{"$f":"IF(R191=\"\",\"\",INDEX('OTRAS REFERENCIAS'!$L$5:$M$152,MATCH(R191,'OTRAS REFERENCIAS'!$L$5:$L$157,0),2))","v":""},null,{"$f":"IF(T191=\"\",\"\",VLOOKUP(T191,'OTRAS REFERENCIAS'!$A$7:$B$9,2,FALSE))","v":""},null,"",null,null,null,{"$f":"IF(Z191=\"\",\"\",INDEX(REFERENTES!$A:$B,MATCH(Z191,REFERENTES!$B:$B,0),1))","v":""},"",null,null,{"$f":"IF(AD191=\"\",\"\",INDEX(REFERENTES!$D:$E,MATCH(AD191,REFERENTES!$E:$E,0),1))","v":""},{"$f":"IF(AD191=\"\",\"\",INDEX(REFERENTES!$D:$L,MATCH(AD191,REFERENTES!$E:$E,0),6))","v":""}]
[null,null,1,{"$f":"IF(Q192=\"\",\"\",IF(COUNTIF($Q192:Q192, Q192)>1, \"\", Q192))","v":""},null,null,"","","",null,{"$f":"IF(J192=\"\",\"\",INDEX(REFERENTES!$V:$W,MATCH(J192,REFERENTES!$W:$W,0),1))","v":""},"",null,null,188,"",{"$f":"IF(E192<>\"\",CONCATENATE($A$2,DIGITADOR!$B$2,DIGITADOR!$M$1,C192),\"\")","v":""},null,{"$f":"IF(R192=\"\",\"\",INDEX('OTRAS REFERENCIAS'!$L$5:$M$152,MATCH(R192,'OTRAS REFERENCIAS'!$L$5:$L$157,0),2))","v":""},null,{"$f":"IF(T192=\"\",\"\",VLOOKUP(T192,'OTRAS REFERENCIAS'!$A$7:$B$9,2,FALSE))","v":""},null,"",null,null,null,{"$f":"IF(Z192=\"\",\"\",INDEX(REFERENTES!$A:$B,MATCH(Z192,REFERENTES!$B:$B,0),1))","v":""},"",null,null,{"$f":"IF(AD192=\"\",\"\",INDEX(REFERENTES!$D:$E,MATCH(AD192,REFERENTES!$E:$E,0),1))","v":""},{"$f":"IF(AD192=\"\",\"\",INDEX(REFERENTES!$D:$L,MATCH(AD192,REFERENTES!$E:$E,0),6))","v":""}]
[null,null,1,{"$f":"IF(Q193=\"\",\"\",IF(COUNTIF($Q193:Q193, Q193)>1, \"\", Q193))","v":""},null,null,"","","",null,{"$f":"IF(J193=\"\",\"\",INDEX(REFERENTES!$V:$W,MATCH(J193,REFERENTES!$W:$W,0),1))","v":""},"",null,null,189,"",{"$f":"IF(E193<>\"\",CONCATENATE($A$2,DIGITADOR!$B$2,DIGITADOR!$M$1,C193),\"\")","v":""},null,{"$f":"IF(R193=\"\",\"\",INDEX('OTRAS REFERENCIAS'!$L$5:$M$152,MATCH(R193,'OTRAS REFERENCIAS'!$L$5:$L$157,0),2))","v":""},null,{"$f":"IF(T193=\"\",\"\",VLOOKUP(T193,'OTRAS REFERENCIAS'!$A$7:$B$9,2,FALSE))","v":""},null,"",null,null,null,{"$f":"IF(Z193=\"\",\"\",INDEX(REFERENTES!$A:$B,MATCH(Z193,REFERENTES!$B:$B,0),1))","v":""},"",null,null,{"$f":"IF(AD193=\"\",\"\",INDEX(REFERENTES!$D:$E,MATCH(AD193,REFERENTES!$E:$E,0),1))","v":""},{"$f":"IF(AD193=\"\",\"\",INDEX(REFERENTES!$D:$L,MATCH(AD193,REFERENTES!$E:$E,0),6))","v":""}]
[null,null,1,{"$f":"IF(Q194=\"\",\"\",IF(COUNTIF($Q194:Q194, Q194)>1, \"\", Q194))","v":""},null,null,"","","",null,{"$f":"IF(J194=\"\",\"\",INDEX(REFERENTES!$V:$W,MATCH(J194,REFERENTES!$W:$W,0),1))","v":""},"",null,null,190,"",{"$f":"IF(E194<>\"\",CONCATENATE($A$2,DIGITADOR!$B$2,DIGITADOR!$M$1,C194),\"\")","v":""},null,{"$f":"IF(R194=\"\",\"\",INDEX('OTRAS REFERENCIAS'!$L$5:$M$152,MATCH(R194,'OTRAS REFERENCIAS'!$L$5:$L$157,0),2))","v":""},null,{"$f":"IF(T194=\"\",\"\",VLOOKUP(T194,'OTRAS REFERENCIAS'!$A$7:$B$9,2,FALSE))","v":""},null,"",null,null,null,{"$f":"IF(Z194=\"\",\"\",INDEX(REFERENTES!$A:$B,MATCH(Z194,REFERENTES!$B:$B,0),1))","v":""},"",null,null,{"$f":"IF(AD194=\"\",\"\",INDEX(REFERENTES!$D:$E,MATCH(AD194,REFERENTES!$E:$E,0),1))","v":""},{"$f":"IF(AD194=\"\",\"\",INDEX(REFERENTES!$D:$L,MATCH(AD194,REFERENTES!$E:$E,0),6))","v":""}]
[null,null,1,{"$f":"IF(Q195=\"\",\"\",IF(COUNTIF($Q195:Q195, Q195)>1, \"\", Q195))","v":""},null,null,"","","",null,{"$f":"IF(J195=\"\",\"\",INDEX(REFERENTES!$V:$W,MATCH(J195,REFERENTES!$W:$W,0),1))","v":""},"",null,null,191,"",{"$f":"IF(E195<>\"\",CONCATENATE($A$2,DIGITADOR!$B$2,DIGITADOR!$M$1,C195),\"\")","v":""},null,{"$f":"IF(R195=\"\",\"\",INDEX('OTRAS REFERENCIAS'!$L$5:$M$152,MATCH(R195,'OTRAS REFERENCIAS'!$L$5:$L$157,0),2))","v":""},null,{"$f":"IF(T195=\"\",\"\",VLOOKUP(T195,'OTRAS REFERENCIAS'!$A$7:$B$9,2,FALSE))","v":""},null,"",null,null,null,{"$f":"IF(Z195=\"\",\"\",INDEX(REFERENTES!$A:$B,MATCH(Z195,REFERENTES!$B:$B,0),1))","v":""},"",null,null,{"$f":"IF(AD195=\"\",\"\",INDEX(REFERENTES!$D:$E,MATCH(AD195,REFERENTES!$E:$E,0),1))","v":""},{"$f":"IF(AD195=\"\",\"\",INDEX(REFERENTES!$D:$L,MATCH(AD195,REFERENTES!$E:$E,0),6))","v":""}]
[null,null,1,{"$f":"IF(Q196=\"\",\"\",IF(COUNTIF($Q196:Q196, Q196)>1, \"\", Q196))","v":""},null,null,"","","",null,{"$f":"IF(J196=\"\",\"\",INDEX(REFERENTES!$V:$W,MATCH(J196,REFERENTES!$W:$W,0),1))","v":""},"",null,null,192,"",{"$f":"IF(E196<>\"\",CONCATENATE($A$2,DIGITADOR!$B$2,DIGITADOR!$M$1,C196),\"\")","v":""},null,{"$f":"IF(R196=\"\",\"\",INDEX('OTRAS REFERENCIAS'!$L$5:$M$152,MATCH(R196,'OTRAS REFERENCIAS'!$L$5:$L$157,0),2))","v":""},null,{"$f":"IF(T196=\"\",\"\",VLOOKUP(T196,'OTRAS REFERENCIAS'!$A$7:$B$9,2,FALSE))","v":""},null,"",null,null,null,{"$f":"IF(Z196=\"\",\"\",INDEX(REFERENTES!$A:$B,MATCH(Z196,REFERENTES!$B:$B,0),1))","v":""},"",null,null,{"$f":"IF(AD196=\"\",\"\",INDEX(REFERENTES!$D:$E,MATCH(AD196,REFERENTES!$E:$E,0),1))","v":""},{"$f":"IF(AD196=\"\",\"\",INDEX(REFERENTES!$D:$L,MATCH(AD196,REFERENTES!$E:$E,0),6))","v":""}]
[null,null,{"$f":"IF(L197=L196,C196,C196+1)","v":1},{"$f":"IF(Q197=\"\",\"\",IF(COUNTIF($Q197:Q197, Q197)>1, \"\", Q197))","v":""},null,null,"","","",null,{"$f":"IF(J197=\"\",\"\",INDEX(REFERENTES!$V:$W,MATCH(J197,REFERENTES!$W:$W,0),1))","v":""},{"$f":"IF(G197=\"\",\"\",CONCATENATE(G197,S197,K197,X197))","v":""},null,null,193,"",{"$f":"IF(E197<>\"\",CONCATENATE($A$2,DIGITADOR!$B$2,DIGITADOR!$M$1,C197),\"\")","v":""},null,{"$f":"IF(R197=\"\",\"\",INDEX('OTRAS REFERENCIAS'!$L$5:$M$152,MATCH(R197,'OTRAS REFERENCIAS'!$L$5:$L$157,0),2))","v":""},null,{"$f":"IF(T197=\"\",\"\",VLOOKUP(T197,'OTRAS REFERENCIAS'!$A$7:$B$9,2,FALSE))","v":""},null,"",null,null,null,{"$f":"IF(Z197=\"\",\"\",INDEX(REFERENTES!$A:$B,MATCH(Z197,REFERENTES!$B:$B,0),1))","v":""},"",null,null,{"$f":"IF(AD197=\"\",\"\",INDEX(REFERENTES!$D:$E,MATCH(AD197,REFERENTES!$E:$E,0),1))","v":""},{"$f":"IF(AD197=\"\",\"\",INDEX(REFERENTES!$D:$L,MATCH(AD197,REFERENTES!$E:$E,0),6))","v":""}]
[null,null,1,{"$f":"IF(Q198=\"\",\"\",IF(COUNTIF($Q198:Q198, Q198)>1, \"\", Q198))","v":""},null,null,{"$f":"IF(E198=\"\",\"\",E198+F198)","v":""},"",{"$f":"IF(D198=\"\",\"\",1)","v":""},null,{"$f":"IF(J198=\"\",\"\",INDEX(REFERENTES!$V:$W,MATCH(J198,REFERENTES!$W:$W,0),1))","v":""},"",null,null,194,{"$f":"IF(Q198=\"\",\"\",CONCATENATE(Q198,ROW()-2))","v":""},{"$f":"IF(E198<>\"\",CONCATENATE($A$2,DIGITADOR!$B$2,DIGITADOR!$M$1,C198),\"\")","v":""},null,{"$f":"IF(R198=\"\",\"\",INDEX('OTRAS REFERENCIAS'!$L$5:$M$152,MATCH(R198,'OTRAS REFERENCIAS'!$L$5:$L$157,0),2))","v":""},null,{"$f":"IF(T198=\"\",\"\",VLOOKUP(T198,'OTRAS REFERENCIAS'!$A$7:$B$9,2,FALSE))","v":""},null,{"$f":"CONCATENATE(T198,V198)","v":""},null,null,null,{"$f":"IF(Z198=\"\",\"\",INDEX(REFERENTES!$A:$B,MATCH(Z198,REFERENTES!$B:$B,0),1))","v":""},{"$f":"UPPER(AD198)","v":""},null,null,{"$f":"IF(AD198=\"\",\"\",INDEX(REFERENTES!$D:$E,MATCH(AD198,REFERENTES!$E:$E,0),1))","v":""},{"$f":"IF(AD198=\"\",\"\",INDEX(REFERENTES!$D:$L,MATCH(AD198,REFERENTES!$E:$E,0),6))","v":""}]
[null,null,1,{"$f":"IF(Q199=\"\",\"\",IF(COUNTIF($Q199:Q199, Q199)>1, \"\", Q199))","v":""},null,null,"","","",null,{"$f":"IF(J199=\"\",\"\",INDEX(REFERENTES!$V:$W,MATCH(J199,REFERENTES!$W:$W,0),1))","v":""},"",null,null,195,"",{"$f":"IF(E199<>\"\",CONCATENATE($A$2,DIGITADOR!$B$2,DIGITADOR!$M$1,C199),\"\")","v":""},null,{"$f":"IF(R199=\"\",\"\",INDEX('OTRAS REFERENCIAS'!$L$5:$M$152,MATCH(R199,'OTRAS REFERENCIAS'!$L$5:$L$157,0),2))","v":""},null,{"$f":"IF(T199=\"\",\"\",VLOOKUP(T199,'OTRAS REFERENCIAS'!$A$7:$B$9,2,FALSE))","v":""},null,"",null,null,null,{"$f":"IF(Z199=\"\",\"\",INDEX(REFERENTES!$A:$B,MATCH(Z199,REFERENTES!$B:$B,0),1))","v":""},"",null,null,{"$f":"IF(AD199=\"\",\"\",INDEX(REFERENTES!$D:$E,MATCH(AD199,REFERENTES!$E:$E,0),1))","v":""},{"$f":"IF(AD199=\"\",\"\",INDEX(REFERENTES!$D:$L,MATCH(AD199,REFERENTES!$E:$E,0),6))","v":""}]
[null,null,1,{"$f":"IF(Q200=\"\",\"\",IF(COUNTIF($Q200:Q200, Q200)>1, \"\", Q200))","v":""},null,null,"","","",null,{"$f":"IF(J200=\"\",\"\",INDEX(REFERENTES!$V:$W,MATCH(J200,REFERENTES!$W:$W,0),1))","v":""},"",null,null,196,"",{"$f":"IF(E200<>\"\",CONCATENATE($A$2,DIGITADOR!$B$2,DIGITADOR!$M$1,C200),\"\")","v":""},null,{"$f":"IF(R200=\"\",\"\",INDEX('OTRAS REFERENCIAS'!$L$5:$M$152,MATCH(R200,'OTRAS REFERENCIAS'!$L$5:$L$157,0),2))","v":""},null,{"$f":"IF(T200=\"\",\"\",VLOOKUP(T200,'OTRAS REFERENCIAS'!$A$7:$B$9,2,FALSE))","v":""},null,"",null,null,null,{"$f":"IF(Z200=\"\",\"\",INDEX(REFERENTES!$A:$B,MATCH(Z200,REFERENTES!$B:$B,0),1))","v":""},"",null,null,{"$f":"IF(AD200=\"\",\"\",INDEX(REFERENTES!$D:$E,MATCH(AD200,REFERENTES!$E:$E,0),1))","v":""},{"$f":"IF(AD200=\"\",\"\",INDEX(REFERENTES!$D:$L,MATCH(AD200,REFERENTES!$E:$E,0),6))","v":""}]
[null,null,1,{"$f":"IF(Q201=\"\",\"\",IF(COUNTIF($Q201:Q201, Q201)>1, \"\", Q201))","v":""},null,null,"","","",null,{"$f":"IF(J201=\"\",\"\",INDEX(REFERENTES!$V:$W,MATCH(J201,REFERENTES!$W:$W,0),1))","v":""},"",null,null,197,"",{"$f":"IF(E201<>\"\",CONCATENATE($A$2,DIGITADOR!$B$2,DIGITADOR!$M$1,C201),\"\")","v":""},null,{"$f":"IF(R201=\"\",\"\",INDEX('OTRAS REFERENCIAS'!$L$5:$M$152,MATCH(R201,'OTRAS REFERENCIAS'!$L$5:$L$157,0),2))","v":""},null,{"$f":"IF(T201=\"\",\"\",VLOOKUP(T201,'OTRAS REFERENCIAS'!$A$7:$B$9,2,FALSE))","v":""},null,"",null,null,null,{"$f":"IF(Z201=\"\",\"\",INDEX(REFERENTES!$A:$B,MATCH(Z201,REFERENTES!$B:$B,0),1))","v":""},"",null,null,{"$f":"IF(AD201=\"\",\"\",INDEX(REFERENTES!$D:$E,MATCH(AD201,REFERENTES!$E:$E,0),1))","v":""},{"$f":"IF(AD201=\"\",\"\",INDEX(REFERENTES!$D:$L,MATCH(AD201,REFERENTES!$E:$E,0),6))","v":""}]
[null,null,1,{"$f":"IF(Q202=\"\",\"\",IF(COUNTIF($Q202:Q202, Q202)>1, \"\", Q202))","v":""},null,null,"","","",null,{"$f":"IF(J202=\"\",\"\",INDEX(REFERENTES!$V:$W,MATCH(J202,REFERENTES!$W:$W,0),1))","v":""},"",null,null,198,"",{"$f":"IF(E202<>\"\",CONCATENATE($A$2,DIGITADOR!$B$2,DIGITADOR!$M$1,C202),\"\")","v":""},null,{"$f":"IF(R202=\"\",\"\",INDEX('OTRAS REFERENCIAS'!$L$5:$M$152,MATCH(R202,'OTRAS REFERENCIAS'!$L$5:$L$157,0),2))","v":""},null,{"$f":"IF(T202=\"\",\"\",VLOOKUP(T202,'OTRAS REFERENCIAS'!$A$7:$B$9,2,FALSE))","v":""},null,"",null,null,null,{"$f":"IF(Z202=\"\",\"\",INDEX(REFERENTES!$A:$B,MATCH(Z202,REFERENTES!$B:$B,0),1))","v":""},"",null,null,{"$f":"IF(AD202=\"\",\"\",INDEX(REFERENTES!$D:$E,MATCH(AD202,REFERENTES!$E:$E,0),1))","v":""},{"$f":"IF(AD202=\"\",\"\",INDEX(REFERENTES!$D:$L,MATCH(AD202,REFERENTES!$E:$E,0),6))","v":""}]
[null,null,1,{"$f":"IF(Q203=\"\",\"\",IF(COUNTIF($Q203:Q203, Q203)>1, \"\", Q203))","v":""},null,null,"","","",null,{"$f":"IF(J203=\"\",\"\",INDEX(REFERENTES!$V:$W,MATCH(J203,REFERENTES!$W:$W,0),1))","v":""},"",null,null,199,"",{"$f":"IF(E203<>\"\",CONCATENATE($A$2,DIGITADOR!$B$2,DIGITADOR!$M$1,C203),\"\")","v":""},null,{"$f":"IF(R203=\"\",\"\",INDEX('OTRAS REFERENCIAS'!$L$5:$M$152,MATCH(R203,'OTRAS REFERENCIAS'!$L$5:$L$157,0),2))","v":""},null,{"$f":"IF(T203=\"\",\"\",VLOOKUP(T203,'OTRAS REFERENCIAS'!$A$7:$B$9,2,FALSE))","v":""},null,"",null,null,null,{"$f":"IF(Z203=\"\",\"\",INDEX(REFERENTES!$A:$B,MATCH(Z203,REFERENTES!$B:$B,0),1))","v":""},"",null,null,{"$f":"IF(AD203=\"\",\"\",INDEX(REFERENTES!$D:$E,MATCH(AD203,REFERENTES!$E:$E,0),1))","v":""},{"$f":"IF(AD203=\"\",\"\",INDEX(REFERENTES!$D:$L,MATCH(AD203,REFERENTES!$E:$E,0),6))","v":""}]
[null,null,1,{"$f":"IF(Q204=\"\",\"\",IF(COUNTIF($Q204:Q204, Q204)>1, \"\", Q204))","v":""},null,null,"","","",null,{"$f":"IF(J204=\"\",\"\",INDEX(REFERENTES!$V:$W,MATCH(J204,REFERENTES!$W:$W,0),1))","v":""},"",null,null,200,"",{"$f":"IF(E204<>\"\",CONCATENATE($A$2,DIGITADOR!$B$2,DIGITADOR!$M$1,C204),\"\")","v":""},null,{"$f":"IF(R204=\"\",\"\",INDEX('OTRAS REFERENCIAS'!$L$5:$M$152,MATCH(R204,'OTRAS REFERENCIAS'!$L$5:$L$157,0),2))","v":""},null,{"$f":"IF(T204=\"\",\"\",VLOOKUP(T204,'OTRAS REFERENCIAS'!$A$7:$B$9,2,FALSE))","v":""},null,"",null,null,null,{"$f":"IF(Z204=\"\",\"\",INDEX(REFERENTES!$A:$B,MATCH(Z204,REFERENTES!$B:$B,0),1))","v":""},"",null,null,{"$f":"IF(AD204=\"\",\"\",INDEX(REFERENTES!$D:$E,MATCH(AD204,REFERENTES!$E:$E,0),1))","v":""},{"$f":"IF(AD204=\"\",\"\",INDEX(REFERENTES!$D:$L,MATCH(AD204,REFERENTES!$E:$E,0),6))","v":""}]
[null,null,1,{"$f":"IF(Q205=\"\",\"\",IF(COUNTIF($Q205:Q205, Q205)>1, \"\", Q205))","v":""},null,null,"","","",null,{"$f":"IF(J205=\"\",\"\",INDEX(REFERENTES!$V:$W,MATCH(J205,REFERENTES!$W:$W,0),1))","v":""},"",null,null,201,"",{"$f":"IF(E205<>\"\",CONCATENATE($A$2,DIGITADOR!$B$2,DIGITADOR!$M$1,C205),\"\")","v":""},null,{"$f":"IF(R205=\"\",\"\",INDEX('OTRAS REFERENCIAS'!$L$5:$M$152,MATCH(R205,'OTRAS REFERENCIAS'!$L$5:$L$157,0),2))","v":""},null,{"$f":"IF(T205=\"\",\"\",VLOOKUP(T205,'OTRAS REFERENCIAS'!$A$7:$B$9,2,FALSE))","v":""},null,"",null,null,null,{"$f":"IF(Z205=\"\",\"\",INDEX(REFERENTES!$A:$B,MATCH(Z205,REFERENTES!$B:$B,0),1))","v":""},"",null,null,{"$f":"IF(AD205=\"\",\"\",INDEX(REFERENTES!$D:$E,MATCH(AD205,REFERENTES!$E:$E,0),1))","v":""},{"$f":"IF(AD205=\"\",\"\",INDEX(REFERENTES!$D:$L,MATCH(AD205,REFERENTES!$E:$E,0),6))","v":""}]
[null,null,1,{"$f":"IF(Q206=\"\",\"\",IF(COUNTIF($Q206:Q206, Q206)>1, \"\", Q206))","v":""},null,null,"","","",null,{"$f":"IF(J206=\"\",\"\",INDEX(REFERENTES!$V:$W,MATCH(J206,REFERENTES!$W:$W,0),1))","v":""},"",null,null,202,"",{"$f":"IF(E206<>\"\",CONCATENATE($A$2,DIGITADOR!$B$2,DIGITADOR!$M$1,C206),\"\")","v":""},null,{"$f":"IF(R206=\"\",\"\",INDEX('OTRAS REFERENCIAS'!$L$5:$M$152,MATCH(R206,'OTRAS REFERENCIAS'!$L$5:$L$157,0),2))","v":""},null,{"$f":"IF(T206=\"\",\"\",VLOOKUP(T206,'OTRAS REFERENCIAS'!$A$7:$B$9,2,FALSE))","v":""},null,"",null,null,null,{"$f":"IF(Z206=\"\",\"\",INDEX(REFERENTES!$A:$B,MATCH(Z206,REFERENTES!$B:$B,0),1))","v":""},"",null,null,{"$f":"IF(AD206=\"\",\"\",INDEX(REFERENTES!$D:$E,MATCH(AD206,REFERENTES!$E:$E,0),1))","v":""},{"$f":"IF(AD206=\"\",\"\",INDEX(REFERENTES!$D:$L,MATCH(AD206,REFERENTES!$E:$E,0),6))","v":""}]
[null,null,1,{"$f":"IF(Q207=\"\",\"\",IF(COUNTIF($Q207:Q207, Q207)>1, \"\", Q207))","v":""},null,null,"","","",null,{"$f":"IF(J207=\"\",\"\",INDEX(REFERENTES!$V:$W,MATCH(J207,REFERENTES!$W:$W,0),1))","v":""},"",null,null,203,"",{"$f":"IF(E207<>\"\",CONCATENATE($A$2,DIGITADOR!$B$2,DIGITADOR!$M$1,C207),\"\")","v":""},null,{"$f":"IF(R207=\"\",\"\",INDEX('OTRAS REFERENCIAS'!$L$5:$M$152,MATCH(R207,'OTRAS REFERENCIAS'!$L$5:$L$157,0),2))","v":""},null,{"$f":"IF(T207=\"\",\"\",VLOOKUP(T207,'OTRAS REFERENCIAS'!$A$7:$B$9,2,FALSE))","v":""},null,"",null,null,null,{"$f":"IF(Z207=\"\",\"\",INDEX(REFERENTES!$A:$B,MATCH(Z207,REFERENTES!$B:$B,0),1))","v":""},"",null,null,{"$f":"IF(AD207=\"\",\"\",INDEX(REFERENTES!$D:$E,MATCH(AD207,REFERENTES!$E:$E,0),1))","v":""},{"$f":"IF(AD207=\"\",\"\",INDEX(REFERENTES!$D:$L,MATCH(AD207,REFERENTES!$E:$E,0),6))","v":""}]
[null,null,1,{"$f":"IF(Q208=\"\",\"\",IF(COUNTIF($Q208:Q208, Q208)>1, \"\", Q208))","v":""},null,null,"","","",null,{"$f":"IF(J208=\"\",\"\",INDEX(REFERENTES!$V:$W,MATCH(J208,REFERENTES!$W:$W,0),1))","v":""},"",null,null,204,"",{"$f":"IF(E208<>\"\",CONCATENATE($A$2,DIGITADOR!$B$2,DIGITADOR!$M$1,C208),\"\")","v":""},null,{"$f":"IF(R208=\"\",\"\",INDEX('OTRAS REFERENCIAS'!$L$5:$M$152,MATCH(R208,'OTRAS REFERENCIAS'!$L$5:$L$157,0),2))","v":""},null,{"$f":"IF(T208=\"\",\"\",VLOOKUP(T208,'OTRAS REFERENCIAS'!$A$7:$B$9,2,FALSE))","v":""},null,"",null,null,null,{"$f":"IF(Z208=\"\",\"\",INDEX(REFERENTES!$A:$B,MATCH(Z208,REFERENTES!$B:$B,0),1))","v":""},"",null,null,{"$f":"IF(AD208=\"\",\"\",INDEX(REFERENTES!$D:$E,MATCH(AD208,REFERENTES!$E:$E,0),1))","v":""},{"$f":"IF(AD208=\"\",\"\",INDEX(REFERENTES!$D:$L,MATCH(AD208,REFERENTES!$E:$E,0),6))","v":""}]
[null,null,1,{"$f":"IF(Q209=\"\",\"\",IF(COUNTIF($Q209:Q209, Q209)>1, \"\", Q209))","v":""},null,null,"","","",null,{"$f":"IF(J209=\"\",\"\",INDEX(REFERENTES!$V:$W,MATCH(J209,REFERENTES!$W:$W,0),1))","v":""},"",null,null,205,"",{"$f":"IF(E209<>\"\",CONCATENATE($A$2,DIGITADOR!$B$2,DIGITADOR!$M$1,C209),\"\")","v":""},null,{"$f":"IF(R209=\"\",\"\",INDEX('OTRAS REFERENCIAS'!$L$5:$M$152,MATCH(R209,'OTRAS REFERENCIAS'!$L$5:$L$157,0),2))","v":""},null,{"$f":"IF(T209=\"\",\"\",VLOOKUP(T209,'OTRAS REFERENCIAS'!$A$7:$B$9,2,FALSE))","v":""},null,"",null,null,null,{"$f":"IF(Z209=\"\",\"\",INDEX(REFERENTES!$A:$B,MATCH(Z209,REFERENTES!$B:$B,0),1))","v":""},"",null,null,{"$f":"IF(AD209=\"\",\"\",INDEX(REFERENTES!$D:$E,MATCH(AD209,REFERENTES!$E:$E,0),1))","v":""},{"$f":"IF(AD209=\"\",\"\",INDEX(REFERENTES!$D:$L,MATCH(AD209,REFERENTES!$E:$E,0),6))","v":""}]
[null,null,1,{"$f":"IF(Q210=\"\",\"\",IF(COUNTIF($Q210:Q210, Q210)>1, \"\", Q210))","v":""},null,null,"","","",null,{"$f":"IF(J210=\"\",\"\",INDEX(REFERENTES!$V:$W,MATCH(J210,REFERENTES!$W:$W,0),1))","v":""},"",null,null,206,"",{"$f":"IF(E210<>\"\",CONCATENATE($A$2,DIGITADOR!$B$2,DIGITADOR!$M$1,C210),\"\")","v":""},null,{"$f":"IF(R210=\"\",\"\",INDEX('OTRAS REFERENCIAS'!$L$5:$M$152,MATCH(R210,'OTRAS REFERENCIAS'!$L$5:$L$157,0),2))","v":""},null,{"$f":"IF(T210=\"\",\"\",VLOOKUP(T210,'OTRAS REFERENCIAS'!$A$7:$B$9,2,FALSE))","v":""},null,"",null,null,null,{"$f":"IF(Z210=\"\",\"\",INDEX(REFERENTES!$A:$B,MATCH(Z210,REFERENTES!$B:$B,0),1))","v":""},"",null,null,{"$f":"IF(AD210=\"\",\"\",INDEX(REFERENTES!$D:$E,MATCH(AD210,REFERENTES!$E:$E,0),1))","v":""},{"$f":"IF(AD210=\"\",\"\",INDEX(REFERENTES!$D:$L,MATCH(AD210,REFERENTES!$E:$E,0),6))","v":""}]
[null,null,1,{"$f":"IF(Q211=\"\",\"\",IF(COUNTIF($Q211:Q211, Q211)>1, \"\", Q211))","v":""},null,null,"","","",null,{"$f":"IF(J211=\"\",\"\",INDEX(REFERENTES!$V:$W,MATCH(J211,REFERENTES!$W:$W,0),1))","v":""},"",null,null,207,"",{"$f":"IF(E211<>\"\",CONCATENATE($A$2,DIGITADOR!$B$2,DIGITADOR!$M$1,C211),\"\")","v":""},null,{"$f":"IF(R211=\"\",\"\",INDEX('OTRAS REFERENCIAS'!$L$5:$M$152,MATCH(R211,'OTRAS REFERENCIAS'!$L$5:$L$157,0),2))","v":""},null,{"$f":"IF(T211=\"\",\"\",VLOOKUP(T211,'OTRAS REFERENCIAS'!$A$7:$B$9,2,FALSE))","v":""},null,"",null,null,null,{"$f":"IF(Z211=\"\",\"\",INDEX(REFERENTES!$A:$B,MATCH(Z211,REFERENTES!$B:$B,0),1))","v":""},"",null,null,{"$f":"IF(AD211=\"\",\"\",INDEX(REFERENTES!$D:$E,MATCH(AD211,REFERENTES!$E:$E,0),1))","v":""},{"$f":"IF(AD211=\"\",\"\",INDEX(REFERENTES!$D:$L,MATCH(AD211,REFERENTES!$E:$E,0),6))","v":""}]
[null,null,1,{"$f":"IF(Q212=\"\",\"\",IF(COUNTIF($Q212:Q212, Q212)>1, \"\", Q212))","v":""},null,null,"","","",null,{"$f":"IF(J212=\"\",\"\",INDEX(REFERENTES!$V:$W,MATCH(J212,REFERENTES!$W:$W,0),1))","v":""},"",null,null,208,"",{"$f":"IF(E212<>\"\",CONCATENATE($A$2,DIGITADOR!$B$2,DIGITADOR!$M$1,C212),\"\")","v":""},null,{"$f":"IF(R212=\"\",\"\",INDEX('OTRAS REFERENCIAS'!$L$5:$M$152,MATCH(R212,'OTRAS REFERENCIAS'!$L$5:$L$157,0),2))","v":""},null,{"$f":"IF(T212=\"\",\"\",VLOOKUP(T212,'OTRAS REFERENCIAS'!$A$7:$B$9,2,FALSE))","v":""},null,"",null,null,null,{"$f":"IF(Z212=\"\",\"\",INDEX(REFERENTES!$A:$B,MATCH(Z212,REFERENTES!$B:$B,0),1))","v":""},"",null,null,{"$f":"IF(AD212=\"\",\"\",INDEX(REFERENTES!$D:$E,MATCH(AD212,REFERENTES!$E:$E,0),1))","v":""},{"$f":"IF(AD212=\"\",\"\",INDEX(REFERENTES!$D:$L,MATCH(AD212,REFERENTES!$E:$E,0),6))","v":""}]
[null,null,1,{"$f":"IF(Q213=\"\",\"\",IF(COUNTIF($Q213:Q213, Q213)>1, \"\", Q213))","v":""},null,null,"","","",null,{"$f":"IF(J213=\"\",\"\",INDEX(REFERENTES!$V:$W,MATCH(J213,REFERENTES!$W:$W,0),1))","v":""},"",null,null,209,"",{"$f":"IF(E213<>\"\",CONCATENATE($A$2,DIGITADOR!$B$2,DIGITADOR!$M$1,C213),\"\")","v":""},null,{"$f":"IF(R213=\"\",\"\",INDEX('OTRAS REFERENCIAS'!$L$5:$M$152,MATCH(R213,'OTRAS REFERENCIAS'!$L$5:$L$157,0),2))","v":""},null,{"$f":"IF(T213=\"\",\"\",VLOOKUP(T213,'OTRAS REFERENCIAS'!$A$7:$B$9,2,FALSE))","v":""},null,"",null,null,null,{"$f":"IF(Z213=\"\",\"\",INDEX(REFERENTES!$A:$B,MATCH(Z213,REFERENTES!$B:$B,0),1))","v":""},"",null,null,{"$f":"IF(AD213=\"\",\"\",INDEX(REFERENTES!$D:$E,MATCH(AD213,REFERENTES!$E:$E,0),1))","v":""},{"$f":"IF(AD213=\"\",\"\",INDEX(REFERENTES!$D:$L,MATCH(AD213,REFERENTES!$E:$E,0),6))","v":""}]
[null,null,1,{"$f":"IF(Q214=\"\",\"\",IF(COUNTIF($Q214:Q214, Q214)>1, \"\", Q214))","v":""},null,null,"","","",null,{"$f":"IF(J214=\"\",\"\",INDEX(REFERENTES!$V:$W,MATCH(J214,REFERENTES!$W:$W,0),1))","v":""},"",null,null,210,"",{"$f":"IF(E214<>\"\",CONCATENATE($A$2,DIGITADOR!$B$2,DIGITADOR!$M$1,C214),\"\")","v":""},null,{"$f":"IF(R214=\"\",\"\",INDEX('OTRAS REFERENCIAS'!$L$5:$M$152,MATCH(R214,'OTRAS REFERENCIAS'!$L$5:$L$157,0),2))","v":""},null,{"$f":"IF(T214=\"\",\"\",VLOOKUP(T214,'OTRAS REFERENCIAS'!$A$7:$B$9,2,FALSE))","v":""},null,"",null,null,null,{"$f":"IF(Z214=\"\",\"\",INDEX(REFERENTES!$A:$B,MATCH(Z214,REFERENTES!$B:$B,0),1))","v":""},"",null,null,{"$f":"IF(AD214=\"\",\"\",INDEX(REFERENTES!$D:$E,MATCH(AD214,REFERENTES!$E:$E,0),1))","v":""},{"$f":"IF(AD214=\"\",\"\",INDEX(REFERENTES!$D:$L,MATCH(AD214,REFERENTES!$E:$E,0),6))","v":""}]
[null,null,1,{"$f":"IF(Q215=\"\",\"\",IF(COUNTIF($Q215:Q215, Q215)>1, \"\", Q215))","v":""},null,null,"","","",null,{"$f":"IF(J215=\"\",\"\",INDEX(REFERENTES!$V:$W,MATCH(J215,REFERENTES!$W:$W,0),1))","v":""},"",null,null,211,"",{"$f":"IF(E215<>\"\",CONCATENATE($A$2,DIGITADOR!$B$2,DIGITADOR!$M$1,C215),\"\")","v":""},null,{"$f":"IF(R215=\"\",\"\",INDEX('OTRAS REFERENCIAS'!$L$5:$M$152,MATCH(R215,'OTRAS REFERENCIAS'!$L$5:$L$157,0),2))","v":""},null,{"$f":"IF(T215=\"\",\"\",VLOOKUP(T215,'OTRAS REFERENCIAS'!$A$7:$B$9,2,FALSE))","v":""},null,"",null,null,null,{"$f":"IF(Z215=\"\",\"\",INDEX(REFERENTES!$A:$B,MATCH(Z215,REFERENTES!$B:$B,0),1))","v":""},"",null,null,{"$f":"IF(AD215=\"\",\"\",INDEX(REFERENTES!$D:$E,MATCH(AD215,REFERENTES!$E:$E,0),1))","v":""},{"$f":"IF(AD215=\"\",\"\",INDEX(REFERENTES!$D:$L,MATCH(AD215,REFERENTES!$E:$E,0),6))","v":""}]
[null,null,1,{"$f":"IF(Q216=\"\",\"\",IF(COUNTIF($Q216:Q216, Q216)>1, \"\", Q216))","v":""},null,null,"","","",null,{"$f":"IF(J216=\"\",\"\",INDEX(REFERENTES!$V:$W,MATCH(J216,REFERENTES!$W:$W,0),1))","v":""},"",null,null,212,"",{"$f":"IF(E216<>\"\",CONCATENATE($A$2,DIGITADOR!$B$2,DIGITADOR!$M$1,C216),\"\")","v":""},null,{"$f":"IF(R216=\"\",\"\",INDEX('OTRAS REFERENCIAS'!$L$5:$M$152,MATCH(R216,'OTRAS REFERENCIAS'!$L$5:$L$157,0),2))","v":""},null,{"$f":"IF(T216=\"\",\"\",VLOOKUP(T216,'OTRAS REFERENCIAS'!$A$7:$B$9,2,FALSE))","v":""},null,"",null,null,null,{"$f":"IF(Z216=\"\",\"\",INDEX(REFERENTES!$A:$B,MATCH(Z216,REFERENTES!$B:$B,0),1))","v":""},"",null,null,{"$f":"IF(AD216=\"\",\"\",INDEX(REFERENTES!$D:$E,MATCH(AD216,REFERENTES!$E:$E,0),1))","v":""},{"$f":"IF(AD216=\"\",\"\",INDEX(REFERENTES!$D:$L,MATCH(AD216,REFERENTES!$E:$E,0),6))","v":""}]
[null,null,1,{"$f":"IF(Q217=\"\",\"\",IF(COUNTIF($Q217:Q217, Q217)>1, \"\", Q217))","v":""},null,null,"","","",null,{"$f":"IF(J217=\"\",\"\",INDEX(REFERENTES!$V:$W,MATCH(J217,REFERENTES!$W:$W,0),1))","v":""},"",null,null,213,"",{"$f":"IF(E217<>\"\",CONCATENATE($A$2,DIGITADOR!$B$2,DIGITADOR!$M$1,C217),\"\")","v":""},null,{"$f":"IF(R217=\"\",\"\",INDEX('OTRAS REFERENCIAS'!$L$5:$M$152,MATCH(R217,'OTRAS REFERENCIAS'!$L$5:$L$157,0),2))","v":""},null,{"$f":"IF(T217=\"\",\"\",VLOOKUP(T217,'OTRAS REFERENCIAS'!$A$7:$B$9,2,FALSE))","v":""},null,"",null,null,null,{"$f":"IF(Z217=\"\",\"\",INDEX(REFERENTES!$A:$B,MATCH(Z217,REFERENTES!$B:$B,0),1))","v":""},"",null,null,{"$f":"IF(AD217=\"\",\"\",INDEX(REFERENTES!$D:$E,MATCH(AD217,REFERENTES!$E:$E,0),1))","v":""},{"$f":"IF(AD217=\"\",\"\",INDEX(REFERENTES!$D:$L,MATCH(AD217,REFERENTES!$E:$E,0),6))","v":""}]
[null,null,1,{"$f":"IF(Q218=\"\",\"\",IF(COUNTIF($Q218:Q218, Q218)>1, \"\", Q218))","v":""},null,null,"","","",null,{"$f":"IF(J218=\"\",\"\",INDEX(REFERENTES!$V:$W,MATCH(J218,REFERENTES!$W:$W,0),1))","v":""},"",null,null,214,"",{"$f":"IF(E218<>\"\",CONCATENATE($A$2,DIGITADOR!$B$2,DIGITADOR!$M$1,C218),\"\")","v":""},null,{"$f":"IF(R218=\"\",\"\",INDEX('OTRAS REFERENCIAS'!$L$5:$M$152,MATCH(R218,'OTRAS REFERENCIAS'!$L$5:$L$157,0),2))","v":""},null,{"$f":"IF(T218=\"\",\"\",VLOOKUP(T218,'OTRAS REFERENCIAS'!$A$7:$B$9,2,FALSE))","v":""},null,"",null,null,null,{"$f":"IF(Z218=\"\",\"\",INDEX(REFERENTES!$A:$B,MATCH(Z218,REFERENTES!$B:$B,0),1))","v":""},"",null,null,{"$f":"IF(AD218=\"\",\"\",INDEX(REFERENTES!$D:$E,MATCH(AD218,REFERENTES!$E:$E,0),1))","v":""},{"$f":"IF(AD218=\"\",\"\",INDEX(REFERENTES!$D:$L,MATCH(AD218,REFERENTES!$E:$E,0),6))","v":""}]
[null,null,1,{"$f":"IF(Q219=\"\",\"\",IF(COUNTIF($Q219:Q219, Q219)>1, \"\", Q219))","v":""},null,null,"","","",null,{"$f":"IF(J219=\"\",\"\",INDEX(REFERENTES!$V:$W,MATCH(J219,REFERENTES!$W:$W,0),1))","v":""},"",null,null,215,"",{"$f":"IF(E219<>\"\",CONCATENATE($A$2,DIGITADOR!$B$2,DIGITADOR!$M$1,C219),\"\")","v":""},null,{"$f":"IF(R219=\"\",\"\",INDEX('OTRAS REFERENCIAS'!$L$5:$M$152,MATCH(R219,'OTRAS REFERENCIAS'!$L$5:$L$157,0),2))","v":""},null,{"$f":"IF(T219=\"\",\"\",VLOOKUP(T219,'OTRAS REFERENCIAS'!$A$7:$B$9,2,FALSE))","v":""},null,"",null,null,null,{"$f":"IF(Z219=\"\",\"\",INDEX(REFERENTES!$A:$B,MATCH(Z219,REFERENTES!$B:$B,0),1))","v":""},"",null,null,{"$f":"IF(AD219=\"\",\"\",INDEX(REFERENTES!$D:$E,MATCH(AD219,REFERENTES!$E:$E,0),1))","v":""},{"$f":"IF(AD219=\"\",\"\",INDEX(REFERENTES!$D:$L,MATCH(AD219,REFERENTES!$E:$E,0),6))","v":""}]
[null,null,1,{"$f":"IF(Q220=\"\",\"\",IF(COUNTIF($Q220:Q220, Q220)>1, \"\", Q220))","v":""},null,null,"","","",null,{"$f":"IF(J220=\"\",\"\",INDEX(REFERENTES!$V:$W,MATCH(J220,REFERENTES!$W:$W,0),1))","v":""},"",null,null,216,"",{"$f":"IF(E220<>\"\",CONCATENATE($A$2,DIGITADOR!$B$2,DIGITADOR!$M$1,C220),\"\")","v":""},null,{"$f":"IF(R220=\"\",\"\",INDEX('OTRAS REFERENCIAS'!$L$5:$M$152,MATCH(R220,'OTRAS REFERENCIAS'!$L$5:$L$157,0),2))","v":""},null,{"$f":"IF(T220=\"\",\"\",VLOOKUP(T220,'OTRAS REFERENCIAS'!$A$7:$B$9,2,FALSE))","v":""},null,"",null,null,null,{"$f":"IF(Z220=\"\",\"\",INDEX(REFERENTES!$A:$B,MATCH(Z220,REFERENTES!$B:$B,0),1))","v":""},"",null,null,{"$f":"IF(AD220=\"\",\"\",INDEX(REFERENTES!$D:$E,MATCH(AD220,REFERENTES!$E:$E,0),1))","v":""},{"$f":"IF(AD220=\"\",\"\",INDEX(REFERENTES!$D:$L,MATCH(AD220,REFERENTES!$E:$E,0),6))","v":""}]
[null,null,1,{"$f":"IF(Q221=\"\",\"\",IF(COUNTIF($Q221:Q221, Q221)>1, \"\", Q221))","v":""},null,null,"","","",null,{"$f":"IF(J221=\"\",\"\",INDEX(REFERENTES!$V:$W,MATCH(J221,REFERENTES!$W:$W,0),1))","v":""},"",null,null,217,"",{"$f":"IF(E221<>\"\",CONCATENATE($A$2,DIGITADOR!$B$2,DIGITADOR!$M$1,C221),\"\")","v":""},null,{"$f":"IF(R221=\"\",\"\",INDEX('OTRAS REFERENCIAS'!$L$5:$M$152,MATCH(R221,'OTRAS REFERENCIAS'!$L$5:$L$157,0),2))","v":""},null,{"$f":"IF(T221=\"\",\"\",VLOOKUP(T221,'OTRAS REFERENCIAS'!$A$7:$B$9,2,FALSE))","v":""},null,"",null,null,null,{"$f":"IF(Z221=\"\",\"\",INDEX(REFERENTES!$A:$B,MATCH(Z221,REFERENTES!$B:$B,0),1))","v":""},"",null,null,{"$f":"IF(AD221=\"\",\"\",INDEX(REFERENTES!$D:$E,MATCH(AD221,REFERENTES!$E:$E,0),1))","v":""},{"$f":"IF(AD221=\"\",\"\",INDEX(REFERENTES!$D:$L,MATCH(AD221,REFERENTES!$E:$E,0),6))","v":""}]
[null,null,1,{"$f":"IF(Q222=\"\",\"\",IF(COUNTIF($Q222:Q222, Q222)>1, \"\", Q222))","v":""},null,null,"","","",null,{"$f":"IF(J222=\"\",\"\",INDEX(REFERENTES!$V:$W,MATCH(J222,REFERENTES!$W:$W,0),1))","v":""},"",null,null,218,"",{"$f":"IF(E222<>\"\",CONCATENATE($A$2,DIGITADOR!$B$2,DIGITADOR!$M$1,C222),\"\")","v":""},null,{"$f":"IF(R222=\"\",\"\",INDEX('OTRAS REFERENCIAS'!$L$5:$M$152,MATCH(R222,'OTRAS REFERENCIAS'!$L$5:$L$157,0),2))","v":""},null,{"$f":"IF(T222=\"\",\"\",VLOOKUP(T222,'OTRAS REFERENCIAS'!$A$7:$B$9,2,FALSE))","v":""},null,"",null,null,null,{"$f":"IF(Z222=\"\",\"\",INDEX(REFERENTES!$A:$B,MATCH(Z222,REFERENTES!$B:$B,0),1))","v":""},"",null,null,{"$f":"IF(AD222=\"\",\"\",INDEX(REFERENTES!$D:$E,MATCH(AD222,REFERENTES!$E:$E,0),1))","v":""},{"$f":"IF(AD222=\"\",\"\",INDEX(REFERENTES!$D:$L,MATCH(AD222,REFERENTES!$E:$E,0),6))","v":""}]
[null,null,1,{"$f":"IF(Q223=\"\",\"\",IF(COUNTIF($Q223:Q223, Q223)>1, \"\", Q223))","v":""},null,null,"","","",null,{"$f":"IF(J223=\"\",\"\",INDEX(REFERENTES!$V:$W,MATCH(J223,REFERENTES!$W:$W,0),1))","v":""},"",null,null,219,"",{"$f":"IF(E223<>\"\",CONCATENATE($A$2,DIGITADOR!$B$2,DIGITADOR!$M$1,C223),\"\")","v":""},null,{"$f":"IF(R223=\"\",\"\",INDEX('OTRAS REFERENCIAS'!$L$5:$M$152,MATCH(R223,'OTRAS REFERENCIAS'!$L$5:$L$157,0),2))","v":""},null,{"$f":"IF(T223=\"\",\"\",VLOOKUP(T223,'OTRAS REFERENCIAS'!$A$7:$B$9,2,FALSE))","v":""},null,"",null,null,null,{"$f":"IF(Z223=\"\",\"\",INDEX(REFERENTES!$A:$B,MATCH(Z223,REFERENTES!$B:$B,0),1))","v":""},"",null,null,{"$f":"IF(AD223=\"\",\"\",INDEX(REFERENTES!$D:$E,MATCH(AD223,REFERENTES!$E:$E,0),1))","v":""},{"$f":"IF(AD223=\"\",\"\",INDEX(REFERENTES!$D:$L,MATCH(AD223,REFERENTES!$E:$E,0),6))","v":""}]
[null,null,1,{"$f":"IF(Q224=\"\",\"\",IF(COUNTIF($Q224:Q224, Q224)>1, \"\", Q224))","v":""},null,null,"","","",null,{"$f":"IF(J224=\"\",\"\",INDEX(REFERENTES!$V:$W,MATCH(J224,REFERENTES!$W:$W,0),1))","v":""},"",null,null,220,"",{"$f":"IF(E224<>\"\",CONCATENATE($A$2,DIGITADOR!$B$2,DIGITADOR!$M$1,C224),\"\")","v":""},null,{"$f":"IF(R224=\"\",\"\",INDEX('OTRAS REFERENCIAS'!$L$5:$M$152,MATCH(R224,'OTRAS REFERENCIAS'!$L$5:$L$157,0),2))","v":""},null,{"$f":"IF(T224=\"\",\"\",VLOOKUP(T224,'OTRAS REFERENCIAS'!$A$7:$B$9,2,FALSE))","v":""},null,"",null,null,null,{"$f":"IF(Z224=\"\",\"\",INDEX(REFERENTES!$A:$B,MATCH(Z224,REFERENTES!$B:$B,0),1))","v":""},"",null,null,{"$f":"IF(AD224=\"\",\"\",INDEX(REFERENTES!$D:$E,MATCH(AD224,REFERENTES!$E:$E,0),1))","v":""},{"$f":"IF(AD224=\"\",\"\",INDEX(REFERENTES!$D:$L,MATCH(AD224,REFERENTES!$E:$E,0),6))","v":""}]
[null,null,1,{"$f":"IF(Q225=\"\",\"\",IF(COUNTIF($Q225:Q225, Q225)>1, \"\", Q225))","v":""},null,null,"","","",null,{"$f":"IF(J225=\"\",\"\",INDEX(REFERENTES!$V:$W,MATCH(J225,REFERENTES!$W:$W,0),1))","v":""},"",null,null,221,"",{"$f":"IF(E225<>\"\",CONCATENATE($A$2,DIGITADOR!$B$2,DIGITADOR!$M$1,C225),\"\")","v":""},null,{"$f":"IF(R225=\"\",\"\",INDEX('OTRAS REFERENCIAS'!$L$5:$M$152,MATCH(R225,'OTRAS REFERENCIAS'!$L$5:$L$157,0),2))","v":""},null,{"$f":"IF(T225=\"\",\"\",VLOOKUP(T225,'OTRAS REFERENCIAS'!$A$7:$B$9,2,FALSE))","v":""},null,"",null,null,null,{"$f":"IF(Z225=\"\",\"\",INDEX(REFERENTES!$A:$B,MATCH(Z225,REFERENTES!$B:$B,0),1))","v":""},"",null,null,{"$f":"IF(AD225=\"\",\"\",INDEX(REFERENTES!$D:$E,MATCH(AD225,REFERENTES!$E:$E,0),1))","v":""},{"$f":"IF(AD225=\"\",\"\",INDEX(REFERENTES!$D:$L,MATCH(AD225,REFERENTES!$E:$E,0),6))","v":""}]
[null,null,1,{"$f":"IF(Q226=\"\",\"\",IF(COUNTIF($Q226:Q226, Q226)>1, \"\", Q226))","v":""},null,null,"","","",null,{"$f":"IF(J226=\"\",\"\",INDEX(REFERENTES!$V:$W,MATCH(J226,REFERENTES!$W:$W,0),1))","v":""},"",null,null,222,"",{"$f":"IF(E226<>\"\",CONCATENATE($A$2,DIGITADOR!$B$2,DIGITADOR!$M$1,C226),\"\")","v":""},null,{"$f":"IF(R226=\"\",\"\",INDEX('OTRAS REFERENCIAS'!$L$5:$M$152,MATCH(R226,'OTRAS REFERENCIAS'!$L$5:$L$157,0),2))","v":""},null,{"$f":"IF(T226=\"\",\"\",VLOOKUP(T226,'OTRAS REFERENCIAS'!$A$7:$B$9,2,FALSE))","v":""},null,"",null,null,null,{"$f":"IF(Z226=\"\",\"\",INDEX(REFERENTES!$A:$B,MATCH(Z226,REFERENTES!$B:$B,0),1))","v":""},"",null,null,{"$f":"IF(AD226=\"\",\"\",INDEX(REFERENTES!$D:$E,MATCH(AD226,REFERENTES!$E:$E,0),1))","v":""},{"$f":"IF(AD226=\"\",\"\",INDEX(REFERENTES!$D:$L,MATCH(AD226,REFERENTES!$E:$E,0),6))","v":""}]
[null,null,1,{"$f":"IF(Q227=\"\",\"\",IF(COUNTIF($Q227:Q227, Q227)>1, \"\", Q227))","v":""},null,null,"","","",null,{"$f":"IF(J227=\"\",\"\",INDEX(REFERENTES!$V:$W,MATCH(J227,REFERENTES!$W:$W,0),1))","v":""},"",null,null,223,"",{"$f":"IF(E227<>\"\",CONCATENATE($A$2,DIGITADOR!$B$2,DIGITADOR!$M$1,C227),\"\")","v":""},null,{"$f":"IF(R227=\"\",\"\",INDEX('OTRAS REFERENCIAS'!$L$5:$M$152,MATCH(R227,'OTRAS REFERENCIAS'!$L$5:$L$157,0),2))","v":""},null,{"$f":"IF(T227=\"\",\"\",VLOOKUP(T227,'OTRAS REFERENCIAS'!$A$7:$B$9,2,FALSE))","v":""},null,"",null,null,null,{"$f":"IF(Z227=\"\",\"\",INDEX(REFERENTES!$A:$B,MATCH(Z227,REFERENTES!$B:$B,0),1))","v":""},"",null,null,{"$f":"IF(AD227=\"\",\"\",INDEX(REFERENTES!$D:$E,MATCH(AD227,REFERENTES!$E:$E,0),1))","v":""},{"$f":"IF(AD227=\"\",\"\",INDEX(REFERENTES!$D:$L,MATCH(AD227,REFERENTES!$E:$E,0),6))","v":""}]
[null,null,1,{"$f":"IF(Q228=\"\",\"\",IF(COUNTIF($Q228:Q228, Q228)>1, \"\", Q228))","v":""},null,null,"","","",null,{"$f":"IF(J228=\"\",\"\",INDEX(REFERENTES!$V:$W,MATCH(J228,REFERENTES!$W:$W,0),1))","v":""},"",null,null,224,"",{"$f":"IF(E228<>\"\",CONCATENATE($A$2,DIGITADOR!$B$2,DIGITADOR!$M$1,C228),\"\")","v":""},null,{"$f":"IF(R228=\"\",\"\",INDEX('OTRAS REFERENCIAS'!$L$5:$M$152,MATCH(R228,'OTRAS REFERENCIAS'!$L$5:$L$157,0),2))","v":""},null,{"$f":"IF(T228=\"\",\"\",VLOOKUP(T228,'OTRAS REFERENCIAS'!$A$7:$B$9,2,FALSE))","v":""},null,"",null,null,null,{"$f":"IF(Z228=\"\",\"\",INDEX(REFERENTES!$A:$B,MATCH(Z228,REFERENTES!$B:$B,0),1))","v":""},"",null,null,{"$f":"IF(AD228=\"\",\"\",INDEX(REFERENTES!$D:$E,MATCH(AD228,REFERENTES!$E:$E,0),1))","v":""},{"$f":"IF(AD228=\"\",\"\",INDEX(REFERENTES!$D:$L,MATCH(AD228,REFERENTES!$E:$E,0),6))","v":""}]
[null,null,1,{"$f":"IF(Q229=\"\",\"\",IF(COUNTIF($Q229:Q229, Q229)>1, \"\", Q229))","v":""},null,null,"","","",null,{"$f":"IF(J229=\"\",\"\",INDEX(REFERENTES!$V:$W,MATCH(J229,REFERENTES!$W:$W,0),1))","v":""},"",null,null,225,"",{"$f":"IF(E229<>\"\",CONCATENATE($A$2,DIGITADOR!$B$2,DIGITADOR!$M$1,C229),\"\")","v":""},null,{"$f":"IF(R229=\"\",\"\",INDEX('OTRAS REFERENCIAS'!$L$5:$M$152,MATCH(R229,'OTRAS REFERENCIAS'!$L$5:$L$157,0),2))","v":""},null,{"$f":"IF(T229=\"\",\"\",VLOOKUP(T229,'OTRAS REFERENCIAS'!$A$7:$B$9,2,FALSE))","v":""},null,"",null,null,null,{"$f":"IF(Z229=\"\",\"\",INDEX(REFERENTES!$A:$B,MATCH(Z229,REFERENTES!$B:$B,0),1))","v":""},"",null,null,{"$f":"IF(AD229=\"\",\"\",INDEX(REFERENTES!$D:$E,MATCH(AD229,REFERENTES!$E:$E,0),1))","v":""},{"$f":"IF(AD229=\"\",\"\",INDEX(REFERENTES!$D:$L,MATCH(AD229,REFERENTES!$E:$E,0),6))","v":""}]
[null,null,1,{"$f":"IF(Q230=\"\",\"\",IF(COUNTIF($Q230:Q230, Q230)>1, \"\", Q230))","v":""},null,null,"","","",null,{"$f":"IF(J230=\"\",\"\",INDEX(REFERENTES!$V:$W,MATCH(J230,REFERENTES!$W:$W,0),1))","v":""},"",null,null,226,"",{"$f":"IF(E230<>\"\",CONCATENATE($A$2,DIGITADOR!$B$2,DIGITADOR!$M$1,C230),\"\")","v":""},null,{"$f":"IF(R230=\"\",\"\",INDEX('OTRAS REFERENCIAS'!$L$5:$M$152,MATCH(R230,'OTRAS REFERENCIAS'!$L$5:$L$157,0),2))","v":""},null,{"$f":"IF(T230=\"\",\"\",VLOOKUP(T230,'OTRAS REFERENCIAS'!$A$7:$B$9,2,FALSE))","v":""},null,"",null,null,null,{"$f":"IF(Z230=\"\",\"\",INDEX(REFERENTES!$A:$B,MATCH(Z230,REFERENTES!$B:$B,0),1))","v":""},"",null,null,{"$f":"IF(AD230=\"\",\"\",INDEX(REFERENTES!$D:$E,MATCH(AD230,REFERENTES!$E:$E,0),1))","v":""},{"$f":"IF(AD230=\"\",\"\",INDEX(REFERENTES!$D:$L,MATCH(AD230,REFERENTES!$E:$E,0),6))","v":""}]
[null,null,1,{"$f":"IF(Q231=\"\",\"\",IF(COUNTIF($Q231:Q231, Q231)>1, \"\", Q231))","v":""},null,null,"","","",null,{"$f":"IF(J231=\"\",\"\",INDEX(REFERENTES!$V:$W,MATCH(J231,REFERENTES!$W:$W,0),1))","v":""},"",null,null,227,"",{"$f":"IF(E231<>\"\",CONCATENATE($A$2,DIGITADOR!$B$2,DIGITADOR!$M$1,C231),\"\")","v":""},null,{"$f":"IF(R231=\"\",\"\",INDEX('OTRAS REFERENCIAS'!$L$5:$M$152,MATCH(R231,'OTRAS REFERENCIAS'!$L$5:$L$157,0),2))","v":""},null,{"$f":"IF(T231=\"\",\"\",VLOOKUP(T231,'OTRAS REFERENCIAS'!$A$7:$B$9,2,FALSE))","v":""},null,"",null,null,null,{"$f":"IF(Z231=\"\",\"\",INDEX(REFERENTES!$A:$B,MATCH(Z231,REFERENTES!$B:$B,0),1))","v":""},"",null,null,{"$f":"IF(AD231=\"\",\"\",INDEX(REFERENTES!$D:$E,MATCH(AD231,REFERENTES!$E:$E,0),1))","v":""},{"$f":"IF(AD231=\"\",\"\",INDEX(REFERENTES!$D:$L,MATCH(AD231,REFERENTES!$E:$E,0),6))","v":""}]
[null,null,1,{"$f":"IF(Q232=\"\",\"\",IF(COUNTIF($Q232:Q232, Q232)>1, \"\", Q232))","v":""},null,null,"","","",null,{"$f":"IF(J232=\"\",\"\",INDEX(REFERENTES!$V:$W,MATCH(J232,REFERENTES!$W:$W,0),1))","v":""},"",null,null,228,"",{"$f":"IF(E232<>\"\",CONCATENATE($A$2,DIGITADOR!$B$2,DIGITADOR!$M$1,C232),\"\")","v":""},null,{"$f":"IF(R232=\"\",\"\",INDEX('OTRAS REFERENCIAS'!$L$5:$M$152,MATCH(R232,'OTRAS REFERENCIAS'!$L$5:$L$157,0),2))","v":""},null,{"$f":"IF(T232=\"\",\"\",VLOOKUP(T232,'OTRAS REFERENCIAS'!$A$7:$B$9,2,FALSE))","v":""},null,"",null,null,null,{"$f":"IF(Z232=\"\",\"\",INDEX(REFERENTES!$A:$B,MATCH(Z232,REFERENTES!$B:$B,0),1))","v":""},"",null,null,{"$f":"IF(AD232=\"\",\"\",INDEX(REFERENTES!$D:$E,MATCH(AD232,REFERENTES!$E:$E,0),1))","v":""},{"$f":"IF(AD232=\"\",\"\",INDEX(REFERENTES!$D:$L,MATCH(AD232,REFERENTES!$E:$E,0),6))","v":""}]
[null,null,1,{"$f":"IF(Q233=\"\",\"\",IF(COUNTIF($Q233:Q233, Q233)>1, \"\", Q233))","v":""},null,null,"",{"$f":"IF(G233<>\"\",MONTH(G233),\"\")","v":""},"",null,{"$f":"IF(J233=\"\",\"\",INDEX(REFERENTES!$V:$W,MATCH(J233,REFERENTES!$W:$W,0),1))","v":""},"",null,null,229,"",{"$f":"IF(E233<>\"\",CONCATENATE($A$2,DIGITADOR!$B$2,DIGITADOR!$M$1,C233),\"\")","v":""},null,{"$f":"IF(R233=\"\",\"\",INDEX('OTRAS REFERENCIAS'!$L$5:$M$152,MATCH(R233,'OTRAS REFERENCIAS'!$L$5:$L$157,0),2))","v":""},null,{"$f":"IF(T233=\"\",\"\",VLOOKUP(T233,'OTRAS REFERENCIAS'!$A$7:$B$9,2,FALSE))","v":""},null,"",null,null,null,{"$f":"IF(Z233=\"\",\"\",INDEX(REFERENTES!$A:$B,MATCH(Z233,REFERENTES!$B:$B,0),1))","v":""},"",null,null,{"$f":"IF(AD233=\"\",\"\",INDEX(REFERENTES!$D:$E,MATCH(AD233,REFERENTES!$E:$E,0),1))","v":""},{"$f":"IF(AD233=\"\",\"\",INDEX(REFERENTES!$D:$L,MATCH(AD233,REFERENTES!$E:$E,0),6))","v":""}]
[null,null,1,{"$f":"IF(Q234=\"\",\"\",IF(COUNTIF($Q234:Q234, Q234)>1, \"\", Q234))","v":""},null,null,"","","",null,{"$f":"IF(J234=\"\",\"\",INDEX(REFERENTES!$V:$W,MATCH(J234,REFERENTES!$W:$W,0),1))","v":""},"",null,null,230,"",{"$f":"IF(E234<>\"\",CONCATENATE($A$2,DIGITADOR!$B$2,DIGITADOR!$M$1,C234),\"\")","v":""},null,{"$f":"IF(R234=\"\",\"\",INDEX('OTRAS REFERENCIAS'!$L$5:$M$152,MATCH(R234,'OTRAS REFERENCIAS'!$L$5:$L$157,0),2))","v":""},null,{"$f":"IF(T234=\"\",\"\",VLOOKUP(T234,'OTRAS REFERENCIAS'!$A$7:$B$9,2,FALSE))","v":""},null,"",null,null,null,{"$f":"IF(Z234=\"\",\"\",INDEX(REFERENTES!$A:$B,MATCH(Z234,REFERENTES!$B:$B,0),1))","v":""},"",null,null,{"$f":"IF(AD234=\"\",\"\",INDEX(REFERENTES!$D:$E,MATCH(AD234,REFERENTES!$E:$E,0),1))","v":""},{"$f":"IF(AD234=\"\",\"\",INDEX(REFERENTES!$D:$L,MATCH(AD234,REFERENTES!$E:$E,0),6))","v":""}]
[null,null,1,{"$f":"IF(Q235=\"\",\"\",IF(COUNTIF($Q235:Q235, Q235)>1, \"\", Q235))","v":""},null,null,"","","",null,{"$f":"IF(J235=\"\",\"\",INDEX(REFERENTES!$V:$W,MATCH(J235,REFERENTES!$W:$W,0),1))","v":""},"",null,null,231,"",{"$f":"IF(E235<>\"\",CONCATENATE($A$2,DIGITADOR!$B$2,DIGITADOR!$M$1,C235),\"\")","v":""},null,{"$f":"IF(R235=\"\",\"\",INDEX('OTRAS REFERENCIAS'!$L$5:$M$152,MATCH(R235,'OTRAS REFERENCIAS'!$L$5:$L$157,0),2))","v":""},null,{"$f":"IF(T235=\"\",\"\",VLOOKUP(T235,'OTRAS REFERENCIAS'!$A$7:$B$9,2,FALSE))","v":""},null,"",null,null,null,{"$f":"IF(Z235=\"\",\"\",INDEX(REFERENTES!$A:$B,MATCH(Z235,REFERENTES!$B:$B,0),1))","v":""},"",null,null,{"$f":"IF(AD235=\"\",\"\",INDEX(REFERENTES!$D:$E,MATCH(AD235,REFERENTES!$E:$E,0),1))","v":""},{"$f":"IF(AD235=\"\",\"\",INDEX(REFERENTES!$D:$L,MATCH(AD235,REFERENTES!$E:$E,0),6))","v":""}]
[null,null,1,{"$f":"IF(Q236=\"\",\"\",IF(COUNTIF($Q236:Q236, Q236)>1, \"\", Q236))","v":""},null,null,"","","",null,{"$f":"IF(J236=\"\",\"\",INDEX(REFERENTES!$V:$W,MATCH(J236,REFERENTES!$W:$W,0),1))","v":""},"",null,null,232,"",{"$f":"IF(E236<>\"\",CONCATENATE($A$2,DIGITADOR!$B$2,DIGITADOR!$M$1,C236),\"\")","v":""},null,{"$f":"IF(R236=\"\",\"\",INDEX('OTRAS REFERENCIAS'!$L$5:$M$152,MATCH(R236,'OTRAS REFERENCIAS'!$L$5:$L$157,0),2))","v":""},null,{"$f":"IF(T236=\"\",\"\",VLOOKUP(T236,'OTRAS REFERENCIAS'!$A$7:$B$9,2,FALSE))","v":""},null,"",null,null,null,{"$f":"IF(Z236=\"\",\"\",INDEX(REFERENTES!$A:$B,MATCH(Z236,REFERENTES!$B:$B,0),1))","v":""},"",null,null,{"$f":"IF(AD236=\"\",\"\",INDEX(REFERENTES!$D:$E,MATCH(AD236,REFERENTES!$E:$E,0),1))","v":""},{"$f":"IF(AD236=\"\",\"\",INDEX(REFERENTES!$D:$L,MATCH(AD236,REFERENTES!$E:$E,0),6))","v":""}]
[null,null,1,{"$f":"IF(Q237=\"\",\"\",IF(COUNTIF($Q237:Q237, Q237)>1, \"\", Q237))","v":""},null,null,"","","",null,{"$f":"IF(J237=\"\",\"\",INDEX(REFERENTES!$V:$W,MATCH(J237,REFERENTES!$W:$W,0),1))","v":""},"",null,null,233,"",{"$f":"IF(E237<>\"\",CONCATENATE($A$2,DIGITADOR!$B$2,DIGITADOR!$M$1,C237),\"\")","v":""},null,{"$f":"IF(R237=\"\",\"\",INDEX('OTRAS REFERENCIAS'!$L$5:$M$152,MATCH(R237,'OTRAS REFERENCIAS'!$L$5:$L$157,0),2))","v":""},null,{"$f":"IF(T237=\"\",\"\",VLOOKUP(T237,'OTRAS REFERENCIAS'!$A$7:$B$9,2,FALSE))","v":""},null,"",null,null,null,{"$f":"IF(Z237=\"\",\"\",INDEX(REFERENTES!$A:$B,MATCH(Z237,REFERENTES!$B:$B,0),1))","v":""},"",null,null,{"$f":"IF(AD237=\"\",\"\",INDEX(REFERENTES!$D:$E,MATCH(AD237,REFERENTES!$E:$E,0),1))","v":""},{"$f":"IF(AD237=\"\",\"\",INDEX(REFERENTES!$D:$L,MATCH(AD237,REFERENTES!$E:$E,0),6))","v":""}]
[null,null,1,{"$f":"IF(Q238=\"\",\"\",IF(COUNTIF($Q238:Q238, Q238)>1, \"\", Q238))","v":""},null,null,"","","",null,{"$f":"IF(J238=\"\",\"\",INDEX(REFERENTES!$V:$W,MATCH(J238,REFERENTES!$W:$W,0),1))","v":""},"",null,null,234,"",{"$f":"IF(E238<>\"\",CONCATENATE($A$2,DIGITADOR!$B$2,DIGITADOR!$M$1,C238),\"\")","v":""},null,{"$f":"IF(R238=\"\",\"\",INDEX('OTRAS REFERENCIAS'!$L$5:$M$152,MATCH(R238,'OTRAS REFERENCIAS'!$L$5:$L$157,0),2))","v":""},null,{"$f":"IF(T238=\"\",\"\",VLOOKUP(T238,'OTRAS REFERENCIAS'!$A$7:$B$9,2,FALSE))","v":""},null,"",null,null,null,{"$f":"IF(Z238=\"\",\"\",INDEX(REFERENTES!$A:$B,MATCH(Z238,REFERENTES!$B:$B,0),1))","v":""},"",null,null,{"$f":"IF(AD238=\"\",\"\",INDEX(REFERENTES!$D:$E,MATCH(AD238,REFERENTES!$E:$E,0),1))","v":""},{"$f":"IF(AD238=\"\",\"\",INDEX(REFERENTES!$D:$L,MATCH(AD238,REFERENTES!$E:$E,0),6))","v":""}]
[null,null,1,{"$f":"IF(Q239=\"\",\"\",IF(COUNTIF($Q239:Q239, Q239)>1, \"\", Q239))","v":""},null,null,"","","",null,{"$f":"IF(J239=\"\",\"\",INDEX(REFERENTES!$V:$W,MATCH(J239,REFERENTES!$W:$W,0),1))","v":""},"",null,null,235,"",{"$f":"IF(E239<>\"\",CONCATENATE($A$2,DIGITADOR!$B$2,DIGITADOR!$M$1,C239),\"\")","v":""},null,{"$f":"IF(R239=\"\",\"\",INDEX('OTRAS REFERENCIAS'!$L$5:$M$152,MATCH(R239,'OTRAS REFERENCIAS'!$L$5:$L$157,0),2))","v":""},null,{"$f":"IF(T239=\"\",\"\",VLOOKUP(T239,'OTRAS REFERENCIAS'!$A$7:$B$9,2,FALSE))","v":""},null,"",null,null,null,{"$f":"IF(Z239=\"\",\"\",INDEX(REFERENTES!$A:$B,MATCH(Z239,REFERENTES!$B:$B,0),1))","v":""},"",null,null,{"$f":"IF(AD239=\"\",\"\",INDEX(REFERENTES!$D:$E,MATCH(AD239,REFERENTES!$E:$E,0),1))","v":""},{"$f":"IF(AD239=\"\",\"\",INDEX(REFERENTES!$D:$L,MATCH(AD239,REFERENTES!$E:$E,0),6))","v":""}]
[null,null,1,{"$f":"IF(Q240=\"\",\"\",IF(COUNTIF($Q240:Q240, Q240)>1, \"\", Q240))","v":""},null,null,"","","",null,{"$f":"IF(J240=\"\",\"\",INDEX(REFERENTES!$V:$W,MATCH(J240,REFERENTES!$W:$W,0),1))","v":""},"",null,null,236,"",{"$f":"IF(E240<>\"\",CONCATENATE($A$2,DIGITADOR!$B$2,DIGITADOR!$M$1,C240),\"\")","v":""},null,{"$f":"IF(R240=\"\",\"\",INDEX('OTRAS REFERENCIAS'!$L$5:$M$152,MATCH(R240,'OTRAS REFERENCIAS'!$L$5:$L$157,0),2))","v":""},null,{"$f":"IF(T240=\"\",\"\",VLOOKUP(T240,'OTRAS REFERENCIAS'!$A$7:$B$9,2,FALSE))","v":""},null,"",null,null,null,{"$f":"IF(Z240=\"\",\"\",INDEX(REFERENTES!$A:$B,MATCH(Z240,REFERENTES!$B:$B,0),1))","v":""},"",null,null,{"$f":"IF(AD240=\"\",\"\",INDEX(REFERENTES!$D:$E,MATCH(AD240,REFERENTES!$E:$E,0),1))","v":""},{"$f":"IF(AD240=\"\",\"\",INDEX(REFERENTES!$D:$L,MATCH(AD240,REFERENTES!$E:$E,0),6))","v":""}]
[null,null,1,{"$f":"IF(Q241=\"\",\"\",IF(COUNTIF($Q241:Q241, Q241)>1, \"\", Q241))","v":""},null,null,"","","",null,{"$f":"IF(J241=\"\",\"\",INDEX(REFERENTES!$V:$W,MATCH(J241,REFERENTES!$W:$W,0),1))","v":""},"",null,null,237,"",{"$f":"IF(E241<>\"\",CONCATENATE($A$2,DIGITADOR!$B$2,DIGITADOR!$M$1,C241),\"\")","v":""},null,{"$f":"IF(R241=\"\",\"\",INDEX('OTRAS REFERENCIAS'!$L$5:$M$152,MATCH(R241,'OTRAS REFERENCIAS'!$L$5:$L$157,0),2))","v":""},null,{"$f":"IF(T241=\"\",\"\",VLOOKUP(T241,'OTRAS REFERENCIAS'!$A$7:$B$9,2,FALSE))","v":""},null,"",null,null,null,{"$f":"IF(Z241=\"\",\"\",INDEX(REFERENTES!$A:$B,MATCH(Z241,REFERENTES!$B:$B,0),1))","v":""},"",null,null,{"$f":"IF(AD241=\"\",\"\",INDEX(REFERENTES!$D:$E,MATCH(AD241,REFERENTES!$E:$E,0),1))","v":""},{"$f":"IF(AD241=\"\",\"\",INDEX(REFERENTES!$D:$L,MATCH(AD241,REFERENTES!$E:$E,0),6))","v":""}]
[null,null,1,{"$f":"IF(Q242=\"\",\"\",IF(COUNTIF($Q242:Q242, Q242)>1, \"\", Q242))","v":""},null,null,"","","",null,{"$f":"IF(J242=\"\",\"\",INDEX(REFERENTES!$V:$W,MATCH(J242,REFERENTES!$W:$W,0),1))","v":""},"",null,null,238,"",{"$f":"IF(E242<>\"\",CONCATENATE($A$2,DIGITADOR!$B$2,DIGITADOR!$M$1,C242),\"\")","v":""},null,{"$f":"IF(R242=\"\",\"\",INDEX('OTRAS REFERENCIAS'!$L$5:$M$152,MATCH(R242,'OTRAS REFERENCIAS'!$L$5:$L$157,0),2))","v":""},null,{"$f":"IF(T242=\"\",\"\",VLOOKUP(T242,'OTRAS REFERENCIAS'!$A$7:$B$9,2,FALSE))","v":""},null,"",null,null,null,{"$f":"IF(Z242=\"\",\"\",INDEX(REFERENTES!$A:$B,MATCH(Z242,REFERENTES!$B:$B,0),1))","v":""},"",null,null,{"$f":"IF(AD242=\"\",\"\",INDEX(REFERENTES!$D:$E,MATCH(AD242,REFERENTES!$E:$E,0),1))","v":""},{"$f":"IF(AD242=\"\",\"\",INDEX(REFERENTES!$D:$L,MATCH(AD242,REFERENTES!$E:$E,0),6))","v":""}]
[null,null,1,{"$f":"IF(Q243=\"\",\"\",IF(COUNTIF($Q243:Q243, Q243)>1, \"\", Q243))","v":""},null,null,"","","",null,{"$f":"IF(J243=\"\",\"\",INDEX(REFERENTES!$V:$W,MATCH(J243,REFERENTES!$W:$W,0),1))","v":""},"",null,null,239,"",{"$f":"IF(E243<>\"\",CONCATENATE($A$2,DIGITADOR!$B$2,DIGITADOR!$M$1,C243),\"\")","v":""},null,{"$f":"IF(R243=\"\",\"\",INDEX('OTRAS REFERENCIAS'!$L$5:$M$152,MATCH(R243,'OTRAS REFERENCIAS'!$L$5:$L$157,0),2))","v":""},null,{"$f":"IF(T243=\"\",\"\",VLOOKUP(T243,'OTRAS REFERENCIAS'!$A$7:$B$9,2,FALSE))","v":""},null,"",null,null,null,{"$f":"IF(Z243=\"\",\"\",INDEX(REFERENTES!$A:$B,MATCH(Z243,REFERENTES!$B:$B,0),1))","v":""},"",null,null,{"$f":"IF(AD243=\"\",\"\",INDEX(REFERENTES!$D:$E,MATCH(AD243,REFERENTES!$E:$E,0),1))","v":""},{"$f":"IF(AD243=\"\",\"\",INDEX(REFERENTES!$D:$L,MATCH(AD243,REFERENTES!$E:$E,0),6))","v":""}]
[null,null,1,{"$f":"IF(Q244=\"\",\"\",IF(COUNTIF($Q244:Q244, Q244)>1, \"\", Q244))","v":""},null,null,"","","",null,{"$f":"IF(J244=\"\",\"\",INDEX(REFERENTES!$V:$W,MATCH(J244,REFERENTES!$W:$W,0),1))","v":""},"",null,null,240,"",{"$f":"IF(E244<>\"\",CONCATENATE($A$2,DIGITADOR!$B$2,DIGITADOR!$M$1,C244),\"\")","v":""},null,{"$f":"IF(R244=\"\",\"\",INDEX('OTRAS REFERENCIAS'!$L$5:$M$152,MATCH(R244,'OTRAS REFERENCIAS'!$L$5:$L$157,0),2))","v":""},null,{"$f":"IF(T244=\"\",\"\",VLOOKUP(T244,'OTRAS REFERENCIAS'!$A$7:$B$9,2,FALSE))","v":""},null,"",null,null,null,{"$f":"IF(Z244=\"\",\"\",INDEX(REFERENTES!$A:$B,MATCH(Z244,REFERENTES!$B:$B,0),1))","v":""},"",null,null,{"$f":"IF(AD244=\"\",\"\",INDEX(REFERENTES!$D:$E,MATCH(AD244,REFERENTES!$E:$E,0),1))","v":""},{"$f":"IF(AD244=\"\",\"\",INDEX(REFERENTES!$D:$L,MATCH(AD244,REFERENTES!$E:$E,0),6))","v":""}]
[null,null,1,{"$f":"IF(Q245=\"\",\"\",IF(COUNTIF($Q245:Q245, Q245)>1, \"\", Q245))","v":""},null,null,"","","",null,{"$f":"IF(J245=\"\",\"\",INDEX(REFERENTES!$V:$W,MATCH(J245,REFERENTES!$W:$W,0),1))","v":""},"",null,null,241,"",{"$f":"IF(E245<>\"\",CONCATENATE($A$2,DIGITADOR!$B$2,DIGITADOR!$M$1,C245),\"\")","v":""},null,{"$f":"IF(R245=\"\",\"\",INDEX('OTRAS REFERENCIAS'!$L$5:$M$152,MATCH(R245,'OTRAS REFERENCIAS'!$L$5:$L$157,0),2))","v":""},null,{"$f":"IF(T245=\"\",\"\",VLOOKUP(T245,'OTRAS REFERENCIAS'!$A$7:$B$9,2,FALSE))","v":""},null,"",null,null,null,{"$f":"IF(Z245=\"\",\"\",INDEX(REFERENTES!$A:$B,MATCH(Z245,REFERENTES!$B:$B,0),1))","v":""},"",null,null,{"$f":"IF(AD245=\"\",\"\",INDEX(REFERENTES!$D:$E,MATCH(AD245,REFERENTES!$E:$E,0),1))","v":""},{"$f":"IF(AD245=\"\",\"\",INDEX(REFERENTES!$D:$L,MATCH(AD245,REFERENTES!$E:$E,0),6))","v":""}]
[null,null,1,{"$f":"IF(Q246=\"\",\"\",IF(COUNTIF($Q246:Q246, Q246)>1, \"\", Q246))","v":""},null,null,"","","",null,{"$f":"IF(J246=\"\",\"\",INDEX(REFERENTES!$V:$W,MATCH(J246,REFERENTES!$W:$W,0),1))","v":""},"",null,null,242,"",{"$f":"IF(E246<>\"\",CONCATENATE($A$2,DIGITADOR!$B$2,DIGITADOR!$M$1,C246),\"\")","v":""},null,{"$f":"IF(R246=\"\",\"\",INDEX('OTRAS REFERENCIAS'!$L$5:$M$152,MATCH(R246,'OTRAS REFERENCIAS'!$L$5:$L$157,0),2))","v":""},null,{"$f":"IF(T246=\"\",\"\",VLOOKUP(T246,'OTRAS REFERENCIAS'!$A$7:$B$9,2,FALSE))","v":""},null,"",null,null,null,{"$f":"IF(Z246=\"\",\"\",INDEX(REFERENTES!$A:$B,MATCH(Z246,REFERENTES!$B:$B,0),1))","v":""},"",null,null,{"$f":"IF(AD246=\"\",\"\",INDEX(REFERENTES!$D:$E,MATCH(AD246,REFERENTES!$E:$E,0),1))","v":""},{"$f":"IF(AD246=\"\",\"\",INDEX(REFERENTES!$D:$L,MATCH(AD246,REFERENTES!$E:$E,0),6))","v":""}]
[null,null,1,{"$f":"IF(Q247=\"\",\"\",IF(COUNTIF($Q247:Q247, Q247)>1, \"\", Q247))","v":""},null,null,"","","",null,{"$f":"IF(J247=\"\",\"\",INDEX(REFERENTES!$V:$W,MATCH(J247,REFERENTES!$W:$W,0),1))","v":""},"",null,null,243,"",{"$f":"IF(E247<>\"\",CONCATENATE($A$2,DIGITADOR!$B$2,DIGITADOR!$M$1,C247),\"\")","v":""},null,{"$f":"IF(R247=\"\",\"\",INDEX('OTRAS REFERENCIAS'!$L$5:$M$152,MATCH(R247,'OTRAS REFERENCIAS'!$L$5:$L$157,0),2))","v":""},null,{"$f":"IF(T247=\"\",\"\",VLOOKUP(T247,'OTRAS REFERENCIAS'!$A$7:$B$9,2,FALSE))","v":""},null,"",null,null,null,{"$f":"IF(Z247=\"\",\"\",INDEX(REFERENTES!$A:$B,MATCH(Z247,REFERENTES!$B:$B,0),1))","v":""},"",null,null,{"$f":"IF(AD247=\"\",\"\",INDEX(REFERENTES!$D:$E,MATCH(AD247,REFERENTES!$E:$E,0),1))","v":""},{"$f":"IF(AD247=\"\",\"\",INDEX(REFERENTES!$D:$L,MATCH(AD247,REFERENTES!$E:$E,0),6))","v":""}]
[null,null,1,{"$f":"IF(Q248=\"\",\"\",IF(COUNTIF($Q248:Q248, Q248)>1, \"\", Q248))","v":""},null,null,"","","",null,{"$f":"IF(J248=\"\",\"\",INDEX(REFERENTES!$V:$W,MATCH(J248,REFERENTES!$W:$W,0),1))","v":""},"",null,null,244,"",{"$f":"IF(E248<>\"\",CONCATENATE($A$2,DIGITADOR!$B$2,DIGITADOR!$M$1,C248),\"\")","v":""},null,{"$f":"IF(R248=\"\",\"\",INDEX('OTRAS REFERENCIAS'!$L$5:$M$152,MATCH(R248,'OTRAS REFERENCIAS'!$L$5:$L$157,0),2))","v":""},null,{"$f":"IF(T248=\"\",\"\",VLOOKUP(T248,'OTRAS REFERENCIAS'!$A$7:$B$9,2,FALSE))","v":""},null,"",null,null,null,{"$f":"IF(Z248=\"\",\"\",INDEX(REFERENTES!$A:$B,MATCH(Z248,REFERENTES!$B:$B,0),1))","v":""},"",null,null,{"$f":"IF(AD248=\"\",\"\",INDEX(REFERENTES!$D:$E,MATCH(AD248,REFERENTES!$E:$E,0),1))","v":""},{"$f":"IF(AD248=\"\",\"\",INDEX(REFERENTES!$D:$L,MATCH(AD248,REFERENTES!$E:$E,0),6))","v":""}]
[null,null,1,{"$f":"IF(Q249=\"\",\"\",IF(COUNTIF($Q249:Q249, Q249)>1, \"\", Q249))","v":""},null,null,"","","",null,{"$f":"IF(J249=\"\",\"\",INDEX(REFERENTES!$V:$W,MATCH(J249,REFERENTES!$W:$W,0),1))","v":""},"",null,null,245,"",{"$f":"IF(E249<>\"\",CONCATENATE($A$2,DIGITADOR!$B$2,DIGITADOR!$M$1,C249),\"\")","v":""},null,{"$f":"IF(R249=\"\",\"\",INDEX('OTRAS REFERENCIAS'!$L$5:$M$152,MATCH(R249,'OTRAS REFERENCIAS'!$L$5:$L$157,0),2))","v":""},null,{"$f":"IF(T249=\"\",\"\",VLOOKUP(T249,'OTRAS REFERENCIAS'!$A$7:$B$9,2,FALSE))","v":""},null,"",null,null,null,{"$f":"IF(Z249=\"\",\"\",INDEX(REFERENTES!$A:$B,MATCH(Z249,REFERENTES!$B:$B,0),1))","v":""},"",null,null,{"$f":"IF(AD249=\"\",\"\",INDEX(REFERENTES!$D:$E,MATCH(AD249,REFERENTES!$E:$E,0),1))","v":""},{"$f":"IF(AD249=\"\",\"\",INDEX(REFERENTES!$D:$L,MATCH(AD249,REFERENTES!$E:$E,0),6))","v":""}]
[null,null,1,{"$f":"IF(Q250=\"\",\"\",IF(COUNTIF($Q250:Q250, Q250)>1, \"\", Q250))","v":""},null,null,"","","",null,{"$f":"IF(J250=\"\",\"\",INDEX(REFERENTES!$V:$W,MATCH(J250,REFERENTES!$W:$W,0),1))","v":""},"",null,null,246,"",{"$f":"IF(E250<>\"\",CONCATENATE($A$2,DIGITADOR!$B$2,DIGITADOR!$M$1,C250),\"\")","v":""},null,{"$f":"IF(R250=\"\",\"\",INDEX('OTRAS REFERENCIAS'!$L$5:$M$152,MATCH(R250,'OTRAS REFERENCIAS'!$L$5:$L$157,0),2))","v":""},null,{"$f":"IF(T250=\"\",\"\",VLOOKUP(T250,'OTRAS REFERENCIAS'!$A$7:$B$9,2,FALSE))","v":""},null,"",null,null,null,{"$f":"IF(Z250=\"\",\"\",INDEX(REFERENTES!$A:$B,MATCH(Z250,REFERENTES!$B:$B,0),1))","v":""},"",null,null,{"$f":"IF(AD250=\"\",\"\",INDEX(REFERENTES!$D:$E,MATCH(AD250,REFERENTES!$E:$E,0),1))","v":""},{"$f":"IF(AD250=\"\",\"\",INDEX(REFERENTES!$D:$L,MATCH(AD250,REFERENTES!$E:$E,0),6))","v":""}]
[null,null,1,{"$f":"IF(Q251=\"\",\"\",IF(COUNTIF($Q251:Q251, Q251)>1, \"\", Q251))","v":""},null,null,"","","",null,{"$f":"IF(J251=\"\",\"\",INDEX(REFERENTES!$V:$W,MATCH(J251,REFERENTES!$W:$W,0),1))","v":""},"",null,null,247,"",{"$f":"IF(E251<>\"\",CONCATENATE($A$2,DIGITADOR!$B$2,DIGITADOR!$M$1,C251),\"\")","v":""},null,{"$f":"IF(R251=\"\",\"\",INDEX('OTRAS REFERENCIAS'!$L$5:$M$152,MATCH(R251,'OTRAS REFERENCIAS'!$L$5:$L$157,0),2))","v":""},null,{"$f":"IF(T251=\"\",\"\",VLOOKUP(T251,'OTRAS REFERENCIAS'!$A$7:$B$9,2,FALSE))","v":""},null,"",null,null,null,{"$f":"IF(Z251=\"\",\"\",INDEX(REFERENTES!$A:$B,MATCH(Z251,REFERENTES!$B:$B,0),1))","v":""},"",null,null,{"$f":"IF(AD251=\"\",\"\",INDEX(REFERENTES!$D:$E,MATCH(AD251,REFERENTES!$E:$E,0),1))","v":""},{"$f":"IF(AD251=\"\",\"\",INDEX(REFERENTES!$D:$L,MATCH(AD251,REFERENTES!$E:$E,0),6))","v":""}]
[null,null,1,{"$f":"IF(Q252=\"\",\"\",IF(COUNTIF($Q252:Q252, Q252)>1, \"\", Q252))","v":""},null,null,"","","",null,{"$f":"IF(J252=\"\",\"\",INDEX(REFERENTES!$V:$W,MATCH(J252,REFERENTES!$W:$W,0),1))","v":""},"",null,null,248,"",{"$f":"IF(E252<>\"\",CONCATENATE($A$2,DIGITADOR!$B$2,DIGITADOR!$M$1,C252),\"\")","v":""},null,{"$f":"IF(R252=\"\",\"\",INDEX('OTRAS REFERENCIAS'!$L$5:$M$152,MATCH(R252,'OTRAS REFERENCIAS'!$L$5:$L$157,0),2))","v":""},null,{"$f":"IF(T252=\"\",\"\",VLOOKUP(T252,'OTRAS REFERENCIAS'!$A$7:$B$9,2,FALSE))","v":""},null,"",null,null,null,{"$f":"IF(Z252=\"\",\"\",INDEX(REFERENTES!$A:$B,MATCH(Z252,REFERENTES!$B:$B,0),1))","v":""},"",null,null,{"$f":"IF(AD252=\"\",\"\",INDEX(REFERENTES!$D:$E,MATCH(AD252,REFERENTES!$E:$E,0),1))","v":""},{"$f":"IF(AD252=\"\",\"\",INDEX(REFERENTES!$D:$L,MATCH(AD252,REFERENTES!$E:$E,0),6))","v":""}]
[null,null,1,{"$f":"IF(Q253=\"\",\"\",IF(COUNTIF($Q253:Q253, Q253)>1, \"\", Q253))","v":""},null,null,"","","",null,{"$f":"IF(J253=\"\",\"\",INDEX(REFERENTES!$V:$W,MATCH(J253,REFERENTES!$W:$W,0),1))","v":""},"",null,null,249,"",{"$f":"IF(E253<>\"\",CONCATENATE($A$2,DIGITADOR!$B$2,DIGITADOR!$M$1,C253),\"\")","v":""},null,{"$f":"IF(R253=\"\",\"\",INDEX('OTRAS REFERENCIAS'!$L$5:$M$152,MATCH(R253,'OTRAS REFERENCIAS'!$L$5:$L$157,0),2))","v":""},null,{"$f":"IF(T253=\"\",\"\",VLOOKUP(T253,'OTRAS REFERENCIAS'!$A$7:$B$9,2,FALSE))","v":""},null,"",null,null,null,{"$f":"IF(Z253=\"\",\"\",INDEX(REFERENTES!$A:$B,MATCH(Z253,REFERENTES!$B:$B,0),1))","v":""},"",null,null,{"$f":"IF(AD253=\"\",\"\",INDEX(REFERENTES!$D:$E,MATCH(AD253,REFERENTES!$E:$E,0),1))","v":""},{"$f":"IF(AD253=\"\",\"\",INDEX(REFERENTES!$D:$L,MATCH(AD253,REFERENTES!$E:$E,0),6))","v":""}]
[null,null,1,{"$f":"IF(Q254=\"\",\"\",IF(COUNTIF($Q254:Q254, Q254)>1, \"\", Q254))","v":""},null,null,"","","",null,{"$f":"IF(J254=\"\",\"\",INDEX(REFERENTES!$V:$W,MATCH(J254,REFERENTES!$W:$W,0),1))","v":""},"",null,null,250,"",{"$f":"IF(E254<>\"\",CONCATENATE($A$2,DIGITADOR!$B$2,DIGITADOR!$M$1,C254),\"\")","v":""},null,{"$f":"IF(R254=\"\",\"\",INDEX('OTRAS REFERENCIAS'!$L$5:$M$152,MATCH(R254,'OTRAS REFERENCIAS'!$L$5:$L$157,0),2))","v":""},null,{"$f":"IF(T254=\"\",\"\",VLOOKUP(T254,'OTRAS REFERENCIAS'!$A$7:$B$9,2,FALSE))","v":""},null,"",null,null,null,{"$f":"IF(Z254=\"\",\"\",INDEX(REFERENTES!$A:$B,MATCH(Z254,REFERENTES!$B:$B,0),1))","v":""},"",null,null,{"$f":"IF(AD254=\"\",\"\",INDEX(REFERENTES!$D:$E,MATCH(AD254,REFERENTES!$E:$E,0),1))","v":""},{"$f":"IF(AD254=\"\",\"\",INDEX(REFERENTES!$D:$L,MATCH(AD254,REFERENTES!$E:$E,0),6))","v":""}]
[null,null,1,{"$f":"IF(Q255=\"\",\"\",IF(COUNTIF($Q255:Q255, Q255)>1, \"\", Q255))","v":""},null,null,"","","",null,{"$f":"IF(J255=\"\",\"\",INDEX(REFERENTES!$V:$W,MATCH(J255,REFERENTES!$W:$W,0),1))","v":""},"",null,null,251,"",{"$f":"IF(E255<>\"\",CONCATENATE($A$2,DIGITADOR!$B$2,DIGITADOR!$M$1,C255),\"\")","v":""},null,{"$f":"IF(R255=\"\",\"\",INDEX('OTRAS REFERENCIAS'!$L$5:$M$152,MATCH(R255,'OTRAS REFERENCIAS'!$L$5:$L$157,0),2))","v":""},null,{"$f":"IF(T255=\"\",\"\",VLOOKUP(T255,'OTRAS REFERENCIAS'!$A$7:$B$9,2,FALSE))","v":""},null,"",null,null,null,{"$f":"IF(Z255=\"\",\"\",INDEX(REFERENTES!$A:$B,MATCH(Z255,REFERENTES!$B:$B,0),1))","v":""},"",null,null,{"$f":"IF(AD255=\"\",\"\",INDEX(REFERENTES!$D:$E,MATCH(AD255,REFERENTES!$E:$E,0),1))","v":""},{"$f":"IF(AD255=\"\",\"\",INDEX(REFERENTES!$D:$L,MATCH(AD255,REFERENTES!$E:$E,0),6))","v":""}]
[null,null,1,{"$f":"IF(Q256=\"\",\"\",IF(COUNTIF($Q256:Q256, Q256)>1, \"\", Q256))","v":""},null,null,"","","",null,{"$f":"IF(J256=\"\",\"\",INDEX(REFERENTES!$V:$W,MATCH(J256,REFERENTES!$W:$W,0),1))","v":""},"",null,null,252,"",{"$f":"IF(E256<>\"\",CONCATENATE($A$2,DIGITADOR!$B$2,DIGITADOR!$M$1,C256),\"\")","v":""},null,{"$f":"IF(R256=\"\",\"\",INDEX('OTRAS REFERENCIAS'!$L$5:$M$152,MATCH(R256,'OTRAS REFERENCIAS'!$L$5:$L$157,0),2))","v":""},null,{"$f":"IF(T256=\"\",\"\",VLOOKUP(T256,'OTRAS REFERENCIAS'!$A$7:$B$9,2,FALSE))","v":""},null,"",null,null,null,{"$f":"IF(Z256=\"\",\"\",INDEX(REFERENTES!$A:$B,MATCH(Z256,REFERENTES!$B:$B,0),1))","v":""},"",null,null,{"$f":"IF(AD256=\"\",\"\",INDEX(REFERENTES!$D:$E,MATCH(AD256,REFERENTES!$E:$E,0),1))","v":""},{"$f":"IF(AD256=\"\",\"\",INDEX(REFERENTES!$D:$L,MATCH(AD256,REFERENTES!$E:$E,0),6))","v":""}]
[null,null,1,{"$f":"IF(Q257=\"\",\"\",IF(COUNTIF($Q257:Q257, Q257)>1, \"\", Q257))","v":""},null,null,"","","",null,{"$f":"IF(J257=\"\",\"\",INDEX(REFERENTES!$V:$W,MATCH(J257,REFERENTES!$W:$W,0),1))","v":""},"",null,null,253,"",{"$f":"IF(E257<>\"\",CONCATENATE($A$2,DIGITADOR!$B$2,DIGITADOR!$M$1,C257),\"\")","v":""},null,{"$f":"IF(R257=\"\",\"\",INDEX('OTRAS REFERENCIAS'!$L$5:$M$152,MATCH(R257,'OTRAS REFERENCIAS'!$L$5:$L$157,0),2))","v":""},null,{"$f":"IF(T257=\"\",\"\",VLOOKUP(T257,'OTRAS REFERENCIAS'!$A$7:$B$9,2,FALSE))","v":""},null,"",null,null,null,{"$f":"IF(Z257=\"\",\"\",INDEX(REFERENTES!$A:$B,MATCH(Z257,REFERENTES!$B:$B,0),1))","v":""},"",null,null,{"$f":"IF(AD257=\"\",\"\",INDEX(REFERENTES!$D:$E,MATCH(AD257,REFERENTES!$E:$E,0),1))","v":""},{"$f":"IF(AD257=\"\",\"\",INDEX(REFERENTES!$D:$L,MATCH(AD257,REFERENTES!$E:$E,0),6))","v":""}]
[null,null,1,{"$f":"IF(Q258=\"\",\"\",IF(COUNTIF($Q258:Q258, Q258)>1, \"\", Q258))","v":""},null,null,"","","",null,{"$f":"IF(J258=\"\",\"\",INDEX(REFERENTES!$V:$W,MATCH(J258,REFERENTES!$W:$W,0),1))","v":""},"",null,null,254,"",{"$f":"IF(E258<>\"\",CONCATENATE($A$2,DIGITADOR!$B$2,DIGITADOR!$M$1,C258),\"\")","v":""},null,{"$f":"IF(R258=\"\",\"\",INDEX('OTRAS REFERENCIAS'!$L$5:$M$152,MATCH(R258,'OTRAS REFERENCIAS'!$L$5:$L$157,0),2))","v":""},null,{"$f":"IF(T258=\"\",\"\",VLOOKUP(T258,'OTRAS REFERENCIAS'!$A$7:$B$9,2,FALSE))","v":""},null,"",null,null,null,{"$f":"IF(Z258=\"\",\"\",INDEX(REFERENTES!$A:$B,MATCH(Z258,REFERENTES!$B:$B,0),1))","v":""},"",null,null,{"$f":"IF(AD258=\"\",\"\",INDEX(REFERENTES!$D:$E,MATCH(AD258,REFERENTES!$E:$E,0),1))","v":""},{"$f":"IF(AD258=\"\",\"\",INDEX(REFERENTES!$D:$L,MATCH(AD258,REFERENTES!$E:$E,0),6))","v":""}]
[null,null,1,{"$f":"IF(Q259=\"\",\"\",IF(COUNTIF($Q259:Q259, Q259)>1, \"\", Q259))","v":""},null,null,"","","",null,{"$f":"IF(J259=\"\",\"\",INDEX(REFERENTES!$V:$W,MATCH(J259,REFERENTES!$W:$W,0),1))","v":""},"",null,null,255,"",{"$f":"IF(E259<>\"\",CONCATENATE($A$2,DIGITADOR!$B$2,DIGITADOR!$M$1,C259),\"\")","v":""},null,{"$f":"IF(R259=\"\",\"\",INDEX('OTRAS REFERENCIAS'!$L$5:$M$152,MATCH(R259,'OTRAS REFERENCIAS'!$L$5:$L$157,0),2))","v":""},null,{"$f":"IF(T259=\"\",\"\",VLOOKUP(T259,'OTRAS REFERENCIAS'!$A$7:$B$9,2,FALSE))","v":""},null,"",null,null,null,{"$f":"IF(Z259=\"\",\"\",INDEX(REFERENTES!$A:$B,MATCH(Z259,REFERENTES!$B:$B,0),1))","v":""},"",null,null,{"$f":"IF(AD259=\"\",\"\",INDEX(REFERENTES!$D:$E,MATCH(AD259,REFERENTES!$E:$E,0),1))","v":""},{"$f":"IF(AD259=\"\",\"\",INDEX(REFERENTES!$D:$L,MATCH(AD259,REFERENTES!$E:$E,0),6))","v":""}]
[null,null,1,{"$f":"IF(Q260=\"\",\"\",IF(COUNTIF($Q260:Q260, Q260)>1, \"\", Q260))","v":""},null,null,"","","",null,{"$f":"IF(J260=\"\",\"\",INDEX(REFERENTES!$V:$W,MATCH(J260,REFERENTES!$W:$W,0),1))","v":""},"",null,null,256,"",{"$f":"IF(E260<>\"\",CONCATENATE($A$2,DIGITADOR!$B$2,DIGITADOR!$M$1,C260),\"\")","v":""},null,{"$f":"IF(R260=\"\",\"\",INDEX('OTRAS REFERENCIAS'!$L$5:$M$152,MATCH(R260,'OTRAS REFERENCIAS'!$L$5:$L$157,0),2))","v":""},null,{"$f":"IF(T260=\"\",\"\",VLOOKUP(T260,'OTRAS REFERENCIAS'!$A$7:$B$9,2,FALSE))","v":""},null,"",null,null,null,{"$f":"IF(Z260=\"\",\"\",INDEX(REFERENTES!$A:$B,MATCH(Z260,REFERENTES!$B:$B,0),1))","v":""},"",null,null,{"$f":"IF(AD260=\"\",\"\",INDEX(REFERENTES!$D:$E,MATCH(AD260,REFERENTES!$E:$E,0),1))","v":""},{"$f":"IF(AD260=\"\",\"\",INDEX(REFERENTES!$D:$L,MATCH(AD260,REFERENTES!$E:$E,0),6))","v":""}]
[null,null,{"$f":"IF(L261=L260,C260,C260+1)","v":1},{"$f":"IF(Q261=\"\",\"\",IF(COUNTIF($Q261:Q261, Q261)>1, \"\", Q261))","v":""},null,null,"","","",null,{"$f":"IF(J261=\"\",\"\",INDEX(REFERENTES!$V:$W,MATCH(J261,REFERENTES!$W:$W,0),1))","v":""},{"$f":"IF(G261=\"\",\"\",CONCATENATE(G261,S261,K261,X261))","v":""},null,null,257,"",{"$f":"IF(E261<>\"\",CONCATENATE($A$2,DIGITADOR!$B$2,DIGITADOR!$M$1,C261),\"\")","v":""},null,{"$f":"IF(R261=\"\",\"\",INDEX('OTRAS REFERENCIAS'!$L$5:$M$152,MATCH(R261,'OTRAS REFERENCIAS'!$L$5:$L$157,0),2))","v":""},null,{"$f":"IF(T261=\"\",\"\",VLOOKUP(T261,'OTRAS REFERENCIAS'!$A$7:$B$9,2,FALSE))","v":""},null,"",null,null,null,{"$f":"IF(Z261=\"\",\"\",INDEX(REFERENTES!$A:$B,MATCH(Z261,REFERENTES!$B:$B,0),1))","v":""},"",null,null,{"$f":"IF(AD261=\"\",\"\",INDEX(REFERENTES!$D:$E,MATCH(AD261,REFERENTES!$E:$E,0),1))","v":""},{"$f":"IF(AD261=\"\",\"\",INDEX(REFERENTES!$D:$L,MATCH(AD261,REFERENTES!$E:$E,0),6))","v":""}]
[null,null,1,{"$f":"IF(Q262=\"\",\"\",IF(COUNTIF($Q262:Q262, Q262)>1, \"\", Q262))","v":""},null,null,{"$f":"IF(E262=\"\",\"\",E262+F262)","v":""},"",{"$f":"IF(D262=\"\",\"\",1)","v":""},null,{"$f":"IF(J262=\"\",\"\",INDEX(REFERENTES!$V:$W,MATCH(J262,REFERENTES!$W:$W,0),1))","v":""},"",null,null,258,{"$f":"IF(Q262=\"\",\"\",CONCATENATE(Q262,ROW()-2))","v":""},{"$f":"IF(E262<>\"\",CONCATENATE($A$2,DIGITADOR!$B$2,DIGITADOR!$M$1,C262),\"\")","v":""},null,{"$f":"IF(R262=\"\",\"\",INDEX('OTRAS REFERENCIAS'!$L$5:$M$152,MATCH(R262,'OTRAS REFERENCIAS'!$L$5:$L$157,0),2))","v":""},null,{"$f":"IF(T262=\"\",\"\",VLOOKUP(T262,'OTRAS REFERENCIAS'!$A$7:$B$9,2,FALSE))","v":""},null,{"$f":"CONCATENATE(T262,V262)","v":""},null,null,null,{"$f":"IF(Z262=\"\",\"\",INDEX(REFERENTES!$A:$B,MATCH(Z262,REFERENTES!$B:$B,0),1))","v":""},{"$f":"UPPER(AD262)","v":""},null,null,{"$f":"IF(AD262=\"\",\"\",INDEX(REFERENTES!$D:$E,MATCH(AD262,REFERENTES!$E:$E,0),1))","v":""},{"$f":"IF(AD262=\"\",\"\",INDEX(REFERENTES!$D:$L,MATCH(AD262,REFERENTES!$E:$E,0),6))","v":""}]
[null,null,1,{"$f":"IF(Q263=\"\",\"\",IF(COUNTIF($Q263:Q263, Q263)>1, \"\", Q263))","v":""},null,null,"","","",null,{"$f":"IF(J263=\"\",\"\",INDEX(REFERENTES!$V:$W,MATCH(J263,REFERENTES!$W:$W,0),1))","v":""},"",null,null,259,"",{"$f":"IF(E263<>\"\",CONCATENATE($A$2,DIGITADOR!$B$2,DIGITADOR!$M$1,C263),\"\")","v":""},null,{"$f":"IF(R263=\"\",\"\",INDEX('OTRAS REFERENCIAS'!$L$5:$M$152,MATCH(R263,'OTRAS REFERENCIAS'!$L$5:$L$157,0),2))","v":""},null,{"$f":"IF(T263=\"\",\"\",VLOOKUP(T263,'OTRAS REFERENCIAS'!$A$7:$B$9,2,FALSE))","v":""},null,"",null,null,null,{"$f":"IF(Z263=\"\",\"\",INDEX(REFERENTES!$A:$B,MATCH(Z263,REFERENTES!$B:$B,0),1))","v":""},"",null,null,{"$f":"IF(AD263=\"\",\"\",INDEX(REFERENTES!$D:$E,MATCH(AD263,REFERENTES!$E:$E,0),1))","v":""},{"$f":"IF(AD263=\"\",\"\",INDEX(REFERENTES!$D:$L,MATCH(AD263,REFERENTES!$E:$E,0),6))","v":""}]
[null,null,1,{"$f":"IF(Q264=\"\",\"\",IF(COUNTIF($Q264:Q264, Q264)>1, \"\", Q264))","v":""},null,null,"","","",null,{"$f":"IF(J264=\"\",\"\",INDEX(REFERENTES!$V:$W,MATCH(J264,REFERENTES!$W:$W,0),1))","v":""},"",null,null,260,"",{"$f":"IF(E264<>\"\",CONCATENATE($A$2,DIGITADOR!$B$2,DIGITADOR!$M$1,C264),\"\")","v":""},null,{"$f":"IF(R264=\"\",\"\",INDEX('OTRAS REFERENCIAS'!$L$5:$M$152,MATCH(R264,'OTRAS REFERENCIAS'!$L$5:$L$157,0),2))","v":""},null,{"$f":"IF(T264=\"\",\"\",VLOOKUP(T264,'OTRAS REFERENCIAS'!$A$7:$B$9,2,FALSE))","v":""},null,"",null,null,null,{"$f":"IF(Z264=\"\",\"\",INDEX(REFERENTES!$A:$B,MATCH(Z264,REFERENTES!$B:$B,0),1))","v":""},"",null,null,{"$f":"IF(AD264=\"\",\"\",INDEX(REFERENTES!$D:$E,MATCH(AD264,REFERENTES!$E:$E,0),1))","v":""},{"$f":"IF(AD264=\"\",\"\",INDEX(REFERENTES!$D:$L,MATCH(AD264,REFERENTES!$E:$E,0),6))","v":""}]
[null,null,1,{"$f":"IF(Q265=\"\",\"\",IF(COUNTIF($Q265:Q265, Q265)>1, \"\", Q265))","v":""},null,null,"","","",null,{"$f":"IF(J265=\"\",\"\",INDEX(REFERENTES!$V:$W,MATCH(J265,REFERENTES!$W:$W,0),1))","v":""},"",null,null,261,"",{"$f":"IF(E265<>\"\",CONCATENATE($A$2,DIGITADOR!$B$2,DIGITADOR!$M$1,C265),\"\")","v":""},null,{"$f":"IF(R265=\"\",\"\",INDEX('OTRAS REFERENCIAS'!$L$5:$M$152,MATCH(R265,'OTRAS REFERENCIAS'!$L$5:$L$157,0),2))","v":""},null,{"$f":"IF(T265=\"\",\"\",VLOOKUP(T265,'OTRAS REFERENCIAS'!$A$7:$B$9,2,FALSE))","v":""},null,"",null,null,null,{"$f":"IF(Z265=\"\",\"\",INDEX(REFERENTES!$A:$B,MATCH(Z265,REFERENTES!$B:$B,0),1))","v":""},"",null,null,{"$f":"IF(AD265=\"\",\"\",INDEX(REFERENTES!$D:$E,MATCH(AD265,REFERENTES!$E:$E,0),1))","v":""},{"$f":"IF(AD265=\"\",\"\",INDEX(REFERENTES!$D:$L,MATCH(AD265,REFERENTES!$E:$E,0),6))","v":""}]
[null,null,1,{"$f":"IF(Q266=\"\",\"\",IF(COUNTIF($Q266:Q266, Q266)>1, \"\", Q266))","v":""},null,null,"","","",null,{"$f":"IF(J266=\"\",\"\",INDEX(REFERENTES!$V:$W,MATCH(J266,REFERENTES!$W:$W,0),1))","v":""},"",null,null,262,"",{"$f":"IF(E266<>\"\",CONCATENATE($A$2,DIGITADOR!$B$2,DIGITADOR!$M$1,C266),\"\")","v":""},null,{"$f":"IF(R266=\"\",\"\",INDEX('OTRAS REFERENCIAS'!$L$5:$M$152,MATCH(R266,'OTRAS REFERENCIAS'!$L$5:$L$157,0),2))","v":""},null,{"$f":"IF(T266=\"\",\"\",VLOOKUP(T266,'OTRAS REFERENCIAS'!$A$7:$B$9,2,FALSE))","v":""},null,"",null,null,null,{"$f":"IF(Z266=\"\",\"\",INDEX(REFERENTES!$A:$B,MATCH(Z266,REFERENTES!$B:$B,0),1))","v":""},"",null,null,{"$f":"IF(AD266=\"\",\"\",INDEX(REFERENTES!$D:$E,MATCH(AD266,REFERENTES!$E:$E,0),1))","v":""},{"$f":"IF(AD266=\"\",\"\",INDEX(REFERENTES!$D:$L,MATCH(AD266,REFERENTES!$E:$E,0),6))","v":""}]
[null,null,1,{"$f":"IF(Q267=\"\",\"\",IF(COUNTIF($Q267:Q267, Q267)>1, \"\", Q267))","v":""},null,null,"","","",null,{"$f":"IF(J267=\"\",\"\",INDEX(REFERENTES!$V:$W,MATCH(J267,REFERENTES!$W:$W,0),1))","v":""},"",null,null,263,"",{"$f":"IF(E267<>\"\",CONCATENATE($A$2,DIGITADOR!$B$2,DIGITADOR!$M$1,C267),\"\")","v":""},null,{"$f":"IF(R267=\"\",\"\",INDEX('OTRAS REFERENCIAS'!$L$5:$M$152,MATCH(R267,'OTRAS REFERENCIAS'!$L$5:$L$157,0),2))","v":""},null,{"$f":"IF(T267=\"\",\"\",VLOOKUP(T267,'OTRAS REFERENCIAS'!$A$7:$B$9,2,FALSE))","v":""},null,"",null,null,null,{"$f":"IF(Z267=\"\",\"\",INDEX(REFERENTES!$A:$B,MATCH(Z267,REFERENTES!$B:$B,0),1))","v":""},"",null,null,{"$f":"IF(AD267=\"\",\"\",INDEX(REFERENTES!$D:$E,MATCH(AD267,REFERENTES!$E:$E,0),1))","v":""},{"$f":"IF(AD267=\"\",\"\",INDEX(REFERENTES!$D:$L,MATCH(AD267,REFERENTES!$E:$E,0),6))","v":""}]
[null,null,1,{"$f":"IF(Q268=\"\",\"\",IF(COUNTIF($Q268:Q268, Q268)>1, \"\", Q268))","v":""},null,null,"","","",null,{"$f":"IF(J268=\"\",\"\",INDEX(REFERENTES!$V:$W,MATCH(J268,REFERENTES!$W:$W,0),1))","v":""},"",null,null,264,"",{"$f":"IF(E268<>\"\",CONCATENATE($A$2,DIGITADOR!$B$2,DIGITADOR!$M$1,C268),\"\")","v":""},null,{"$f":"IF(R268=\"\",\"\",INDEX('OTRAS REFERENCIAS'!$L$5:$M$152,MATCH(R268,'OTRAS REFERENCIAS'!$L$5:$L$157,0),2))","v":""},null,{"$f":"IF(T268=\"\",\"\",VLOOKUP(T268,'OTRAS REFERENCIAS'!$A$7:$B$9,2,FALSE))","v":""},null,"",null,null,null,{"$f":"IF(Z268=\"\",\"\",INDEX(REFERENTES!$A:$B,MATCH(Z268,REFERENTES!$B:$B,0),1))","v":""},"",null,null,{"$f":"IF(AD268=\"\",\"\",INDEX(REFERENTES!$D:$E,MATCH(AD268,REFERENTES!$E:$E,0),1))","v":""},{"$f":"IF(AD268=\"\",\"\",INDEX(REFERENTES!$D:$L,MATCH(AD268,REFERENTES!$E:$E,0),6))","v":""}]
[null,null,1,{"$f":"IF(Q269=\"\",\"\",IF(COUNTIF($Q269:Q269, Q269)>1, \"\", Q269))","v":""},null,null,"","","",null,{"$f":"IF(J269=\"\",\"\",INDEX(REFERENTES!$V:$W,MATCH(J269,REFERENTES!$W:$W,0),1))","v":""},"",null,null,265,"",{"$f":"IF(E269<>\"\",CONCATENATE($A$2,DIGITADOR!$B$2,DIGITADOR!$M$1,C269),\"\")","v":""},null,{"$f":"IF(R269=\"\",\"\",INDEX('OTRAS REFERENCIAS'!$L$5:$M$152,MATCH(R269,'OTRAS REFERENCIAS'!$L$5:$L$157,0),2))","v":""},null,{"$f":"IF(T269=\"\",\"\",VLOOKUP(T269,'OTRAS REFERENCIAS'!$A$7:$B$9,2,FALSE))","v":""},null,"",null,null,null,{"$f":"IF(Z269=\"\",\"\",INDEX(REFERENTES!$A:$B,MATCH(Z269,REFERENTES!$B:$B,0),1))","v":""},"",null,null,{"$f":"IF(AD269=\"\",\"\",INDEX(REFERENTES!$D:$E,MATCH(AD269,REFERENTES!$E:$E,0),1))","v":""},{"$f":"IF(AD269=\"\",\"\",INDEX(REFERENTES!$D:$L,MATCH(AD269,REFERENTES!$E:$E,0),6))","v":""}]
[null,null,1,{"$f":"IF(Q270=\"\",\"\",IF(COUNTIF($Q270:Q270, Q270)>1, \"\", Q270))","v":""},null,null,"","","",null,{"$f":"IF(J270=\"\",\"\",INDEX(REFERENTES!$V:$W,MATCH(J270,REFERENTES!$W:$W,0),1))","v":""},"",null,null,266,"",{"$f":"IF(E270<>\"\",CONCATENATE($A$2,DIGITADOR!$B$2,DIGITADOR!$M$1,C270),\"\")","v":""},null,{"$f":"IF(R270=\"\",\"\",INDEX('OTRAS REFERENCIAS'!$L$5:$M$152,MATCH(R270,'OTRAS REFERENCIAS'!$L$5:$L$157,0),2))","v":""},null,{"$f":"IF(T270=\"\",\"\",VLOOKUP(T270,'OTRAS REFERENCIAS'!$A$7:$B$9,2,FALSE))","v":""},null,"",null,null,null,{"$f":"IF(Z270=\"\",\"\",INDEX(REFERENTES!$A:$B,MATCH(Z270,REFERENTES!$B:$B,0),1))","v":""},"",null,null,{"$f":"IF(AD270=\"\",\"\",INDEX(REFERENTES!$D:$E,MATCH(AD270,REFERENTES!$E:$E,0),1))","v":""},{"$f":"IF(AD270=\"\",\"\",INDEX(REFERENTES!$D:$L,MATCH(AD270,REFERENTES!$E:$E,0),6))","v":""}]
[null,null,1,{"$f":"IF(Q271=\"\",\"\",IF(COUNTIF($Q271:Q271, Q271)>1, \"\", Q271))","v":""},null,null,"","","",null,{"$f":"IF(J271=\"\",\"\",INDEX(REFERENTES!$V:$W,MATCH(J271,REFERENTES!$W:$W,0),1))","v":""},"",null,null,267,"",{"$f":"IF(E271<>\"\",CONCATENATE($A$2,DIGITADOR!$B$2,DIGITADOR!$M$1,C271),\"\")","v":""},null,{"$f":"IF(R271=\"\",\"\",INDEX('OTRAS REFERENCIAS'!$L$5:$M$152,MATCH(R271,'OTRAS REFERENCIAS'!$L$5:$L$157,0),2))","v":""},null,{"$f":"IF(T271=\"\",\"\",VLOOKUP(T271,'OTRAS REFERENCIAS'!$A$7:$B$9,2,FALSE))","v":""},null,"",null,null,null,{"$f":"IF(Z271=\"\",\"\",INDEX(REFERENTES!$A:$B,MATCH(Z271,REFERENTES!$B:$B,0),1))","v":""},"",null,null,{"$f":"IF(AD271=\"\",\"\",INDEX(REFERENTES!$D:$E,MATCH(AD271,REFERENTES!$E:$E,0),1))","v":""},{"$f":"IF(AD271=\"\",\"\",INDEX(REFERENTES!$D:$L,MATCH(AD271,REFERENTES!$E:$E,0),6))","v":""}]
[null,null,1,{"$f":"IF(Q272=\"\",\"\",IF(COUNTIF($Q272:Q272, Q272)>1, \"\", Q272))","v":""},null,null,"","","",null,{"$f":"IF(J272=\"\",\"\",INDEX(REFERENTES!$V:$W,MATCH(J272,REFERENTES!$W:$W,0),1))","v":""},"",null,null,268,"",{"$f":"IF(E272<>\"\",CONCATENATE($A$2,DIGITADOR!$B$2,DIGITADOR!$M$1,C272),\"\")","v":""},null,{"$f":"IF(R272=\"\",\"\",INDEX('OTRAS REFERENCIAS'!$L$5:$M$152,MATCH(R272,'OTRAS REFERENCIAS'!$L$5:$L$157,0),2))","v":""},null,{"$f":"IF(T272=\"\",\"\",VLOOKUP(T272,'OTRAS REFERENCIAS'!$A$7:$B$9,2,FALSE))","v":""},null,"",null,null,null,{"$f":"IF(Z272=\"\",\"\",INDEX(REFERENTES!$A:$B,MATCH(Z272,REFERENTES!$B:$B,0),1))","v":""},"",null,null,{"$f":"IF(AD272=\"\",\"\",INDEX(REFERENTES!$D:$E,MATCH(AD272,REFERENTES!$E:$E,0),1))","v":""},{"$f":"IF(AD272=\"\",\"\",INDEX(REFERENTES!$D:$L,MATCH(AD272,REFERENTES!$E:$E,0),6))","v":""}]
[null,null,1,{"$f":"IF(Q273=\"\",\"\",IF(COUNTIF($Q273:Q273, Q273)>1, \"\", Q273))","v":""},null,null,"","","",null,{"$f":"IF(J273=\"\",\"\",INDEX(REFERENTES!$V:$W,MATCH(J273,REFERENTES!$W:$W,0),1))","v":""},"",null,null,269,"",{"$f":"IF(E273<>\"\",CONCATENATE($A$2,DIGITADOR!$B$2,DIGITADOR!$M$1,C273),\"\")","v":""},null,{"$f":"IF(R273=\"\",\"\",INDEX('OTRAS REFERENCIAS'!$L$5:$M$152,MATCH(R273,'OTRAS REFERENCIAS'!$L$5:$L$157,0),2))","v":""},null,{"$f":"IF(T273=\"\",\"\",VLOOKUP(T273,'OTRAS REFERENCIAS'!$A$7:$B$9,2,FALSE))","v":""},null,"",null,null,null,{"$f":"IF(Z273=\"\",\"\",INDEX(REFERENTES!$A:$B,MATCH(Z273,REFERENTES!$B:$B,0),1))","v":""},"",null,null,{"$f":"IF(AD273=\"\",\"\",INDEX(REFERENTES!$D:$E,MATCH(AD273,REFERENTES!$E:$E,0),1))","v":""},{"$f":"IF(AD273=\"\",\"\",INDEX(REFERENTES!$D:$L,MATCH(AD273,REFERENTES!$E:$E,0),6))","v":""}]
[null,null,1,{"$f":"IF(Q274=\"\",\"\",IF(COUNTIF($Q274:Q274, Q274)>1, \"\", Q274))","v":""},null,null,"","","",null,{"$f":"IF(J274=\"\",\"\",INDEX(REFERENTES!$V:$W,MATCH(J274,REFERENTES!$W:$W,0),1))","v":""},"",null,null,270,"",{"$f":"IF(E274<>\"\",CONCATENATE($A$2,DIGITADOR!$B$2,DIGITADOR!$M$1,C274),\"\")","v":""},null,{"$f":"IF(R274=\"\",\"\",INDEX('OTRAS REFERENCIAS'!$L$5:$M$152,MATCH(R274,'OTRAS REFERENCIAS'!$L$5:$L$157,0),2))","v":""},null,{"$f":"IF(T274=\"\",\"\",VLOOKUP(T274,'OTRAS REFERENCIAS'!$A$7:$B$9,2,FALSE))","v":""},null,"",null,null,null,{"$f":"IF(Z274=\"\",\"\",INDEX(REFERENTES!$A:$B,MATCH(Z274,REFERENTES!$B:$B,0),1))","v":""},"",null,null,{"$f":"IF(AD274=\"\",\"\",INDEX(REFERENTES!$D:$E,MATCH(AD274,REFERENTES!$E:$E,0),1))","v":""},{"$f":"IF(AD274=\"\",\"\",INDEX(REFERENTES!$D:$L,MATCH(AD274,REFERENTES!$E:$E,0),6))","v":""}]
[null,null,1,{"$f":"IF(Q275=\"\",\"\",IF(COUNTIF($Q275:Q275, Q275)>1, \"\", Q275))","v":""},null,null,"","","",null,{"$f":"IF(J275=\"\",\"\",INDEX(REFERENTES!$V:$W,MATCH(J275,REFERENTES!$W:$W,0),1))","v":""},"",null,null,271,"",{"$f":"IF(E275<>\"\",CONCATENATE($A$2,DIGITADOR!$B$2,DIGITADOR!$M$1,C275),\"\")","v":""},null,{"$f":"IF(R275=\"\",\"\",INDEX('OTRAS REFERENCIAS'!$L$5:$M$152,MATCH(R275,'OTRAS REFERENCIAS'!$L$5:$L$157,0),2))","v":""},null,{"$f":"IF(T275=\"\",\"\",VLOOKUP(T275,'OTRAS REFERENCIAS'!$A$7:$B$9,2,FALSE))","v":""},null,"",null,null,null,{"$f":"IF(Z275=\"\",\"\",INDEX(REFERENTES!$A:$B,MATCH(Z275,REFERENTES!$B:$B,0),1))","v":""},"",null,null,{"$f":"IF(AD275=\"\",\"\",INDEX(REFERENTES!$D:$E,MATCH(AD275,REFERENTES!$E:$E,0),1))","v":""},{"$f":"IF(AD275=\"\",\"\",INDEX(REFERENTES!$D:$L,MATCH(AD275,REFERENTES!$E:$E,0),6))","v":""}]
[null,null,1,{"$f":"IF(Q276=\"\",\"\",IF(COUNTIF($Q276:Q276, Q276)>1, \"\", Q276))","v":""},null,null,"","","",null,{"$f":"IF(J276=\"\",\"\",INDEX(REFERENTES!$V:$W,MATCH(J276,REFERENTES!$W:$W,0),1))","v":""},"",null,null,272,"",{"$f":"IF(E276<>\"\",CONCATENATE($A$2,DIGITADOR!$B$2,DIGITADOR!$M$1,C276),\"\")","v":""},null,{"$f":"IF(R276=\"\",\"\",INDEX('OTRAS REFERENCIAS'!$L$5:$M$152,MATCH(R276,'OTRAS REFERENCIAS'!$L$5:$L$157,0),2))","v":""},null,{"$f":"IF(T276=\"\",\"\",VLOOKUP(T276,'OTRAS REFERENCIAS'!$A$7:$B$9,2,FALSE))","v":""},null,"",null,null,null,{"$f":"IF(Z276=\"\",\"\",INDEX(REFERENTES!$A:$B,MATCH(Z276,REFERENTES!$B:$B,0),1))","v":""},"",null,null,{"$f":"IF(AD276=\"\",\"\",INDEX(REFERENTES!$D:$E,MATCH(AD276,REFERENTES!$E:$E,0),1))","v":""},{"$f":"IF(AD276=\"\",\"\",INDEX(REFERENTES!$D:$L,MATCH(AD276,REFERENTES!$E:$E,0),6))","v":""}]
[null,null,1,{"$f":"IF(Q277=\"\",\"\",IF(COUNTIF($Q277:Q277, Q277)>1, \"\", Q277))","v":""},null,null,"","","",null,{"$f":"IF(J277=\"\",\"\",INDEX(REFERENTES!$V:$W,MATCH(J277,REFERENTES!$W:$W,0),1))","v":""},"",null,null,273,"",{"$f":"IF(E277<>\"\",CONCATENATE($A$2,DIGITADOR!$B$2,DIGITADOR!$M$1,C277),\"\")","v":""},null,{"$f":"IF(R277=\"\",\"\",INDEX('OTRAS REFERENCIAS'!$L$5:$M$152,MATCH(R277,'OTRAS REFERENCIAS'!$L$5:$L$157,0),2))","v":""},null,{"$f":"IF(T277=\"\",\"\",VLOOKUP(T277,'OTRAS REFERENCIAS'!$A$7:$B$9,2,FALSE))","v":""},null,"",null,null,null,{"$f":"IF(Z277=\"\",\"\",INDEX(REFERENTES!$A:$B,MATCH(Z277,REFERENTES!$B:$B,0),1))","v":""},"",null,null,{"$f":"IF(AD277=\"\",\"\",INDEX(REFERENTES!$D:$E,MATCH(AD277,REFERENTES!$E:$E,0),1))","v":""},{"$f":"IF(AD277=\"\",\"\",INDEX(REFERENTES!$D:$L,MATCH(AD277,REFERENTES!$E:$E,0),6))","v":""}]
[null,null,1,{"$f":"IF(Q278=\"\",\"\",IF(COUNTIF($Q278:Q278, Q278)>1, \"\", Q278))","v":""},null,null,"","","",null,{"$f":"IF(J278=\"\",\"\",INDEX(REFERENTES!$V:$W,MATCH(J278,REFERENTES!$W:$W,0),1))","v":""},"",null,null,274,"",{"$f":"IF(E278<>\"\",CONCATENATE($A$2,DIGITADOR!$B$2,DIGITADOR!$M$1,C278),\"\")","v":""},null,{"$f":"IF(R278=\"\",\"\",INDEX('OTRAS REFERENCIAS'!$L$5:$M$152,MATCH(R278,'OTRAS REFERENCIAS'!$L$5:$L$157,0),2))","v":""},null,{"$f":"IF(T278=\"\",\"\",VLOOKUP(T278,'OTRAS REFERENCIAS'!$A$7:$B$9,2,FALSE))","v":""},null,"",null,null,null,{"$f":"IF(Z278=\"\",\"\",INDEX(REFERENTES!$A:$B,MATCH(Z278,REFERENTES!$B:$B,0),1))","v":""},"",null,null,{"$f":"IF(AD278=\"\",\"\",INDEX(REFERENTES!$D:$E,MATCH(AD278,REFERENTES!$E:$E,0),1))","v":""},{"$f":"IF(AD278=\"\",\"\",INDEX(REFERENTES!$D:$L,MATCH(AD278,REFERENTES!$E:$E,0),6))","v":""}]
[null,null,1,{"$f":"IF(Q279=\"\",\"\",IF(COUNTIF($Q279:Q279, Q279)>1, \"\", Q279))","v":""},null,null,"","","",null,{"$f":"IF(J279=\"\",\"\",INDEX(REFERENTES!$V:$W,MATCH(J279,REFERENTES!$W:$W,0),1))","v":""},"",null,null,275,"",{"$f":"IF(E279<>\"\",CONCATENATE($A$2,DIGITADOR!$B$2,DIGITADOR!$M$1,C279),\"\")","v":""},null,{"$f":"IF(R279=\"\",\"\",INDEX('OTRAS REFERENCIAS'!$L$5:$M$152,MATCH(R279,'OTRAS REFERENCIAS'!$L$5:$L$157,0),2))","v":""},null,{"$f":"IF(T279=\"\",\"\",VLOOKUP(T279,'OTRAS REFERENCIAS'!$A$7:$B$9,2,FALSE))","v":""},null,"",null,null,null,{"$f":"IF(Z279=\"\",\"\",INDEX(REFERENTES!$A:$B,MATCH(Z279,REFERENTES!$B:$B,0),1))","v":""},"",null,null,{"$f":"IF(AD279=\"\",\"\",INDEX(REFERENTES!$D:$E,MATCH(AD279,REFERENTES!$E:$E,0),1))","v":""},{"$f":"IF(AD279=\"\",\"\",INDEX(REFERENTES!$D:$L,MATCH(AD279,REFERENTES!$E:$E,0),6))","v":""}]
[null,null,1,{"$f":"IF(Q280=\"\",\"\",IF(COUNTIF($Q280:Q280, Q280)>1, \"\", Q280))","v":""},null,null,"","","",null,{"$f":"IF(J280=\"\",\"\",INDEX(REFERENTES!$V:$W,MATCH(J280,REFERENTES!$W:$W,0),1))","v":""},"",null,null,276,"",{"$f":"IF(E280<>\"\",CONCATENATE($A$2,DIGITADOR!$B$2,DIGITADOR!$M$1,C280),\"\")","v":""},null,{"$f":"IF(R280=\"\",\"\",INDEX('OTRAS REFERENCIAS'!$L$5:$M$152,MATCH(R280,'OTRAS REFERENCIAS'!$L$5:$L$157,0),2))","v":""},null,{"$f":"IF(T280=\"\",\"\",VLOOKUP(T280,'OTRAS REFERENCIAS'!$A$7:$B$9,2,FALSE))","v":""},null,"",null,null,null,{"$f":"IF(Z280=\"\",\"\",INDEX(REFERENTES!$A:$B,MATCH(Z280,REFERENTES!$B:$B,0),1))","v":""},"",null,null,{"$f":"IF(AD280=\"\",\"\",INDEX(REFERENTES!$D:$E,MATCH(AD280,REFERENTES!$E:$E,0),1))","v":""},{"$f":"IF(AD280=\"\",\"\",INDEX(REFERENTES!$D:$L,MATCH(AD280,REFERENTES!$E:$E,0),6))","v":""}]
[null,null,1,{"$f":"IF(Q281=\"\",\"\",IF(COUNTIF($Q281:Q281, Q281)>1, \"\", Q281))","v":""},null,null,"","","",null,{"$f":"IF(J281=\"\",\"\",INDEX(REFERENTES!$V:$W,MATCH(J281,REFERENTES!$W:$W,0),1))","v":""},"",null,null,277,"",{"$f":"IF(E281<>\"\",CONCATENATE($A$2,DIGITADOR!$B$2,DIGITADOR!$M$1,C281),\"\")","v":""},null,{"$f":"IF(R281=\"\",\"\",INDEX('OTRAS REFERENCIAS'!$L$5:$M$152,MATCH(R281,'OTRAS REFERENCIAS'!$L$5:$L$157,0),2))","v":""},null,{"$f":"IF(T281=\"\",\"\",VLOOKUP(T281,'OTRAS REFERENCIAS'!$A$7:$B$9,2,FALSE))","v":""},null,"",null,null,null,{"$f":"IF(Z281=\"\",\"\",INDEX(REFERENTES!$A:$B,MATCH(Z281,REFERENTES!$B:$B,0),1))","v":""},"",null,null,{"$f":"IF(AD281=\"\",\"\",INDEX(REFERENTES!$D:$E,MATCH(AD281,REFERENTES!$E:$E,0),1))","v":""},{"$f":"IF(AD281=\"\",\"\",INDEX(REFERENTES!$D:$L,MATCH(AD281,REFERENTES!$E:$E,0),6))","v":""}]
[null,null,1,{"$f":"IF(Q282=\"\",\"\",IF(COUNTIF($Q282:Q282, Q282)>1, \"\", Q282))","v":""},null,null,"","","",null,{"$f":"IF(J282=\"\",\"\",INDEX(REFERENTES!$V:$W,MATCH(J282,REFERENTES!$W:$W,0),1))","v":""},"",null,null,278,"",{"$f":"IF(E282<>\"\",CONCATENATE($A$2,DIGITADOR!$B$2,DIGITADOR!$M$1,C282),\"\")","v":""},null,{"$f":"IF(R282=\"\",\"\",INDEX('OTRAS REFERENCIAS'!$L$5:$M$152,MATCH(R282,'OTRAS REFERENCIAS'!$L$5:$L$157,0),2))","v":""},null,{"$f":"IF(T282=\"\",\"\",VLOOKUP(T282,'OTRAS REFERENCIAS'!$A$7:$B$9,2,FALSE))","v":""},null,"",null,null,null,{"$f":"IF(Z282=\"\",\"\",INDEX(REFERENTES!$A:$B,MATCH(Z282,REFERENTES!$B:$B,0),1))","v":""},"",null,null,{"$f":"IF(AD282=\"\",\"\",INDEX(REFERENTES!$D:$E,MATCH(AD282,REFERENTES!$E:$E,0),1))","v":""},{"$f":"IF(AD282=\"\",\"\",INDEX(REFERENTES!$D:$L,MATCH(AD282,REFERENTES!$E:$E,0),6))","v":""}]
[null,null,1,{"$f":"IF(Q283=\"\",\"\",IF(COUNTIF($Q283:Q283, Q283)>1, \"\", Q283))","v":""},null,null,"","","",null,{"$f":"IF(J283=\"\",\"\",INDEX(REFERENTES!$V:$W,MATCH(J283,REFERENTES!$W:$W,0),1))","v":""},"",null,null,279,"",{"$f":"IF(E283<>\"\",CONCATENATE($A$2,DIGITADOR!$B$2,DIGITADOR!$M$1,C283),\"\")","v":""},null,{"$f":"IF(R283=\"\",\"\",INDEX('OTRAS REFERENCIAS'!$L$5:$M$152,MATCH(R283,'OTRAS REFERENCIAS'!$L$5:$L$157,0),2))","v":""},null,{"$f":"IF(T283=\"\",\"\",VLOOKUP(T283,'OTRAS REFERENCIAS'!$A$7:$B$9,2,FALSE))","v":""},null,"",null,null,null,{"$f":"IF(Z283=\"\",\"\",INDEX(REFERENTES!$A:$B,MATCH(Z283,REFERENTES!$B:$B,0),1))","v":""},"",null,null,{"$f":"IF(AD283=\"\",\"\",INDEX(REFERENTES!$D:$E,MATCH(AD283,REFERENTES!$E:$E,0),1))","v":""},{"$f":"IF(AD283=\"\",\"\",INDEX(REFERENTES!$D:$L,MATCH(AD283,REFERENTES!$E:$E,0),6))","v":""}]
[null,null,1,{"$f":"IF(Q284=\"\",\"\",IF(COUNTIF($Q284:Q284, Q284)>1, \"\", Q284))","v":""},null,null,"","","",null,{"$f":"IF(J284=\"\",\"\",INDEX(REFERENTES!$V:$W,MATCH(J284,REFERENTES!$W:$W,0),1))","v":""},"",null,null,280,"",{"$f":"IF(E284<>\"\",CONCATENATE($A$2,DIGITADOR!$B$2,DIGITADOR!$M$1,C284),\"\")","v":""},null,{"$f":"IF(R284=\"\",\"\",INDEX('OTRAS REFERENCIAS'!$L$5:$M$152,MATCH(R284,'OTRAS REFERENCIAS'!$L$5:$L$157,0),2))","v":""},null,{"$f":"IF(T284=\"\",\"\",VLOOKUP(T284,'OTRAS REFERENCIAS'!$A$7:$B$9,2,FALSE))","v":""},null,"",null,null,null,{"$f":"IF(Z284=\"\",\"\",INDEX(REFERENTES!$A:$B,MATCH(Z284,REFERENTES!$B:$B,0),1))","v":""},"",null,null,{"$f":"IF(AD284=\"\",\"\",INDEX(REFERENTES!$D:$E,MATCH(AD284,REFERENTES!$E:$E,0),1))","v":""},{"$f":"IF(AD284=\"\",\"\",INDEX(REFERENTES!$D:$L,MATCH(AD284,REFERENTES!$E:$E,0),6))","v":""}]
[null,null,1,{"$f":"IF(Q285=\"\",\"\",IF(COUNTIF($Q285:Q285, Q285)>1, \"\", Q285))","v":""},null,null,"","","",null,{"$f":"IF(J285=\"\",\"\",INDEX(REFERENTES!$V:$W,MATCH(J285,REFERENTES!$W:$W,0),1))","v":""},"",null,null,281,"",{"$f":"IF(E285<>\"\",CONCATENATE($A$2,DIGITADOR!$B$2,DIGITADOR!$M$1,C285),\"\")","v":""},null,{"$f":"IF(R285=\"\",\"\",INDEX('OTRAS REFERENCIAS'!$L$5:$M$152,MATCH(R285,'OTRAS REFERENCIAS'!$L$5:$L$157,0),2))","v":""},null,{"$f":"IF(T285=\"\",\"\",VLOOKUP(T285,'OTRAS REFERENCIAS'!$A$7:$B$9,2,FALSE))","v":""},null,"",null,null,null,{"$f":"IF(Z285=\"\",\"\",INDEX(REFERENTES!$A:$B,MATCH(Z285,REFERENTES!$B:$B,0),1))","v":""},"",null,null,{"$f":"IF(AD285=\"\",\"\",INDEX(REFERENTES!$D:$E,MATCH(AD285,REFERENTES!$E:$E,0),1))","v":""},{"$f":"IF(AD285=\"\",\"\",INDEX(REFERENTES!$D:$L,MATCH(AD285,REFERENTES!$E:$E,0),6))","v":""}]
[null,null,1,{"$f":"IF(Q286=\"\",\"\",IF(COUNTIF($Q286:Q286, Q286)>1, \"\", Q286))","v":""},null,null,"","","",null,{"$f":"IF(J286=\"\",\"\",INDEX(REFERENTES!$V:$W,MATCH(J286,REFERENTES!$W:$W,0),1))","v":""},"",null,null,282,"",{"$f":"IF(E286<>\"\",CONCATENATE($A$2,DIGITADOR!$B$2,DIGITADOR!$M$1,C286),\"\")","v":""},null,{"$f":"IF(R286=\"\",\"\",INDEX('OTRAS REFERENCIAS'!$L$5:$M$152,MATCH(R286,'OTRAS REFERENCIAS'!$L$5:$L$157,0),2))","v":""},null,{"$f":"IF(T286=\"\",\"\",VLOOKUP(T286,'OTRAS REFERENCIAS'!$A$7:$B$9,2,FALSE))","v":""},null,"",null,null,null,{"$f":"IF(Z286=\"\",\"\",INDEX(REFERENTES!$A:$B,MATCH(Z286,REFERENTES!$B:$B,0),1))","v":""},"",null,null,{"$f":"IF(AD286=\"\",\"\",INDEX(REFERENTES!$D:$E,MATCH(AD286,REFERENTES!$E:$E,0),1))","v":""},{"$f":"IF(AD286=\"\",\"\",INDEX(REFERENTES!$D:$L,MATCH(AD286,REFERENTES!$E:$E,0),6))","v":""}]
[null,null,1,{"$f":"IF(Q287=\"\",\"\",IF(COUNTIF($Q287:Q287, Q287)>1, \"\", Q287))","v":""},null,null,"","","",null,{"$f":"IF(J287=\"\",\"\",INDEX(REFERENTES!$V:$W,MATCH(J287,REFERENTES!$W:$W,0),1))","v":""},"",null,null,283,"",{"$f":"IF(E287<>\"\",CONCATENATE($A$2,DIGITADOR!$B$2,DIGITADOR!$M$1,C287),\"\")","v":""},null,{"$f":"IF(R287=\"\",\"\",INDEX('OTRAS REFERENCIAS'!$L$5:$M$152,MATCH(R287,'OTRAS REFERENCIAS'!$L$5:$L$157,0),2))","v":""},null,{"$f":"IF(T287=\"\",\"\",VLOOKUP(T287,'OTRAS REFERENCIAS'!$A$7:$B$9,2,FALSE))","v":""},null,"",null,null,null,{"$f":"IF(Z287=\"\",\"\",INDEX(REFERENTES!$A:$B,MATCH(Z287,REFERENTES!$B:$B,0),1))","v":""},"",null,null,{"$f":"IF(AD287=\"\",\"\",INDEX(REFERENTES!$D:$E,MATCH(AD287,REFERENTES!$E:$E,0),1))","v":""},{"$f":"IF(AD287=\"\",\"\",INDEX(REFERENTES!$D:$L,MATCH(AD287,REFERENTES!$E:$E,0),6))","v":""}]
[null,null,1,{"$f":"IF(Q288=\"\",\"\",IF(COUNTIF($Q288:Q288, Q288)>1, \"\", Q288))","v":""},null,null,"","","",null,{"$f":"IF(J288=\"\",\"\",INDEX(REFERENTES!$V:$W,MATCH(J288,REFERENTES!$W:$W,0),1))","v":""},"",null,null,284,"",{"$f":"IF(E288<>\"\",CONCATENATE($A$2,DIGITADOR!$B$2,DIGITADOR!$M$1,C288),\"\")","v":""},null,{"$f":"IF(R288=\"\",\"\",INDEX('OTRAS REFERENCIAS'!$L$5:$M$152,MATCH(R288,'OTRAS REFERENCIAS'!$L$5:$L$157,0),2))","v":""},null,{"$f":"IF(T288=\"\",\"\",VLOOKUP(T288,'OTRAS REFERENCIAS'!$A$7:$B$9,2,FALSE))","v":""},null,"",null,null,null,{"$f":"IF(Z288=\"\",\"\",INDEX(REFERENTES!$A:$B,MATCH(Z288,REFERENTES!$B:$B,0),1))","v":""},"",null,null,{"$f":"IF(AD288=\"\",\"\",INDEX(REFERENTES!$D:$E,MATCH(AD288,REFERENTES!$E:$E,0),1))","v":""},{"$f":"IF(AD288=\"\",\"\",INDEX(REFERENTES!$D:$L,MATCH(AD288,REFERENTES!$E:$E,0),6))","v":""}]
[null,null,1,{"$f":"IF(Q289=\"\",\"\",IF(COUNTIF($Q289:Q289, Q289)>1, \"\", Q289))","v":""},null,null,"","","",null,{"$f":"IF(J289=\"\",\"\",INDEX(REFERENTES!$V:$W,MATCH(J289,REFERENTES!$W:$W,0),1))","v":""},"",null,null,285,"",{"$f":"IF(E289<>\"\",CONCATENATE($A$2,DIGITADOR!$B$2,DIGITADOR!$M$1,C289),\"\")","v":""},null,{"$f":"IF(R289=\"\",\"\",INDEX('OTRAS REFERENCIAS'!$L$5:$M$152,MATCH(R289,'OTRAS REFERENCIAS'!$L$5:$L$157,0),2))","v":""},null,{"$f":"IF(T289=\"\",\"\",VLOOKUP(T289,'OTRAS REFERENCIAS'!$A$7:$B$9,2,FALSE))","v":""},null,"",null,null,null,{"$f":"IF(Z289=\"\",\"\",INDEX(REFERENTES!$A:$B,MATCH(Z289,REFERENTES!$B:$B,0),1))","v":""},"",null,null,{"$f":"IF(AD289=\"\",\"\",INDEX(REFERENTES!$D:$E,MATCH(AD289,REFERENTES!$E:$E,0),1))","v":""},{"$f":"IF(AD289=\"\",\"\",INDEX(REFERENTES!$D:$L,MATCH(AD289,REFERENTES!$E:$E,0),6))","v":""}]
[null,null,1,{"$f":"IF(Q290=\"\",\"\",IF(COUNTIF($Q290:Q290, Q290)>1, \"\", Q290))","v":""},null,null,"","","",null,{"$f":"IF(J290=\"\",\"\",INDEX(REFERENTES!$V:$W,MATCH(J290,REFERENTES!$W:$W,0),1))","v":""},"",null,null,286,"",{"$f":"IF(E290<>\"\",CONCATENATE($A$2,DIGITADOR!$B$2,DIGITADOR!$M$1,C290),\"\")","v":""},null,{"$f":"IF(R290=\"\",\"\",INDEX('OTRAS REFERENCIAS'!$L$5:$M$152,MATCH(R290,'OTRAS REFERENCIAS'!$L$5:$L$157,0),2))","v":""},null,{"$f":"IF(T290=\"\",\"\",VLOOKUP(T290,'OTRAS REFERENCIAS'!$A$7:$B$9,2,FALSE))","v":""},null,"",null,null,null,{"$f":"IF(Z290=\"\",\"\",INDEX(REFERENTES!$A:$B,MATCH(Z290,REFERENTES!$B:$B,0),1))","v":""},"",null,null,{"$f":"IF(AD290=\"\",\"\",INDEX(REFERENTES!$D:$E,MATCH(AD290,REFERENTES!$E:$E,0),1))","v":""},{"$f":"IF(AD290=\"\",\"\",INDEX(REFERENTES!$D:$L,MATCH(AD290,REFERENTES!$E:$E,0),6))","v":""}]
[null,null,1,{"$f":"IF(Q291=\"\",\"\",IF(COUNTIF($Q291:Q291, Q291)>1, \"\", Q291))","v":""},null,null,"","","",null,{"$f":"IF(J291=\"\",\"\",INDEX(REFERENTES!$V:$W,MATCH(J291,REFERENTES!$W:$W,0),1))","v":""},"",null,null,287,"",{"$f":"IF(E291<>\"\",CONCATENATE($A$2,DIGITADOR!$B$2,DIGITADOR!$M$1,C291),\"\")","v":""},null,{"$f":"IF(R291=\"\",\"\",INDEX('OTRAS REFERENCIAS'!$L$5:$M$152,MATCH(R291,'OTRAS REFERENCIAS'!$L$5:$L$157,0),2))","v":""},null,{"$f":"IF(T291=\"\",\"\",VLOOKUP(T291,'OTRAS REFERENCIAS'!$A$7:$B$9,2,FALSE))","v":""},null,"",null,null,null,{"$f":"IF(Z291=\"\",\"\",INDEX(REFERENTES!$A:$B,MATCH(Z291,REFERENTES!$B:$B,0),1))","v":""},"",null,null,{"$f":"IF(AD291=\"\",\"\",INDEX(REFERENTES!$D:$E,MATCH(AD291,REFERENTES!$E:$E,0),1))","v":""},{"$f":"IF(AD291=\"\",\"\",INDEX(REFERENTES!$D:$L,MATCH(AD291,REFERENTES!$E:$E,0),6))","v":""}]
[null,null,1,{"$f":"IF(Q292=\"\",\"\",IF(COUNTIF($Q292:Q292, Q292)>1, \"\", Q292))","v":""},null,null,"","","",null,{"$f":"IF(J292=\"\",\"\",INDEX(REFERENTES!$V:$W,MATCH(J292,REFERENTES!$W:$W,0),1))","v":""},"",null,null,288,"",{"$f":"IF(E292<>\"\",CONCATENATE($A$2,DIGITADOR!$B$2,DIGITADOR!$M$1,C292),\"\")","v":""},null,{"$f":"IF(R292=\"\",\"\",INDEX('OTRAS REFERENCIAS'!$L$5:$M$152,MATCH(R292,'OTRAS REFERENCIAS'!$L$5:$L$157,0),2))","v":""},null,{"$f":"IF(T292=\"\",\"\",VLOOKUP(T292,'OTRAS REFERENCIAS'!$A$7:$B$9,2,FALSE))","v":""},null,"",null,null,null,{"$f":"IF(Z292=\"\",\"\",INDEX(REFERENTES!$A:$B,MATCH(Z292,REFERENTES!$B:$B,0),1))","v":""},"",null,null,{"$f":"IF(AD292=\"\",\"\",INDEX(REFERENTES!$D:$E,MATCH(AD292,REFERENTES!$E:$E,0),1))","v":""},{"$f":"IF(AD292=\"\",\"\",INDEX(REFERENTES!$D:$L,MATCH(AD292,REFERENTES!$E:$E,0),6))","v":""}]
[null,null,1,{"$f":"IF(Q293=\"\",\"\",IF(COUNTIF($Q293:Q293, Q293)>1, \"\", Q293))","v":""},null,null,"","","",null,{"$f":"IF(J293=\"\",\"\",INDEX(REFERENTES!$V:$W,MATCH(J293,REFERENTES!$W:$W,0),1))","v":""},"",null,null,289,"",{"$f":"IF(E293<>\"\",CONCATENATE($A$2,DIGITADOR!$B$2,DIGITADOR!$M$1,C293),\"\")","v":""},null,{"$f":"IF(R293=\"\",\"\",INDEX('OTRAS REFERENCIAS'!$L$5:$M$152,MATCH(R293,'OTRAS REFERENCIAS'!$L$5:$L$157,0),2))","v":""},null,{"$f":"IF(T293=\"\",\"\",VLOOKUP(T293,'OTRAS REFERENCIAS'!$A$7:$B$9,2,FALSE))","v":""},null,"",null,null,null,{"$f":"IF(Z293=\"\",\"\",INDEX(REFERENTES!$A:$B,MATCH(Z293,REFERENTES!$B:$B,0),1))","v":""},"",null,null,{"$f":"IF(AD293=\"\",\"\",INDEX(REFERENTES!$D:$E,MATCH(AD293,REFERENTES!$E:$E,0),1))","v":""},{"$f":"IF(AD293=\"\",\"\",INDEX(REFERENTES!$D:$L,MATCH(AD293,REFERENTES!$E:$E,0),6))","v":""}]
[null,null,1,{"$f":"IF(Q294=\"\",\"\",IF(COUNTIF($Q294:Q294, Q294)>1, \"\", Q294))","v":""},null,null,"","","",null,{"$f":"IF(J294=\"\",\"\",INDEX(REFERENTES!$V:$W,MATCH(J294,REFERENTES!$W:$W,0),1))","v":""},"",null,null,290,"",{"$f":"IF(E294<>\"\",CONCATENATE($A$2,DIGITADOR!$B$2,DIGITADOR!$M$1,C294),\"\")","v":""},null,{"$f":"IF(R294=\"\",\"\",INDEX('OTRAS REFERENCIAS'!$L$5:$M$152,MATCH(R294,'OTRAS REFERENCIAS'!$L$5:$L$157,0),2))","v":""},null,{"$f":"IF(T294=\"\",\"\",VLOOKUP(T294,'OTRAS REFERENCIAS'!$A$7:$B$9,2,FALSE))","v":""},null,"",null,null,null,{"$f":"IF(Z294=\"\",\"\",INDEX(REFERENTES!$A:$B,MATCH(Z294,REFERENTES!$B:$B,0),1))","v":""},"",null,null,{"$f":"IF(AD294=\"\",\"\",INDEX(REFERENTES!$D:$E,MATCH(AD294,REFERENTES!$E:$E,0),1))","v":""},{"$f":"IF(AD294=\"\",\"\",INDEX(REFERENTES!$D:$L,MATCH(AD294,REFERENTES!$E:$E,0),6))","v":""}]
[null,null,1,{"$f":"IF(Q295=\"\",\"\",IF(COUNTIF($Q295:Q295, Q295)>1, \"\", Q295))","v":""},null,null,"","","",null,{"$f":"IF(J295=\"\",\"\",INDEX(REFERENTES!$V:$W,MATCH(J295,REFERENTES!$W:$W,0),1))","v":""},"",null,null,291,"",{"$f":"IF(E295<>\"\",CONCATENATE($A$2,DIGITADOR!$B$2,DIGITADOR!$M$1,C295),\"\")","v":""},null,{"$f":"IF(R295=\"\",\"\",INDEX('OTRAS REFERENCIAS'!$L$5:$M$152,MATCH(R295,'OTRAS REFERENCIAS'!$L$5:$L$157,0),2))","v":""},null,{"$f":"IF(T295=\"\",\"\",VLOOKUP(T295,'OTRAS REFERENCIAS'!$A$7:$B$9,2,FALSE))","v":""},null,"",null,null,null,{"$f":"IF(Z295=\"\",\"\",INDEX(REFERENTES!$A:$B,MATCH(Z295,REFERENTES!$B:$B,0),1))","v":""},"",null,null,{"$f":"IF(AD295=\"\",\"\",INDEX(REFERENTES!$D:$E,MATCH(AD295,REFERENTES!$E:$E,0),1))","v":""},{"$f":"IF(AD295=\"\",\"\",INDEX(REFERENTES!$D:$L,MATCH(AD295,REFERENTES!$E:$E,0),6))","v":""}]
[null,null,1,{"$f":"IF(Q296=\"\",\"\",IF(COUNTIF($Q296:Q296, Q296)>1, \"\", Q296))","v":""},null,null,"","","",null,{"$f":"IF(J296=\"\",\"\",INDEX(REFERENTES!$V:$W,MATCH(J296,REFERENTES!$W:$W,0),1))","v":""},"",null,null,292,"",{"$f":"IF(E296<>\"\",CONCATENATE($A$2,DIGITADOR!$B$2,DIGITADOR!$M$1,C296),\"\")","v":""},null,{"$f":"IF(R296=\"\",\"\",INDEX('OTRAS REFERENCIAS'!$L$5:$M$152,MATCH(R296,'OTRAS REFERENCIAS'!$L$5:$L$157,0),2))","v":""},null,{"$f":"IF(T296=\"\",\"\",VLOOKUP(T296,'OTRAS REFERENCIAS'!$A$7:$B$9,2,FALSE))","v":""},null,"",null,null,null,{"$f":"IF(Z296=\"\",\"\",INDEX(REFERENTES!$A:$B,MATCH(Z296,REFERENTES!$B:$B,0),1))","v":""},"",null,null,{"$f":"IF(AD296=\"\",\"\",INDEX(REFERENTES!$D:$E,MATCH(AD296,REFERENTES!$E:$E,0),1))","v":""},{"$f":"IF(AD296=\"\",\"\",INDEX(REFERENTES!$D:$L,MATCH(AD296,REFERENTES!$E:$E,0),6))","v":""}]
[null,null,1,{"$f":"IF(Q297=\"\",\"\",IF(COUNTIF($Q297:Q297, Q297)>1, \"\", Q297))","v":""},null,null,"",{"$f":"IF(G297<>\"\",MONTH(G297),\"\")","v":""},"",null,{"$f":"IF(J297=\"\",\"\",INDEX(REFERENTES!$V:$W,MATCH(J297,REFERENTES!$W:$W,0),1))","v":""},"",null,null,293,"",{"$f":"IF(E297<>\"\",CONCATENATE($A$2,DIGITADOR!$B$2,DIGITADOR!$M$1,C297),\"\")","v":""},null,{"$f":"IF(R297=\"\",\"\",INDEX('OTRAS REFERENCIAS'!$L$5:$M$152,MATCH(R297,'OTRAS REFERENCIAS'!$L$5:$L$157,0),2))","v":""},null,{"$f":"IF(T297=\"\",\"\",VLOOKUP(T297,'OTRAS REFERENCIAS'!$A$7:$B$9,2,FALSE))","v":""},null,"",null,null,null,{"$f":"IF(Z297=\"\",\"\",INDEX(REFERENTES!$A:$B,MATCH(Z297,REFERENTES!$B:$B,0),1))","v":""},"",null,null,{"$f":"IF(AD297=\"\",\"\",INDEX(REFERENTES!$D:$E,MATCH(AD297,REFERENTES!$E:$E,0),1))","v":""},{"$f":"IF(AD297=\"\",\"\",INDEX(REFERENTES!$D:$L,MATCH(AD297,REFERENTES!$E:$E,0),6))","v":""}]
[null,null,1,{"$f":"IF(Q298=\"\",\"\",IF(COUNTIF($Q298:Q298, Q298)>1, \"\", Q298))","v":""},null,null,"","","",null,{"$f":"IF(J298=\"\",\"\",INDEX(REFERENTES!$V:$W,MATCH(J298,REFERENTES!$W:$W,0),1))","v":""},"",null,null,294,"",{"$f":"IF(E298<>\"\",CONCATENATE($A$2,DIGITADOR!$B$2,DIGITADOR!$M$1,C298),\"\")","v":""},null,{"$f":"IF(R298=\"\",\"\",INDEX('OTRAS REFERENCIAS'!$L$5:$M$152,MATCH(R298,'OTRAS REFERENCIAS'!$L$5:$L$157,0),2))","v":""},null,{"$f":"IF(T298=\"\",\"\",VLOOKUP(T298,'OTRAS REFERENCIAS'!$A$7:$B$9,2,FALSE))","v":""},null,"",null,null,null,{"$f":"IF(Z298=\"\",\"\",INDEX(REFERENTES!$A:$B,MATCH(Z298,REFERENTES!$B:$B,0),1))","v":""},"",null,null,{"$f":"IF(AD298=\"\",\"\",INDEX(REFERENTES!$D:$E,MATCH(AD298,REFERENTES!$E:$E,0),1))","v":""},{"$f":"IF(AD298=\"\",\"\",INDEX(REFERENTES!$D:$L,MATCH(AD298,REFERENTES!$E:$E,0),6))","v":""}]
[null,null,1,{"$f":"IF(Q299=\"\",\"\",IF(COUNTIF($Q299:Q299, Q299)>1, \"\", Q299))","v":""},null,null,"","","",null,{"$f":"IF(J299=\"\",\"\",INDEX(REFERENTES!$V:$W,MATCH(J299,REFERENTES!$W:$W,0),1))","v":""},"",null,null,295,"",{"$f":"IF(E299<>\"\",CONCATENATE($A$2,DIGITADOR!$B$2,DIGITADOR!$M$1,C299),\"\")","v":""},null,{"$f":"IF(R299=\"\",\"\",INDEX('OTRAS REFERENCIAS'!$L$5:$M$152,MATCH(R299,'OTRAS REFERENCIAS'!$L$5:$L$157,0),2))","v":""},null,{"$f":"IF(T299=\"\",\"\",VLOOKUP(T299,'OTRAS REFERENCIAS'!$A$7:$B$9,2,FALSE))","v":""},null,"",null,null,null,{"$f":"IF(Z299=\"\",\"\",INDEX(REFERENTES!$A:$B,MATCH(Z299,REFERENTES!$B:$B,0),1))","v":""},"",null,null,{"$f":"IF(AD299=\"\",\"\",INDEX(REFERENTES!$D:$E,MATCH(AD299,REFERENTES!$E:$E,0),1))","v":""},{"$f":"IF(AD299=\"\",\"\",INDEX(REFERENTES!$D:$L,MATCH(AD299,REFERENTES!$E:$E,0),6))","v":""}]
[null,null,1,{"$f":"IF(Q300=\"\",\"\",IF(COUNTIF($Q300:Q300, Q300)>1, \"\", Q300))","v":""},null,null,"","","",null,{"$f":"IF(J300=\"\",\"\",INDEX(REFERENTES!$V:$W,MATCH(J300,REFERENTES!$W:$W,0),1))","v":""},"",null,null,296,"",{"$f":"IF(E300<>\"\",CONCATENATE($A$2,DIGITADOR!$B$2,DIGITADOR!$M$1,C300),\"\")","v":""},null,{"$f":"IF(R300=\"\",\"\",INDEX('OTRAS REFERENCIAS'!$L$5:$M$152,MATCH(R300,'OTRAS REFERENCIAS'!$L$5:$L$157,0),2))","v":""},null,{"$f":"IF(T300=\"\",\"\",VLOOKUP(T300,'OTRAS REFERENCIAS'!$A$7:$B$9,2,FALSE))","v":""},null,"",null,null,null,{"$f":"IF(Z300=\"\",\"\",INDEX(REFERENTES!$A:$B,MATCH(Z300,REFERENTES!$B:$B,0),1))","v":""},"",null,null,{"$f":"IF(AD300=\"\",\"\",INDEX(REFERENTES!$D:$E,MATCH(AD300,REFERENTES!$E:$E,0),1))","v":""},{"$f":"IF(AD300=\"\",\"\",INDEX(REFERENTES!$D:$L,MATCH(AD300,REFERENTES!$E:$E,0),6))","v":""}]
[null,null,1,{"$f":"IF(Q301=\"\",\"\",IF(COUNTIF($Q301:Q301, Q301)>1, \"\", Q301))","v":""},null,null,"","","",null,{"$f":"IF(J301=\"\",\"\",INDEX(REFERENTES!$V:$W,MATCH(J301,REFERENTES!$W:$W,0),1))","v":""},"",null,null,297,"",{"$f":"IF(E301<>\"\",CONCATENATE($A$2,DIGITADOR!$B$2,DIGITADOR!$M$1,C301),\"\")","v":""},null,{"$f":"IF(R301=\"\",\"\",INDEX('OTRAS REFERENCIAS'!$L$5:$M$152,MATCH(R301,'OTRAS REFERENCIAS'!$L$5:$L$157,0),2))","v":""},null,{"$f":"IF(T301=\"\",\"\",VLOOKUP(T301,'OTRAS REFERENCIAS'!$A$7:$B$9,2,FALSE))","v":""},null,"",null,null,null,{"$f":"IF(Z301=\"\",\"\",INDEX(REFERENTES!$A:$B,MATCH(Z301,REFERENTES!$B:$B,0),1))","v":""},"",null,null,{"$f":"IF(AD301=\"\",\"\",INDEX(REFERENTES!$D:$E,MATCH(AD301,REFERENTES!$E:$E,0),1))","v":""},{"$f":"IF(AD301=\"\",\"\",INDEX(REFERENTES!$D:$L,MATCH(AD301,REFERENTES!$E:$E,0),6))","v":""}]
[null,null,1,{"$f":"IF(Q302=\"\",\"\",IF(COUNTIF($Q302:Q302, Q302)>1, \"\", Q302))","v":""},null,null,"","","",null,{"$f":"IF(J302=\"\",\"\",INDEX(REFERENTES!$V:$W,MATCH(J302,REFERENTES!$W:$W,0),1))","v":""},"",null,null,298,"",{"$f":"IF(E302<>\"\",CONCATENATE($A$2,DIGITADOR!$B$2,DIGITADOR!$M$1,C302),\"\")","v":""},null,{"$f":"IF(R302=\"\",\"\",INDEX('OTRAS REFERENCIAS'!$L$5:$M$152,MATCH(R302,'OTRAS REFERENCIAS'!$L$5:$L$157,0),2))","v":""},null,{"$f":"IF(T302=\"\",\"\",VLOOKUP(T302,'OTRAS REFERENCIAS'!$A$7:$B$9,2,FALSE))","v":""},null,"",null,null,null,{"$f":"IF(Z302=\"\",\"\",INDEX(REFERENTES!$A:$B,MATCH(Z302,REFERENTES!$B:$B,0),1))","v":""},"",null,null,{"$f":"IF(AD302=\"\",\"\",INDEX(REFERENTES!$D:$E,MATCH(AD302,REFERENTES!$E:$E,0),1))","v":""},{"$f":"IF(AD302=\"\",\"\",INDEX(REFERENTES!$D:$L,MATCH(AD302,REFERENTES!$E:$E,0),6))","v":""}]
[null,null,1,{"$f":"IF(Q303=\"\",\"\",IF(COUNTIF($Q303:Q303, Q303)>1, \"\", Q303))","v":""},null,null,"","","",null,{"$f":"IF(J303=\"\",\"\",INDEX(REFERENTES!$V:$W,MATCH(J303,REFERENTES!$W:$W,0),1))","v":""},"",null,null,299,"",{"$f":"IF(E303<>\"\",CONCATENATE($A$2,DIGITADOR!$B$2,DIGITADOR!$M$1,C303),\"\")","v":""},null,{"$f":"IF(R303=\"\",\"\",INDEX('OTRAS REFERENCIAS'!$L$5:$M$152,MATCH(R303,'OTRAS REFERENCIAS'!$L$5:$L$157,0),2))","v":""},null,{"$f":"IF(T303=\"\",\"\",VLOOKUP(T303,'OTRAS REFERENCIAS'!$A$7:$B$9,2,FALSE))","v":""},null,"",null,null,null,{"$f":"IF(Z303=\"\",\"\",INDEX(REFERENTES!$A:$B,MATCH(Z303,REFERENTES!$B:$B,0),1))","v":""},"",null,null,{"$f":"IF(AD303=\"\",\"\",INDEX(REFERENTES!$D:$E,MATCH(AD303,REFERENTES!$E:$E,0),1))","v":""},{"$f":"IF(AD303=\"\",\"\",INDEX(REFERENTES!$D:$L,MATCH(AD303,REFERENTES!$E:$E,0),6))","v":""}]
[null,null,1,{"$f":"IF(Q304=\"\",\"\",IF(COUNTIF($Q304:Q304, Q304)>1, \"\", Q304))","v":""},null,null,"","","",null,{"$f":"IF(J304=\"\",\"\",INDEX(REFERENTES!$V:$W,MATCH(J304,REFERENTES!$W:$W,0),1))","v":""},"",null,null,300,"",{"$f":"IF(E304<>\"\",CONCATENATE($A$2,DIGITADOR!$B$2,DIGITADOR!$M$1,C304),\"\")","v":""},null,{"$f":"IF(R304=\"\",\"\",INDEX('OTRAS REFERENCIAS'!$L$5:$M$152,MATCH(R304,'OTRAS REFERENCIAS'!$L$5:$L$157,0),2))","v":""},null,{"$f":"IF(T304=\"\",\"\",VLOOKUP(T304,'OTRAS REFERENCIAS'!$A$7:$B$9,2,FALSE))","v":""},null,"",null,null,null,{"$f":"IF(Z304=\"\",\"\",INDEX(REFERENTES!$A:$B,MATCH(Z304,REFERENTES!$B:$B,0),1))","v":""},"",null,null,null,{"$f":"IF(AD304=\"\",\"\",INDEX(REFERENTES!$D:$L,MATCH(AD304,REFERENTES!$E:$E,0),6))","v":""}]

{"sheet":"REFERENTES","index":4,"n_rows":148,"n_cols":23,"rows_kept":148,"cut":false,"hidden":false,"merged":[]}
["AG_LOV",1037,null,"AG_ESPECIES",148028]
["Rod","ROD",null,"Briareum asbestinum","Basb",null,null,"Briareum asbestinum","8.55.60","CNIDARIA","CORALINA","CORALINA",null,null,null,14295,"PLA",2,"A unos 150m de la costa en marea baja","Playa Blanca 2",null,3907,"Ameth  Vargas Campo"]
["Feather","FEAT",null,"Briareum sp.","Bria",null,null,"Briareum sp.","8.46.50","CNIDARIA","Fundacion Malpelo","F. Malpelo",null,null,null,14296,"CHO",1,"ubicada a 6º","La Chola 1",null,593,"Andrea Polanco"]
["Fan","FAN",null,"Carijoa riisei","Crii",null,null,"Carijoa riisei","8.55.40","CNIDARIA","Instituto de Investigaciones Marinas y Costeras","INVEMAR",null,null,null,14297,"CHE",1,"Compartida con CARICOMP.La parcela del nivel somero (3-5 m) presenta una cobertura coralina _x000D_\r\r\naproximada del 29% dada principalmente por Montastraea faveolata y esqueletos de _x000D_\r\r\nAcropora palmata (algunas colonias vivas). _x000D_\r\r\nLas parcelas media (9-10 m) y profunda (15-16) tienen coberturas de 22% y 21%_x000D_\r\r\n respectivamente y están dominadas por una franja amplia de pendiente suave conformada por _x000D_\r\r\n corales masivos e incrustantes de Diploria spp, Montastraea faveolata y M. cavernosa principalmente._x000D_\r\r\n  El relieve de éstas dos últimas parcelas no es fuerte ya que no hay tamaños de colonias considerables, _x000D_\r\r\n  pero si hay una zona de relieve complejo muy cerca de los transectos la cual es dominada por colonias _x000D_\r\r\n  muy grandes de crecimiento montañoso de M. faveolata. En la parcela media se pueden observar además _x000D_\r\r\n  abundantes colonias medianas de gorgonáceos de la especie Eunicea fusca","Chengue..C1",null,4408,"Andres Felipe Acosta Chaparro"]
["Whip","WHIP",null,"Diodogorgia nodulifera","Dnod",null,null,"Diodogorgia nodulifera","8.55.100","CNIDARIA","Parques Nacionales","ParquesNacionales",null,null,null,14298,"CHE",2,"Las formaciones coralinas y el tipo de relieve son similares a los de C1 exceptuando _x000D_\r\r\nque en el nivel somero (3-6 m) de C2 hay mayor cobertura coralina (38%), _x000D_\r\r\nse pueden observar además cabezas grandes de Siderastrea siderea y _x000D_\r\r\nlos arrecifes de las parcelas media (9-11 m) y profunda (15-17 m), _x000D_\r\r\ndescienden como un talud de pendiente más fuerte. _x000D_\r\r\nLa cobertura de las parcelas media y profunda es de 40% y 31% _x000D_\r\r\nrespectivamente y dichos niveles presentan abundantes cabezas de Montastraea cavernosa_x000D_\r\r\ny Diploria strigosa, así como algunas colonias de gorgonáceos de tamaño considerable principalmente _x000D_\r\r\ndel género Plexaura sp. Debido a que las parcelas media y profunda están ubicados más hacia afuera _x000D_\r\r\nde la bahía, presentan un poco de oleaje de diciembre a abril por la fuerte acción de los _x000D_\r\r\nvientos alisios, lo cual dificulta el muestreo de los transectos de cadena durante esa _x000D_\r\r\népoca","Chengue..C2",null,3956,"Carlos Aponte"]
[null,null,null,"Ellisella barbadensis","Ebar",null,null,"Ellisella barbadensis","8.55.1180","CNIDARIA","PNN_GORGONA","PNN_GORGONA",null,null,null,14299,"TES",1,"Isla Rosario, el Tesoro. está ubicada en una cuenca lagunar de poca pendiente y relieve complejo, _x000D_\r\r\npresenta una cobertura aproximada del 45% y se observan cabezas coralinas _x000D_\r\r\ngrandes dominadas por Montastraea annularis. Es posible observar también _x000D_\r\r\notros corales de crecimiento masivo y cobertura importante como M. faveolata, _x000D_\r\r\nDiploria labyrinthiformis y Colpophyllia natans mezclados con parches amplios de arena._x000D_\r\r\n También se presentan abundantes gorgonáceos de los géneros Briareum sp. y Pseudoplexaura sp. _x000D_\r\r\n Después del plano se presenta hacia afuera un talud de pendiente media y relieve complejo donde _x000D_\r\r\n están ubicados las parcelas de los niveles medio (9-12 m) y profundo (16-19 m). El nivel medio _x000D_\r\r\n tiene una cobertura coralina del 24% y es un ambiente de corales masivos mixtos como M. annularis, _x000D_\r\r\n M franksi y C. natans, mientras el profundo presenta una cobertura mayor (35%) y está dominado por M. _x000D_\r\r\n franksi que forma colonias grandes con bordes tipo terraza. En la parcela profunda se presentan colonias _x000D_\r\r\n aisladas de látigos del género Ellisella sp","Tesoro 1",null,1834,"Diana Isabel Gómez López"]
[null,null,null,"Eunicea calyculata","Ecal",null,null,"Eunicea calyculata","8.55.420","CNIDARIA","UJTL","UJTL",null,null,null,14300,"PAV",1,"Isla Rosario, Pavitos. El ambiente de esta estación en los tres niveles de profundidad difiere considerablemente al de tesoro _x000D_\r\r\npues pavitos está dominado por corales de crecimiento foliáceo del tipo Agaricia sp,_x000D_\r\r\n los gorgonáceos están prácticamente ausentes y se presentan gran cantidad de esponjas de variados _x000D_\r\r\n tamaños, formas de crecimiento y colores. La parcela somera de monitoreo está ubicada_x000D_\r\r\n  sobre la plataforma o terraza que rodea la Isla Pavitos y presenta una cobertura coralina _x000D_\r\r\n  del 31% y cerca se observa un talud de pendiente fuerte y de sustrato frágil donde _x000D_\r\r\n  se localizan las parcelas de los niveles medio (9-12 m) y profundo (16-18 m)._x000D_\r\r\n  En el nivel somero también pueden observarse comúnmente algunas cabezas medianas de _x000D_\r\r\n  Montastraea annularis y M. faveolata mientras en el profundo hay abundantes colonias _x000D_\r\r\n  de M. franksi. Los niveles medio y profundo presenta una cobertura coralina del 40% y 30%_x000D_\r\r\n   respectivamente_x000D_","Pavitos",null,1775,"Diego Duque"]
[null,null,null,"Erythropodium caribaeorum","Ecar",null,null,"Erythropodium caribaeorum","8.55.120","CNIDARIA","Universidad Nacional","UNal",null,null,null,14301,"PBT",1,"Area coralina Punta Betín, Santa Marta","Punta de Betin",null,6356,"Jose Campo"]
[null,null,null,"Eunicea clavigera","Ecla",null,null,"Eunicea clavigera","8.55.500","CNIDARIA","Universidad del Valle","UNIVALLE",null,null,null,14302,"GAY",1,null,"Gayraca 1",null,3905,"Juan David González Corredor"]
[null,null,null,"Ellisella elongata","Eelo",null,null,"Ellisella elongata","8.55.1160","CNIDARIA",null,null,null,null,null,14303,"MRO",1,null,"El Morro",null,5705,"Katherine Johanna Mejía Quintero"]
[null,null,null,"Eunicea fusca","Efus",null,null,"Eunicea fusca","8.55.520","CNIDARIA",null,null,null,null,null,14304,"CHO",3,"es una parcela somera localizada a 6º 0' 40.9","La Chola 3",null,4227,"Laura Sanchez Valencia"]
[null,null,null,"Eunicea laciniata","Elac",null,null,"Eunicea laciniata","8.55.480","CNIDARIA",null,null,null,null,null,14305,"MAN",1,"ubicada frente a Isla Mangle en dirección N. Parcela en el nivel somero (4.5-6 m) que presenta una cobertura del 48%. _x000D_\r\r\nSe caracteriza porque la pendiente del fondo es imperceptible y porque presenta un relieve arrecifal _x000D_\r\r\ncomplejo compuesto por colonias muy grandes de Montastraea annularis y M. faveolata principalmente;_x000D_\r\r\n también es posible observar comúnmente Porites astreoides, P. porites y Millepora alcicornis. _x000D_\r\r\n El arrecife no es compacto y por lo tanto pueden observarse frecuentemente considerables parches _x000D_\r\r\n de sedimentos gruesos.","Mangle 1",null,287,"Marcela Cano"]
[null,null,null,"Ellisella sp.","Elli",null,null,"Ellisella sp.","8.46.430","CNIDARIA",null,null,null,null,null,14306,"MIN",1,"Ubicada hacia el noroeste de Isla Mucura._x000D_\r\r\nEsta estación es una parcela somera (6-7 m)_x000D_\r\r\n con una cobertura coralina del 33% cuyo fondo tiene una pendiente imperceptible y forma _x000D_\r\r\n parte de una terraza muy extensa. Sus arrecifes forman parches alargados que algunas veces _x000D_\r\r\n se conectan entre sí o están separados por áreas de sedimento de origen calcáreo y aparentemente _x000D_\r\r\n son arenas gruesas. Los corales pueden ser cabezas de variados tamaños de Montastraea spp, _x000D_\r\r\n Siderastrea siderea, Colpophyllia natans, Diploria spp. y Porites porites. Las algas y los_x000D_\r\r\n  octocorales son muy abundantes y estos últimos alcanzan tamaños considerables","Minalta",null,5021,"Maria Juliana Vanegas Gonzalez"]
[null,null,null,"Eunicea mammosa","Emam",null,null,"Eunicea mammosa","8.55.400","CNIDARIA",null,null,null,null,null,14307,"MAN",2,"La estación Mangle 2. Parcela en el nivel medio (9-11.5 m), _x000D_\r\r\nubicada sobre un arrecife muy compacto de relieve complejo, la pendiente del fondo es_x000D_\r\r\n suave y tiene una cobertura coralina del 31% aproximadamente. Se pueden observar corales de _x000D_\r\r\n 19 especies pero los más abundantes son M. franksi, P. astreoides y Agaricia tenuifolia y _x000D_\r\r\n también hay otras importantes como M. annularis, M. faveolata y P. porites entre otros. Después_x000D_\r\r\n de este arrecife, el fondo se precipita en un talud mayor que termina en amplios canales de arena _x000D_\r\r\n a los 15-18 m","Mangle 2",null,1809,"Raul Navas Camacho"]
[null,null,null,"Eunicea palmeri","Epal",null,null,"Eunicea palmeri","8.55.6836","CNIDARIA",null,null,null,null,null,14308,"CEY",2,null,"Ceycen 2"]
[null,null,null,"Eunicea pinta","Epin",null,null,"Eunicea pinta","8.55.6838","CNIDARIA",null,null,null,null,null,14309,"EMI",1,null,"Emisario 1"]
[null,null,null,"Erythropodium sp.","Eryt",null,null,"Erythropodium sp.","8.46.100","CNIDARIA",null,null,null,null,null,14310,"EMI",2,null,"Emisario 2"]
[null,null,null,"Eunicea succinea","Esuc",null,null,"Eunicea succinea","8.55.340","CNIDARIA",null,null,null,null,null,14311,"ACU",1,null,"Acuario 1"]
[null,null,null,"Eunicea tourneforti","Etou",null,null,"Eunicea tourneforti","8.55.440","CNIDARIA",null,null,null,null,null,14312,"ACU",2,null,"Acuario 2"]
[null,null,null,"Eunicea sp.","Euni",null,null,"Eunicea sp.","8.46.310","CNIDARIA",null,null,null,null,null,14313,"LIT",1,null,"Little Reef 1"]
[null,null,null,"Gorgonia flabellum","Gfla",null,null,"Gorgonia flabellum","8.55.1080","CNIDARIA",null,null,null,null,null,14314,"LIT",2,null,"Little Reef 2"]
[null,null,null,"Gorgonia mariae","Goma",null,null,"Gorgonia mariae","8.55.6840","CNIDARIA",null,null,null,null,null,14315,"CAN",1,null,"El Canal 1"]
[null,null,null,"Gorgonia sp.","Gorg",null,null,"Gorgonia sp.","8.46.400","CNIDARIA",null,null,null,null,null,14316,"CAN",2,null,"El Canal 2"]
[null,null,null,"Gorgonia ventalina","Gven",null,null,"Gorgonia ventalina","8.55.1040","CNIDARIA",null,null,null,null,null,14317,"MAZ",1,null,"Manzanillo 1"]
[null,null,null,"Hypnogorgia pendula","Hpen",null,null,"Hypnogorgia pendula","8.55.6660","CNIDARIA",null,null,null,null,null,14318,"MAZ",2,null,"Manzanillo 2"]
[null,null,null,"Heterogorgia uatumani","Huat",null,null,"Heterogorgia uatumani","8.55.6842","CNIDARIA",null,null,null,null,null,14319,"BAR",1,null,"The Bar 1"]
[null,null,null,"Iciligorgia sp.","Icil",null,null,"Iciligorgia sp.","8.46.60","CNIDARIA",null,null,null,null,null,14320,"BAR",2,null,"The Bar 2"]
[null,null,null,"Iciligorgia schrammi","Isch",null,null,"Iciligorgia schrammi","8.55.80","CNIDARIA",null,null,null,null,null,14321,"SFE",1,null,"San Felipe 1"]
[null,null,null,"Lophogorgia alba","Lalb",null,null,"Lophogorgia alba","8.55.6848","CNIDARIA",null,null,null,null,null,14322,"SFE",2,null,"San Felipe 2"]
[null,null,null,"Lophogorgia sp.","Lgia",null,null,"Lophogorgia sp.","8.46.360","CNIDARIA",null,null,null,null,null,14323,"GAY",2,null,"Gayraca 2"]
[null,null,null,"Lophogorgia hebes","Lheb",null,null,"Lophogorgia hebes","8.55.6844","CNIDARIA",null,null,null,null,null,14324,"GRA",1,null,"Granate 1"]
[null,null,null,"Lophogorgia miniata","Lmin",null,null,"Lophogorgia miniata","8.55.860","CNIDARIA",null,null,null,null,null,14325,"MAL",1,null,"El Arrecife"]
[null,null,null,"Lophogorgi sp.","Loph",null,null,"Lophogorgi sp.","8.46.360","CNIDARIA",null,null,null,null,null,14326,"CHO",2,"Parcela media localizada a 6º 0' 47.04","La Chola 2"]
[null,null,null,"Lophogorgia virgulata","Lvir",null,null,"Lophogorgia virgulata","8.55.6846","CNIDARIA",null,null,null,null,null,14327,"CHO",4,"Cobertura del 33%","La Chola 4"]
[null,null,null,"Muricea atlantica","Matl",null,null,"Muricea atlantica","8.55.740","CNIDARIA",null,null,null,null,null,14328,"CHO",5,null,"La Chola 5"]
[null,null,null,"Muricea elongata","Melo",null,null,"Muricea elongata","8.55.720","CNIDARIA",null,null,null,null,null,14329,"CHO",6,null,"La Chola 6"]
[null,null,null,"Muriceopsis flavida","Mfla",null,null,"Muriceopsis flavida","8.55.560","CNIDARIA",null,null,null,null,null,14331,"CEY",1,"Estación está conformada por  una parcela","Ceycen 1"]
[null,null,null,"Muricea muricata","Mmur",null,null,"Muricea muricata","8.55.800","CNIDARIA",null,null,null,null,null,14332,"TIO",1,"localizada al noroeste de Isla Tintipan a 9º","Tiosolda"]
[null,null,null,"Muricea pendula","Mpen",null,null,"Muricea pendula","8.55.780","CNIDARIA",null,null,null,null,null,14333,"CTI",2,"incluye una parcela en el nivel medio de prof","Cabo Tiburón M"]
[null,null,null,"Muriceopsis petila","Mpet",null,null,"Muriceopsis petila","8.55.6852","CNIDARIA",null,null,null,null,null,14334,"CTI",1,"la estación es una parcela somera (3 m) forma","Cabo Tiburón S"]
[null,null,null,"Muricea pinnata","Mpin",null,null,"Muricea pinnata","8.55.700","CNIDARIA",null,null,null,null,null,14335,"ZAP",1,"Ubicada afuera de la punta rocosa que cierra la ensenada","Zapsurro M"]
[null,null,null,"Muriceopsis sp.","Msis",null,null,"Muriceopsis sp.","8.46.320","CNIDARIA",null,null,null,null,null,14336,"CAP",1,null,"Capurganá 1"]
[null,null,null,"Muricea laxa","Mula",null,null,"Muricea laxa","8.55.760","CNIDARIA",null,null,null,null,null,14337,"CAP",2,null,"Capurganá 2"]
[null,null,null,"Muricea sp.","Muri",null,null,"Muricea sp.","8.46.340","CNIDARIA",null,null,null,null,null,14338,"AGU",1,"se encuentra localizada bien al fondo de la ensenada","Aguacate S"]
[null,null,null,"Nicella goreaui","Ngor",null,null,"Nicella goreaui","8.55.6854","CNIDARIA",null,null,null,null,null,14339,"IGU",1,null,"Iguana"]
[null,null,null,"Nicella sp.","Nice",null,null,"Nicella sp.","8.46.440","CNIDARIA",null,null,null,null,null,14340,"WLF",1,"La parcela somera está localizada a 12º 30' 4","Wild Life"]
[null,null,null,"Neospongodes portoricensis","Npor",null,null,"Neospongodes portoricensis","8.55.6210","CNIDARIA",null,null,null,null,null,14341,"AZU",1,"A unos 60 metros de la costa en marea baja. localizada a 2º 57' 30.6\" N - 78º 10' 41.0\" O","Azufrada 1"]
[null,null,null,"Nicella schmitti","Nsch",null,null,"Nicella schmitti","8.55.1200","CNIDARIA",null,null,null,null,null,14342,"AZU",2,"A unos 70m de la costa en marea baja","Azufrada 2"]
[null,null,null,"Pseudopterogorgia acerosa","Pace",null,null,"Pseudopterogorgia acerosa","8.55.980","CNIDARIA",null,null,null,null,null,14343,"PLA",1,"Ubicada al sur de la formación coralina","Playa Blanca 1"]
[null,null,null,"Pterogorgia anceps","Panc",null,null,"Pterogorgia anceps","8.55.1120","CNIDARIA",null,null,null,null,null,15508,"CHE",3,null,"Chengue Pastos"]
[null,null,null,"Pterogorgia citrina","Pcit",null,null,"Pterogorgia citrina","8.55.1140","CNIDARIA",null,null,null,null,null,37118,"IFU",1,null,"Fondo Loco"]
[null,null,null,"Phormidium corallyticum","Pcor",null,null,"Phormidium corallyticum","5040.55.40",null,null,null,null,null,null,37119,"IFU",2,null,"Los Boyones"]
[null,null,null,"Pseudoplexaura crucis","Pcru",null,null,"Pseudoplexaura crucis","8.55.6866","CNIDARIA",null,null,null,null,null,37120,"NET",1,"Bajo coralino en la barrera de providencia, alejado varios km al noroeste de la isla","No Entry"]
[null,null,null,"Plexaurella dichotoma","Pdic",null,null,"Plexaurella dichotoma","8.55.640","CNIDARIA",null,null,null,null,null,37121,"OCE",1,null,"Oceanario"]
[null,null,null,"Pseudopterogorgia elizabethae","Peli",null,null,"Pseudopterogorgia elizabethae","8.55.6722","CNIDARIA",null,null,null,null,null,37122,"COC",1,null,"La Coca"]
[null,null,null,"Pseudoplexaura flagellosa","Pfla",null,null,"Pseudoplexaura flagellosa","8.55.320","CNIDARIA",null,null,null,null,null,38924,"PBA",2,"Punta Betín Información meteorologica","Punta Betín, antigua sede INVEMAR Santa Marta"]
[null,null,null,"Plexaura flexuosa","Pfle",null,null,"Plexaura flexuosa","8.55.180","CNIDARIA",null,null,null,null,null,40219,"GAY",3,"Gayraca Hobos","Gayraca 3"]
[null,null,null,"Plexaurella grisea","Pgri",null,null,"Plexaurella grisea","8.55.680","CNIDARIA",null,null,null,null,null,41545,"IGR",1,null,"Isla Grande"]
[null,null,null,"Pterogorgia guadalupensis","Pgua",null,null,"Pterogorgia guadalupensis","8.55.1100","CNIDARIA",null,null,null,null,null,41546,"ARE",1,null,"Isla Arena"]
[null,null,null,"Plexaura homomalla","Phom",null,null,"Plexaura homomalla","8.55.200","CNIDARIA",null,null,null,null,null,41547,"PAL",1,null,"Las Palmas"]
[null,null,null,"Plexaura sp.","Plex",null,null,"Plexaura sp.","8.46.280","CNIDARIA",null,null,null,null,null,41548,"PBR",1,null,"Punta Brava"]
[null,null,null,"Plexaurella sp.","Plla",null,null,"Plexaurella sp.","8.46.330","CNIDARIA",null,null,null,null,null,41549,"TES",2,null,"Tesoro Oriental"]
[null,null,null,"Plexaura nina","Pnin",null,null,"Plexaura nina","8.55.260","CNIDARIA",null,null,null,null,null,41651,"CEY",3,null,"Ceycen 3"]
[null,null,null,"Plexaurella nutans","Pnut",null,null,"Plexaurella nutans","8.55.620","CNIDARIA",null,null,null,null,null,41690,"PLA",3,"Ubicada al norte de la formación coralina","Playa Blanca 3"]
[null,null,null,"Pseudopterogorgia americana","Psam",null,null,"Pseudopterogorgia americana","8.55.920","CNIDARIA",null,null,null,null,null,41691,"PLA",4,"Ubicada al norte de la formación coralina","Playa Blanca 4"]
[null,null,null,"Pseudopterogorgia bipinnata","Psbi",null,null,"Pseudopterogorgia bipinnata","8.55.960","CNIDARIA",null,null,null,null,null,41692,"VEN",1,null,"La Ventana Sur Externa -VEN 1"]
[null,null,null,"Pseudopterogorgia sp.","Psia",null,null,"Pseudopterogorgia sp.","8.46.390","CNIDARIA",null,null,null,null,null,41693,"VEN",2,null,"La Ventana Sur Interna -VEN 2"]
[null,null,null,"Pseudoplexaura porosa","Pspo",null,null,"Pseudoplexaura porosa","8.55.280","CNIDARIA",null,null,null,null,null,41694,"VEN",3,null,"La Ventana Norte Interna -VEN 3"]
[null,null,null,"Pseudoplexaura sp.","Psra",null,null,"Pseudoplexaura sp.","8.46.290","CNIDARIA",null,null,null,null,null,41695,"VEN",4,null,"La Ventana Norte Externa -VEN 4"]
[null,null,null,"Pterogorgia sp.","Pter",null,null,"Pterogorgia sp.","8.46.420","CNIDARIA",null,null,null,null,null,41696,"TNT",2,"Tintipan 2 Medio","Tintipan 2 Medio"]
[null,null,null,"Pseudoplexaura wagenaari","Pwag",null,null,"Pseudoplexaura wagenaari","8.55.300","CNIDARIA",null,null,null,null,null,41697,"TNT",1,"Tintipan 1 Somero","Tintipan 1 Somero"]
[null,null,null,"Swiftia exserta","Sexs",null,null,"Swiftia exserta","8.55.6662","CNIDARIA",null,null,null,null,null,41698,"MRC",1,"Marcelas place","Marcela's place"]
[null,null,null,"Stichopathes lutkeni","Slut",null,null,"Stichopathes lutkeni","8.55.1360","CNIDARIA",null,null,null,null,null,41699,"MAR",1,null,"MARACAIBO"]
[null,null,null,"Stereotelesto corallina","Stco",null,null,"Stereotelesto corallina","8.55.6870","CNIDARIA",null,null,null,null,null,41700,"WHI",1,null,"White  Shoal"]
[null,null,null,"Swiftia sp.","Swif",null,null,"Swiftia sp.","8.46.250","CNIDARIA",null,null,null,null,null,41701,"NEG",1,null,"Neguanje protegido"]
[null,null,null,"Telesto sp.","Tele",null,null,"Telesto sp.","8.46.10","CNIDARIA",null,null,null,null,null,41702,"NEG",2,null,"Neguanje expuesto"]
[null,null,null,"Telesto fruticulosa","Tfru",null,null,"Telesto fruticulosa","8.55.6872","CNIDARIA",null,null,null,null,null,41703,"CIN",1,"Cinto protegido Oriente","Cinto protegido"]
[null,null,null,"Thesea nivea","Tniv",null,null,"Thesea nivea","8.55.6874","CNIDARIA",null,null,null,null,null,41704,"CIN",2,"Cinto expuesto  Occidente","Cinto expuesto"]
[null,null,null,null,null,null,null,null,null,null,null,null,null,null,null,41705,"CHE",4,null,"Chengue Acropora"]
[null,null,null,null,null,null,null,null,null,null,null,null,null,null,null,42263,"NCH",1,"Narrow Channel","Narrow Channel"]
[null,null,null,null,null,null,null,null,null,null,null,null,null,null,null,43098,"MAL",2,null,"La Nevera"]
[null,null,null,null,null,null,null,null,null,null,null,null,null,null,null,43726,"POR",1,"Bahía Portete","Bahía Portete"]
[null,null,null,null,null,null,null,null,null,null,null,null,null,null,null,48967,"JCA",1,"Johnny Cay","Johnny Cay"]
[null,null,null,null,null,null,null,null,null,null,null,null,null,null,null,49000,"ISR",96222,null,"Islas del Rosario"]
[null,null,null,null,null,null,null,null,null,null,null,null,null,null,null,49001,"PRO",96222,null,"Providencia"]
[null,null,null,null,null,null,null,null,null,null,null,null,null,null,null,49003,"UTR",96222,null,"Utría"]
[null,null,null,null,null,null,null,null,null,null,null,null,null,null,null,49004,"SMR",96222,null,"Santa Marta"]
[null,null,null,null,null,null,null,null,null,null,null,null,null,null,null,49006,"ISB",96222,null,"Isla de San Bernardo"]
[null,null,null,null,null,null,null,null,null,null,null,null,null,null,null,49007,"SCO",96222,null,"Archipiélago de San Andrés - Coralina"]
[null,null,null,null,null,null,null,null,null,null,null,null,null,null,null,49008,"UCH",96222,null,"Uraba Chocoano"]
[null,null,null,null,null,null,null,null,null,null,null,null,null,null,null,49009,"ACU",96321,null,"Acuario"]
[null,null,null,null,null,null,null,null,null,null,null,null,null,null,null,49010,"AGU",96321,null,"Aguacate"]
[null,null,null,null,null,null,null,null,null,null,null,null,null,null,null,49011,"ARE",96321,null,"Isla Arena"]
[null,null,null,null,null,null,null,null,null,null,null,null,null,null,null,49012,"AZU",96321,null,"Azufrada"]
[null,null,null,null,null,null,null,null,null,null,null,null,null,null,null,49013,"BAR",96321,null,"The Bar"]
[null,null,null,null,null,null,null,null,null,null,null,null,null,null,null,49014,"CAN",96321,null,"El Canal"]
[null,null,null,null,null,null,null,null,null,null,null,null,null,null,null,49015,"CAP",96321,null,"Capurganá"]
[null,null,null,null,null,null,null,null,null,null,null,null,null,null,null,49016,"CEY",96321,null,"Ceycen"]
[null,null,null,null,null,null,null,null,null,null,null,null,null,null,null,49017,"CHE",96321,null,"Chengue"]
[null,null,null,null,null,null,null,null,null,null,null,null,null,null,null,49018,"CHO",96321,null,"La Chola"]
[null,null,null,null,null,null,null,null,null,null,null,null,null,null,null,49019,"CIN",96321,null,"Cinto"]
[null,null,null,null,null,null,null,null,null,null,null,null,null,null,null,49020,"COC",96321,null,"La Coca"]
[null,null,null,null,null,null,null,null,null,null,null,null,null,null,null,49021,"CTI",96321,null,"Cabo Tiburón"]
[null,null,null,null,null,null,null,null,null,null,null,null,null,null,null,49022,"EMI",96321,null,"Emisario"]
[null,null,null,null,null,null,null,null,null,null,null,null,null,null,null,49023,"GAY",96321,null,"Gayraca"]
[null,null,null,null,null,null,null,null,null,null,null,null,null,null,null,49024,"GRA",96321,null,"Granate"]
[null,null,null,null,null,null,null,null,null,null,null,null,null,null,null,49025,"IFU",96321,null,"Isla Fuerte"]
[null,null,null,null,null,null,null,null,null,null,null,null,null,null,null,49026,"IGR",96321,null,"Isla Grande"]
[null,null,null,null,null,null,null,null,null,null,null,null,null,null,null,49027,"IGU",96321,null,"Iguana"]
[null,null,null,null,null,null,null,null,null,null,null,null,null,null,null,49028,"JCA",96321,null,"Johnny Cay"]
[null,null,null,null,null,null,null,null,null,null,null,null,null,null,null,49029,"LIT",96321,null,"Little Reef"]
[null,null,null,null,null,null,null,null,null,null,null,null,null,null,null,49030,"MAL",96321,null,"Malpelo"]
[null,null,null,null,null,null,null,null,null,null,null,null,null,null,null,49031,"MAN",96321,null,"Mangle"]
[null,null,null,null,null,null,null,null,null,null,null,null,null,null,null,49032,"MAR",96321,null,"Maracaibo"]
[null,null,null,null,null,null,null,null,null,null,null,null,null,null,null,49033,"MAZ",96321,null,"Manzanillo"]
[null,null,null,null,null,null,null,null,null,null,null,null,null,null,null,49034,"MIN",96321,null,"Minalta"]
[null,null,null,null,null,null,null,null,null,null,null,null,null,null,null,49035,"MRC",96321,null,"Marcelas place"]
[null,null,null,null,null,null,null,null,null,null,null,null,null,null,null,49036,"MRO",96321,null,"El Morro"]
[null,null,null,null,null,null,null,null,null,null,null,null,null,null,null,49037,"NCH",96321,null,"Narrow Channel"]
[null,null,null,null,null,null,null,null,null,null,null,null,null,null,null,49038,"NEG",96321,null,"Neguanje"]
[null,null,null,null,null,null,null,null,null,null,null,null,null,null,null,49039,"NET",96321,null,"No Entry"]
[null,null,null,null,null,null,null,null,null,null,null,null,null,null,null,49040,"OCE",96321,null,"Oceanario"]
[null,null,null,null,null,null,null,null,null,null,null,null,null,null,null,49041,"PAL",96321,null,"Las Palmas"]
[null,null,null,null,null,null,null,null,null,null,null,null,null,null,null,49042,"PAV",96321,null,"Pavitos"]
[null,null,null,null,null,null,null,null,null,null,null,null,null,null,null,49044,"PBR",96321,null,"Punta Brava"]
[null,null,null,null,null,null,null,null,null,null,null,null,null,null,null,49046,"PLA",96321,null,"Playa Blanca"]
[null,null,null,null,null,null,null,null,null,null,null,null,null,null,null,49048,"SFE",96321,null,"San Felipe"]
[null,null,null,null,null,null,null,null,null,null,null,null,null,null,null,49050,"TIO",96321,null,"Tiosolda"]
[null,null,null,null,null,null,null,null,null,null,null,null,null,null,null,49052,"VAR",96321,null,"Varadero"]
[null,null,null,null,null,null,null,null,null,null,null,null,null,null,null,49054,"WHI",96321,null,"White Shoal"]
[null,null,null,null,null,null,null,null,null,null,null,null,null,null,null,49056,"ZAP",96321,null,"Zapsurro"]
[null,null,null,null,null,null,null,null,null,null,null,null,null,null,null,49057,"IFU",96321,null,"Isla Fuerte"]
[null,null,null,null,null,null,null,null,null,null,null,null,null,null,null,49058,"MAL",96321,null,"Malpelo"]
[null,null,null,null,null,null,null,null,null,null,null,null,null,null,null,49059,"POR",96321,null,"Portete"]
[null,null,null,null,null,null,null,null,null,null,null,null,null,null,null,49060,"CAR",96222,null,"Cartagena"]
[null,null,null,null,null,null,null,null,null,null,null,null,null,null,null,49084,"VAR",1,"Varadero 1","Varadero 1"]
[null,null,null,null,null,null,null,null,null,null,null,null,null,null,null,49085,"VAR",2,"Varadero 2","Varadero 2"]
[null,null,null,null,null,null,null,null,null,null,null,null,null,null,null,49086,"VAR",3,"Varadero 3","Varadero 3"]
[null,null,null,null,null,null,null,null,null,null,null,null,null,null,null,51551,"PBA",null,null,"Punta Betín - anterior"]
[null,null,null,null,null,null,null,null,null,null,null,null,null,null,null,51552,"PBT",null,null,"Punta Betín"]
[null,null,null,null,null,null,null,null,null,null,null,null,null,null,null,51553,"POR",null,null,"Bahía Portete"]
[null,null,null,null,null,null,null,null,null,null,null,null,null,null,null,51554,"TES",null,null,"Tesoro"]
[null,null,null,null,null,null,null,null,null,null,null,null,null,null,null,51555,"TNT",null,null,"Tintipán"]
[null,null,null,null,null,null,null,null,null,null,null,null,null,null,null,51556,"VEN",null,null,"La Ventana"]
[null,null,null,null,null,null,null,null,null,null,null,null,null,null,null,51557,"WLF",null,null,"Wild Life"]
[null,null,null,null,null,null,null,null,null,null,null,null,null,null,null,51565,"SAN",9622,null,"Archipiélago de San Andrés"]
[null,null,null,null,null,null,null,null,null,null,null,null,null,null,null,51567,"GOR",9622,null,"Gorgona"]
[null,null,null,null,null,null,null,null,null,null,null,null,null,null,null,52325,"NET",2,"Bajo coralino en la barrera de providencia, alejado varios km al noroeste de la isla","No Entry 2"]

{"sheet":"OTRAS REFERENCIAS","index":5,"n_rows":156,"n_cols":13,"rows_kept":156,"cut":false,"hidden":false,"merged":[[0,0,2,10],[4,0,4,1],[26,0,26,2]]}
["Estas son listas para variables con valores que no se encuentran codificados, pero que deben manejarse de manera estandarizada. \nSi se requiere agregar un valor nuevo hagalo debajo de la lista correspondiente"]
[]
[]
[]
["PROFUNDIDAD",null,null,"METODOS",null,null,null,null,null,null,null,{"$f":"IF(AND(REFERENTES!R2<>\"\",          REFERENTES!R2<>96321,    REFERENTES!R2<>96222            ),CONCATENATE(REFERENTES!Q2,\"-\",REFERENTES!R2),\"\")","v":"PLA-2"},{"$f":"REFERENTES!P2","v":14295}]
["Descripcion","Codigo",null,"NOMBRE_MT","CODIGO",null,null,null,null,null,null,{"$f":"IF(AND(REFERENTES!R3<>\"\",          REFERENTES!R3<>96321,    REFERENTES!R3<>96222            ),CONCATENATE(REFERENTES!Q3,\"-\",REFERENTES!R3),\"\")","v":"CHO-1"},{"$f":"REFERENTES!P3","v":14296}]
["S","Somero",null,"Manual de métodos de SIMAC: Cadena rotulada cada diez eslabones","Car",null,null,null,null,null,null,{"$f":"IF(AND(REFERENTES!R4<>\"\",          REFERENTES!R4<>96321,    REFERENTES!R4<>96222            ),CONCATENATE(REFERENTES!Q4,\"-\",REFERENTES!R4),\"\")","v":"CHE-1"},{"$f":"REFERENTES!P4","v":14297}]
["M","Medio",null,null,null,null,null,null,null,null,null,{"$f":"IF(AND(REFERENTES!R5<>\"\",          REFERENTES!R5<>96321,    REFERENTES!R5<>96222            ),CONCATENATE(REFERENTES!Q5,\"-\",REFERENTES!R5),\"\")","v":"CHE-2"},{"$f":"REFERENTES!P5","v":14298}]
["P","Profundo",null,null,null,null,null,null,null,null,null,{"$f":"IF(AND(REFERENTES!R6<>\"\",          REFERENTES!R6<>96321,    REFERENTES!R6<>96222            ),CONCATENATE(REFERENTES!Q6,\"-\",REFERENTES!R6),\"\")","v":"TES-1"},{"$f":"REFERENTES!P6","v":14299}]
[null,null,null,null,null,null,null,null,null,null,null,{"$f":"IF(AND(REFERENTES!R7<>\"\",          REFERENTES!R7<>96321,    REFERENTES!R7<>96222            ),CONCATENATE(REFERENTES!Q7,\"-\",REFERENTES!R7),\"\")","v":"PAV-1"},{"$f":"REFERENTES!P7","v":14300}]
[null,null,null,null,null,null,null,null,null,null,null,{"$f":"IF(AND(REFERENTES!R8<>\"\",          REFERENTES!R8<>96321,    REFERENTES!R8<>96222            ),CONCATENATE(REFERENTES!Q8,\"-\",REFERENTES!R8),\"\")","v":"PBT-1"},{"$f":"REFERENTES!P8","v":14301}]
[null,null,null,null,null,null,null,null,null,null,null,{"$f":"IF(AND(REFERENTES!R9<>\"\",          REFERENTES!R9<>96321,    REFERENTES!R9<>96222            ),CONCATENATE(REFERENTES!Q9,\"-\",REFERENTES!R9),\"\")","v":"GAY-1"},{"$f":"REFERENTES!P9","v":14302}]
[null,null,null,null,null,null,null,null,null,null,null,{"$f":"IF(AND(REFERENTES!R10<>\"\",          REFERENTES!R10<>96321,    REFERENTES!R10<>96222            ),CONCATENATE(REFERENTES!Q10,\"-\",REFERENTES!R10),\"\")","v":"MRO-1"},{"$f":"REFERENTES!P10","v":14303}]
[null,null,null,null,null,null,null,null,null,null,null,{"$f":"IF(AND(REFERENTES!R11<>\"\",          REFERENTES!R11<>96321,    REFERENTES!R11<>96222            ),CONCATENATE(REFERENTES!Q11,\"-\",REFERENTES!R11),\"\")","v":"CHO-3"},{"$f":"REFERENTES!P11","v":14304}]
[null,null,null,null,null,null,null,null,null,null,null,{"$f":"IF(AND(REFERENTES!R12<>\"\",          REFERENTES!R12<>96321,    REFERENTES!R12<>96222            ),CONCATENATE(REFERENTES!Q12,\"-\",REFERENTES!R12),\"\")","v":"MAN-1"},{"$f":"REFERENTES!P12","v":14305}]
[null,null,null,null,null,null,null,null,null,null,null,{"$f":"IF(AND(REFERENTES!R13<>\"\",          REFERENTES!R13<>96321,    REFERENTES!R13<>96222            ),CONCATENATE(REFERENTES!Q13,\"-\",REFERENTES!R13),\"\")","v":"MIN-1"},{"$f":"REFERENTES!P13","v":14306}]
[null,null,null,null,null,null,null,null,null,null,null,{"$f":"IF(AND(REFERENTES!R14<>\"\",          REFERENTES!R14<>96321,    REFERENTES!R14<>96222            ),CONCATENATE(REFERENTES!Q14,\"-\",REFERENTES!R14),\"\")","v":"MAN-2"},{"$f":"REFERENTES!P14","v":14307}]
[null,null,null,null,null,null,null,null,null,null,null,{"$f":"IF(AND(REFERENTES!R15<>\"\",          REFERENTES!R15<>96321,    REFERENTES!R15<>96222            ),CONCATENATE(REFERENTES!Q15,\"-\",REFERENTES!R15),\"\")","v":"CEY-2"},{"$f":"REFERENTES!P15","v":14308}]
[null,null,null,null,null,null,null,null,null,null,null,{"$f":"IF(AND(REFERENTES!R16<>\"\",          REFERENTES!R16<>96321,    REFERENTES!R16<>96222            ),CONCATENATE(REFERENTES!Q16,\"-\",REFERENTES!R16),\"\")","v":"EMI-1"},{"$f":"REFERENTES!P16","v":14309}]
[null,null,null,null,null,null,null,null,null,null,null,{"$f":"IF(AND(REFERENTES!R17<>\"\",          REFERENTES!R17<>96321,    REFERENTES!R17<>96222            ),CONCATENATE(REFERENTES!Q17,\"-\",REFERENTES!R17),\"\")","v":"EMI-2"},{"$f":"REFERENTES!P17","v":14310}]
[null,null,null,null,null,null,null,null,null,null,null,{"$f":"IF(AND(REFERENTES!R18<>\"\",          REFERENTES!R18<>96321,    REFERENTES!R18<>96222            ),CONCATENATE(REFERENTES!Q18,\"-\",REFERENTES!R18),\"\")","v":"ACU-1"},{"$f":"REFERENTES!P18","v":14311}]
[null,null,null,null,null,null,null,null,null,null,null,{"$f":"IF(AND(REFERENTES!R19<>\"\",          REFERENTES!R19<>96321,    REFERENTES!R19<>96222            ),CONCATENATE(REFERENTES!Q19,\"-\",REFERENTES!R19),\"\")","v":"ACU-2"},{"$f":"REFERENTES!P19","v":14312}]
[null,null,null,null,null,null,null,null,null,null,null,{"$f":"IF(AND(REFERENTES!R20<>\"\",          REFERENTES!R20<>96321,    REFERENTES!R20<>96222            ),CONCATENATE(REFERENTES!Q20,\"-\",REFERENTES!R20),\"\")","v":"LIT-1"},{"$f":"REFERENTES!P20","v":14313}]
[null,null,null,null,null,null,null,null,null,null,null,{"$f":"IF(AND(REFERENTES!R21<>\"\",          REFERENTES!R21<>96321,    REFERENTES!R21<>96222            ),CONCATENATE(REFERENTES!Q21,\"-\",REFERENTES!R21),\"\")","v":"LIT-2"},{"$f":"REFERENTES!P21","v":14314}]
[null,null,null,null,null,null,null,null,null,null,null,{"$f":"IF(AND(REFERENTES!R22<>\"\",          REFERENTES!R22<>96321,    REFERENTES!R22<>96222            ),CONCATENATE(REFERENTES!Q22,\"-\",REFERENTES!R22),\"\")","v":"CAN-1"},{"$f":"REFERENTES!P22","v":14315}]
[null,null,null,null,null,null,null,null,null,null,null,{"$f":"IF(AND(REFERENTES!R23<>\"\",          REFERENTES!R23<>96321,    REFERENTES!R23<>96222            ),CONCATENATE(REFERENTES!Q23,\"-\",REFERENTES!R23),\"\")","v":"CAN-2"},{"$f":"REFERENTES!P23","v":14316}]
["CODIGOS LOV",null,null,null,null,null,null,null,null,null,null,{"$f":"IF(AND(REFERENTES!R24<>\"\",          REFERENTES!R24<>96321,    REFERENTES!R24<>96222            ),CONCATENATE(REFERENTES!Q24,\"-\",REFERENTES!R24),\"\")","v":"MAZ-1"},{"$f":"REFERENTES!P24","v":14317}]
["DESCRIPCIÓN","CÓDIGO","GRUPO",null,null,null,null,null,null,null,null,{"$f":"IF(AND(REFERENTES!R25<>\"\",          REFERENTES!R25<>96321,    REFERENTES!R25<>96222            ),CONCATENATE(REFERENTES!Q25,\"-\",REFERENTES!R25),\"\")","v":"MAZ-2"},{"$f":"REFERENTES!P25","v":14318}]
["Departamento",10,2,null,null,null,null,null,null,null,null,{"$f":"IF(AND(REFERENTES!R26<>\"\",          REFERENTES!R26<>96321,    REFERENTES!R26<>96222            ),CONCATENATE(REFERENTES!Q26,\"-\",REFERENTES!R26),\"\")","v":"BAR-1"},{"$f":"REFERENTES!P26","v":14319}]
["Sector",20,2,null,null,null,null,null,null,null,null,{"$f":"IF(AND(REFERENTES!R27<>\"\",          REFERENTES!R27<>96321,    REFERENTES!R27<>96222            ),CONCATENATE(REFERENTES!Q27,\"-\",REFERENTES!R27),\"\")","v":"BAR-2"},{"$f":"REFERENTES!P27","v":14320}]
["Punto",30,2,null,null,null,null,null,null,null,null,{"$f":"IF(AND(REFERENTES!R28<>\"\",          REFERENTES!R28<>96321,    REFERENTES!R28<>96222            ),CONCATENATE(REFERENTES!Q28,\"-\",REFERENTES!R28),\"\")","v":"SFE-1"},{"$f":"REFERENTES!P28","v":14321}]
["Parcela",35,2,null,null,null,null,null,null,null,null,{"$f":"IF(AND(REFERENTES!R29<>\"\",          REFERENTES!R29<>96321,    REFERENTES!R29<>96222            ),CONCATENATE(REFERENTES!Q29,\"-\",REFERENTES!R29),\"\")","v":"SFE-2"},{"$f":"REFERENTES!P29","v":14322}]
["Estaciones",40,2,null,null,null,null,null,null,null,null,{"$f":"IF(AND(REFERENTES!R30<>\"\",          REFERENTES!R30<>96321,    REFERENTES!R30<>96222            ),CONCATENATE(REFERENTES!Q30,\"-\",REFERENTES!R30),\"\")","v":"GAY-2"},{"$f":"REFERENTES!P30","v":14323}]
["Region",50,2,null,null,null,null,null,null,null,null,{"$f":"IF(AND(REFERENTES!R31<>\"\",          REFERENTES!R31<>96321,    REFERENTES!R31<>96222            ),CONCATENATE(REFERENTES!Q31,\"-\",REFERENTES!R31),\"\")","v":"GRA-1"},{"$f":"REFERENTES!P31","v":14324}]
["Unidad_de_Manejo",60,2,null,null,null,null,null,null,null,null,{"$f":"IF(AND(REFERENTES!R32<>\"\",          REFERENTES!R32<>96321,    REFERENTES!R32<>96222            ),CONCATENATE(REFERENTES!Q32,\"-\",REFERENTES!R32),\"\")","v":"MAL-1"},{"$f":"REFERENTES!P32","v":14325}]
["Unidad_Ambiental_Costera",70,2,null,null,null,null,null,null,null,null,{"$f":"IF(AND(REFERENTES!R33<>\"\",          REFERENTES!R33<>96321,    REFERENTES!R33<>96222            ),CONCATENATE(REFERENTES!Q33,\"-\",REFERENTES!R33),\"\")","v":"CHO-2"},{"$f":"REFERENTES!P33","v":14326}]
["Localidad",80,2,null,null,null,null,null,null,null,null,{"$f":"IF(AND(REFERENTES!R34<>\"\",          REFERENTES!R34<>96321,    REFERENTES!R34<>96222            ),CONCATENATE(REFERENTES!Q34,\"-\",REFERENTES!R34),\"\")","v":"CHO-4"},{"$f":"REFERENTES!P34","v":14327}]
["Bloque_Exploracion",85,2,null,null,null,null,null,null,null,null,{"$f":"IF(AND(REFERENTES!R35<>\"\",          REFERENTES!R35<>96321,    REFERENTES!R35<>96222            ),CONCATENATE(REFERENTES!Q35,\"-\",REFERENTES!R35),\"\")","v":"CHO-5"},{"$f":"REFERENTES!P35","v":14328}]
["Area",90,2,null,null,null,null,null,null,null,null,{"$f":"IF(AND(REFERENTES!R36<>\"\",          REFERENTES!R36<>96321,    REFERENTES!R36<>96222            ),CONCATENATE(REFERENTES!Q36,\"-\",REFERENTES!R36),\"\")","v":"CHO-6"},{"$f":"REFERENTES!P36","v":14329}]
[null,null,null,null,null,null,null,null,null,null,null,{"$f":"IF(AND(REFERENTES!R37<>\"\",          REFERENTES!R37<>96321,    REFERENTES!R37<>96222            ),CONCATENATE(REFERENTES!Q37,\"-\",REFERENTES!R37),\"\")","v":"CEY-1"},{"$f":"REFERENTES!P37","v":14331}]
[null,null,null,null,null,null,null,null,null,null,null,{"$f":"IF(AND(REFERENTES!R38<>\"\",          REFERENTES!R38<>96321,    REFERENTES!R38<>96222            ),CONCATENATE(REFERENTES!Q38,\"-\",REFERENTES!R38),\"\")","v":"TIO-1"},{"$f":"REFERENTES!P38","v":14332}]
[null,null,null,null,null,null,null,null,null,null,null,{"$f":"IF(AND(REFERENTES!R39<>\"\",          REFERENTES!R39<>96321,    REFERENTES!R39<>96222            ),CONCATENATE(REFERENTES!Q39,\"-\",REFERENTES!R39),\"\")","v":"CTI-2"},{"$f":"REFERENTES!P39","v":14333}]
[null,null,null,null,null,null,null,null,null,null,null,{"$f":"IF(AND(REFERENTES!R40<>\"\",          REFERENTES!R40<>96321,    REFERENTES!R40<>96222            ),CONCATENATE(REFERENTES!Q40,\"-\",REFERENTES!R40),\"\")","v":"CTI-1"},{"$f":"REFERENTES!P40","v":14334}]
[null,null,null,null,null,null,null,null,null,null,null,{"$f":"IF(AND(REFERENTES!R41<>\"\",          REFERENTES!R41<>96321,    REFERENTES!R41<>96222            ),CONCATENATE(REFERENTES!Q41,\"-\",REFERENTES!R41),\"\")","v":"ZAP-1"},{"$f":"REFERENTES!P41","v":14335}]
[null,null,null,null,null,null,null,null,null,null,null,{"$f":"IF(AND(REFERENTES!R42<>\"\",          REFERENTES!R42<>96321,    REFERENTES!R42<>96222            ),CONCATENATE(REFERENTES!Q42,\"-\",REFERENTES!R42),\"\")","v":"CAP-1"},{"$f":"REFERENTES!P42","v":14336}]
[null,null,null,null,null,null,null,null,null,null,null,{"$f":"IF(AND(REFERENTES!R43<>\"\",          REFERENTES!R43<>96321,    REFERENTES!R43<>96222            ),CONCATENATE(REFERENTES!Q43,\"-\",REFERENTES!R43),\"\")","v":"CAP-2"},{"$f":"REFERENTES!P43","v":14337}]
[null,null,null,null,null,null,null,null,null,null,null,{"$f":"IF(AND(REFERENTES!R44<>\"\",          REFERENTES!R44<>96321,    REFERENTES!R44<>96222            ),CONCATENATE(REFERENTES!Q44,\"-\",REFERENTES!R44),\"\")","v":"AGU-1"},{"$f":"REFERENTES!P44","v":14338}]
[null,null,null,null,null,null,null,null,null,null,null,{"$f":"IF(AND(REFERENTES!R45<>\"\",          REFERENTES!R45<>96321,    REFERENTES!R45<>96222            ),CONCATENATE(REFERENTES!Q45,\"-\",REFERENTES!R45),\"\")","v":"IGU-1"},{"$f":"REFERENTES!P45","v":14339}]
[null,null,null,null,null,null,null,null,null,null,null,{"$f":"IF(AND(REFERENTES!R46<>\"\",          REFERENTES!R46<>96321,    REFERENTES!R46<>96222            ),CONCATENATE(REFERENTES!Q46,\"-\",REFERENTES!R46),\"\")","v":"WLF-1"},{"$f":"REFERENTES!P46","v":14340}]
[null,null,null,null,null,null,null,null,null,null,null,{"$f":"IF(AND(REFERENTES!R47<>\"\",          REFERENTES!R47<>96321,    REFERENTES!R47<>96222            ),CONCATENATE(REFERENTES!Q47,\"-\",REFERENTES!R47),\"\")","v":"AZU-1"},{"$f":"REFERENTES!P47","v":14341}]
[null,null,null,null,null,null,null,null,null,null,null,{"$f":"IF(AND(REFERENTES!R48<>\"\",          REFERENTES!R48<>96321,    REFERENTES!R48<>96222            ),CONCATENATE(REFERENTES!Q48,\"-\",REFERENTES!R48),\"\")","v":"AZU-2"},{"$f":"REFERENTES!P48","v":14342}]
[null,null,null,null,null,null,null,null,null,null,null,{"$f":"IF(AND(REFERENTES!R49<>\"\",          REFERENTES!R49<>96321,    REFERENTES!R49<>96222            ),CONCATENATE(REFERENTES!Q49,\"-\",REFERENTES!R49),\"\")","v":"PLA-1"},{"$f":"REFERENTES!P49","v":14343}]
[null,null,null,null,null,null,null,null,null,null,null,{"$f":"IF(AND(REFERENTES!R50<>\"\",          REFERENTES!R50<>96321,    REFERENTES!R50<>96222            ),CONCATENATE(REFERENTES!Q50,\"-\",REFERENTES!R50),\"\")","v":"CHE-3"},{"$f":"REFERENTES!P50","v":15508}]
[null,null,null,null,null,null,null,null,null,null,null,{"$f":"IF(AND(REFERENTES!R51<>\"\",          REFERENTES!R51<>96321,    REFERENTES!R51<>96222            ),CONCATENATE(REFERENTES!Q51,\"-\",REFERENTES!R51),\"\")","v":"IFU-1"},{"$f":"REFERENTES!P51","v":37118}]
[null,null,null,null,null,null,null,null,null,null,null,{"$f":"IF(AND(REFERENTES!R52<>\"\",          REFERENTES!R52<>96321,    REFERENTES!R52<>96222            ),CONCATENATE(REFERENTES!Q52,\"-\",REFERENTES!R52),\"\")","v":"IFU-2"},{"$f":"REFERENTES!P52","v":37119}]
[null,null,null,null,null,null,null,null,null,null,null,{"$f":"IF(AND(REFERENTES!R53<>\"\",          REFERENTES!R53<>96321,    REFERENTES!R53<>96222            ),CONCATENATE(REFERENTES!Q53,\"-\",REFERENTES!R53),\"\")","v":"NET-1"},{"$f":"REFERENTES!P53","v":37120}]
[null,null,null,null,null,null,null,null,null,null,null,{"$f":"IF(AND(REFERENTES!R54<>\"\",          REFERENTES!R54<>96321,    REFERENTES!R54<>96222            ),CONCATENATE(REFERENTES!Q54,\"-\",REFERENTES!R54),\"\")","v":"OCE-1"},{"$f":"REFERENTES!P54","v":37121}]
[null,null,null,null,null,null,null,null,null,null,null,{"$f":"IF(AND(REFERENTES!R55<>\"\",          REFERENTES!R55<>96321,    REFERENTES!R55<>96222            ),CONCATENATE(REFERENTES!Q55,\"-\",REFERENTES!R55),\"\")","v":"COC-1"},{"$f":"REFERENTES!P55","v":37122}]
[null,null,null,null,null,null,null,null,null,null,null,{"$f":"IF(AND(REFERENTES!R56<>\"\",          REFERENTES!R56<>96321,    REFERENTES!R56<>96222            ),CONCATENATE(REFERENTES!Q56,\"-\",REFERENTES!R56),\"\")","v":"PBA-2"},{"$f":"REFERENTES!P56","v":38924}]
[null,null,null,null,null,null,null,null,null,null,null,{"$f":"IF(AND(REFERENTES!R57<>\"\",          REFERENTES!R57<>96321,    REFERENTES!R57<>96222            ),CONCATENATE(REFERENTES!Q57,\"-\",REFERENTES!R57),\"\")","v":"GAY-3"},{"$f":"REFERENTES!P57","v":40219}]
[null,null,null,null,null,null,null,null,null,null,null,{"$f":"IF(AND(REFERENTES!R58<>\"\",          REFERENTES!R58<>96321,    REFERENTES!R58<>96222            ),CONCATENATE(REFERENTES!Q58,\"-\",REFERENTES!R58),\"\")","v":"IGR-1"},{"$f":"REFERENTES!P58","v":41545}]
[null,null,null,null,null,null,null,null,null,null,null,{"$f":"IF(AND(REFERENTES!R59<>\"\",          REFERENTES!R59<>96321,    REFERENTES!R59<>96222            ),CONCATENATE(REFERENTES!Q59,\"-\",REFERENTES!R59),\"\")","v":"ARE-1"},{"$f":"REFERENTES!P59","v":41546}]
[null,null,null,null,null,null,null,null,null,null,null,{"$f":"IF(AND(REFERENTES!R60<>\"\",          REFERENTES!R60<>96321,    REFERENTES!R60<>96222            ),CONCATENATE(REFERENTES!Q60,\"-\",REFERENTES!R60),\"\")","v":"PAL-1"},{"$f":"REFERENTES!P60","v":41547}]
[null,null,null,null,null,null,null,null,null,null,null,{"$f":"IF(AND(REFERENTES!R61<>\"\",          REFERENTES!R61<>96321,    REFERENTES!R61<>96222            ),CONCATENATE(REFERENTES!Q61,\"-\",REFERENTES!R61),\"\")","v":"PBR-1"},{"$f":"REFERENTES!P61","v":41548}]
[null,null,null,null,null,null,null,null,null,null,null,{"$f":"IF(AND(REFERENTES!R62<>\"\",          REFERENTES!R62<>96321,    REFERENTES!R62<>96222            ),CONCATENATE(REFERENTES!Q62,\"-\",REFERENTES!R62),\"\")","v":"TES-2"},{"$f":"REFERENTES!P62","v":41549}]
[null,null,null,null,null,null,null,null,null,null,null,{"$f":"IF(AND(REFERENTES!R63<>\"\",          REFERENTES!R63<>96321,    REFERENTES!R63<>96222            ),CONCATENATE(REFERENTES!Q63,\"-\",REFERENTES!R63),\"\")","v":"CEY-3"},{"$f":"REFERENTES!P63","v":41651}]
[null,null,null,null,null,null,null,null,null,null,null,{"$f":"IF(AND(REFERENTES!R64<>\"\",          REFERENTES!R64<>96321,    REFERENTES!R64<>96222            ),CONCATENATE(REFERENTES!Q64,\"-\",REFERENTES!R64),\"\")","v":"PLA-3"},{"$f":"REFERENTES!P64","v":41690}]
[null,null,null,null,null,null,null,null,null,null,null,{"$f":"IF(AND(REFERENTES!R65<>\"\",          REFERENTES!R65<>96321,    REFERENTES!R65<>96222            ),CONCATENATE(REFERENTES!Q65,\"-\",REFERENTES!R65),\"\")","v":"PLA-4"},{"$f":"REFERENTES!P65","v":41691}]
[null,null,null,null,null,null,null,null,null,null,null,{"$f":"IF(AND(REFERENTES!R66<>\"\",          REFERENTES!R66<>96321,    REFERENTES!R66<>96222            ),CONCATENATE(REFERENTES!Q66,\"-\",REFERENTES!R66),\"\")","v":"VEN-1"},{"$f":"REFERENTES!P66","v":41692}]
[null,null,null,null,null,null,null,null,null,null,null,{"$f":"IF(AND(REFERENTES!R67<>\"\",          REFERENTES!R67<>96321,    REFERENTES!R67<>96222            ),CONCATENATE(REFERENTES!Q67,\"-\",REFERENTES!R67),\"\")","v":"VEN-2"},{"$f":"REFERENTES!P67","v":41693}]
[null,null,null,null,null,null,null,null,null,null,null,{"$f":"IF(AND(REFERENTES!R68<>\"\",          REFERENTES!R68<>96321,    REFERENTES!R68<>96222            ),CONCATENATE(REFERENTES!Q68,\"-\",REFERENTES!R68),\"\")","v":"VEN-3"},{"$f":"REFERENTES!P68","v":41694}]
[null,null,null,null,null,null,null,null,null,null,null,{"$f":"IF(AND(REFERENTES!R69<>\"\",          REFERENTES!R69<>96321,    REFERENTES!R69<>96222            ),CONCATENATE(REFERENTES!Q69,\"-\",REFERENTES!R69),\"\")","v":"VEN-4"},{"$f":"REFERENTES!P69","v":41695}]
[null,null,null,null,null,null,null,null,null,null,null,{"$f":"IF(AND(REFERENTES!R70<>\"\",          REFERENTES!R70<>96321,    REFERENTES!R70<>96222            ),CONCATENATE(REFERENTES!Q70,\"-\",REFERENTES!R70),\"\")","v":"TNT-2"},{"$f":"REFERENTES!P70","v":41696}]
[null,null,null,null,null,null,null,null,null,null,null,{"$f":"IF(AND(REFERENTES!R71<>\"\",          REFERENTES!R71<>96321,    REFERENTES!R71<>96222            ),CONCATENATE(REFERENTES!Q71,\"-\",REFERENTES!R71),\"\")","v":"TNT-1"},{"$f":"REFERENTES!P71","v":41697}]
[null,null,null,null,null,null,null,null,null,null,null,{"$f":"IF(AND(REFERENTES!R72<>\"\",          REFERENTES!R72<>96321,    REFERENTES!R72<>96222            ),CONCATENATE(REFERENTES!Q72,\"-\",REFERENTES!R72),\"\")","v":"MRC-1"},{"$f":"REFERENTES!P72","v":41698}]
[null,null,null,null,null,null,null,null,null,null,null,{"$f":"IF(AND(REFERENTES!R73<>\"\",          REFERENTES!R73<>96321,    REFERENTES!R73<>96222            ),CONCATENATE(REFERENTES!Q73,\"-\",REFERENTES!R73),\"\")","v":"MAR-1"},{"$f":"REFERENTES!P73","v":41699}]
[null,null,null,null,null,null,null,null,null,null,null,{"$f":"IF(AND(REFERENTES!R74<>\"\",          REFERENTES!R74<>96321,    REFERENTES!R74<>96222            ),CONCATENATE(REFERENTES!Q74,\"-\",REFERENTES!R74),\"\")","v":"WHI-1"},{"$f":"REFERENTES!P74","v":41700}]
[null,null,null,null,null,null,null,null,null,null,null,{"$f":"IF(AND(REFERENTES!R75<>\"\",          REFERENTES!R75<>96321,    REFERENTES!R75<>96222            ),CONCATENATE(REFERENTES!Q75,\"-\",REFERENTES!R75),\"\")","v":"NEG-1"},{"$f":"REFERENTES!P75","v":41701}]
[null,null,null,null,null,null,null,null,null,null,null,{"$f":"IF(AND(REFERENTES!R76<>\"\",          REFERENTES!R76<>96321,    REFERENTES!R76<>96222            ),CONCATENATE(REFERENTES!Q76,\"-\",REFERENTES!R76),\"\")","v":"NEG-2"},{"$f":"REFERENTES!P76","v":41702}]
[null,null,null,null,null,null,null,null,null,null,null,{"$f":"IF(AND(REFERENTES!R77<>\"\",          REFERENTES!R77<>96321,    REFERENTES!R77<>96222            ),CONCATENATE(REFERENTES!Q77,\"-\",REFERENTES!R77),\"\")","v":"CIN-1"},{"$f":"REFERENTES!P77","v":41703}]
[null,null,null,null,null,null,null,null,null,null,null,{"$f":"IF(AND(REFERENTES!R78<>\"\",          REFERENTES!R78<>96321,    REFERENTES!R78<>96222            ),CONCATENATE(REFERENTES!Q78,\"-\",REFERENTES!R78),\"\")","v":"CIN-2"},{"$f":"REFERENTES!P78","v":41704}]
[null,null,null,null,null,null,null,null,null,null,null,{"$f":"IF(AND(REFERENTES!R79<>\"\",          REFERENTES!R79<>96321,    REFERENTES!R79<>96222            ),CONCATENATE(REFERENTES!Q79,\"-\",REFERENTES!R79),\"\")","v":"CHE-4"},{"$f":"REFERENTES!P79","v":41705}]
[null,null,null,null,null,null,null,null,null,null,null,{"$f":"IF(AND(REFERENTES!R80<>\"\",          REFERENTES!R80<>96321,    REFERENTES!R80<>96222            ),CONCATENATE(REFERENTES!Q80,\"-\",REFERENTES!R80),\"\")","v":"NCH-1"},{"$f":"REFERENTES!P80","v":42263}]
[null,null,null,null,null,null,null,null,null,null,null,{"$f":"IF(AND(REFERENTES!R81<>\"\",          REFERENTES!R81<>96321,    REFERENTES!R81<>96222            ),CONCATENATE(REFERENTES!Q81,\"-\",REFERENTES!R81),\"\")","v":"MAL-2"},{"$f":"REFERENTES!P81","v":43098}]
[null,null,null,null,null,null,null,null,null,null,null,{"$f":"IF(AND(REFERENTES!R82<>\"\",          REFERENTES!R82<>96321,    REFERENTES!R82<>96222            ),CONCATENATE(REFERENTES!Q82,\"-\",REFERENTES!R82),\"\")","v":"POR-1"},{"$f":"REFERENTES!P82","v":43726}]
[null,null,null,null,null,null,null,null,null,null,null,{"$f":"IF(AND(REFERENTES!R83<>\"\",          REFERENTES!R83<>96321,    REFERENTES!R83<>96222            ),CONCATENATE(REFERENTES!Q83,\"-\",REFERENTES!R83),\"\")","v":"JCA-1"},{"$f":"REFERENTES!P83","v":48967}]
[null,null,null,null,null,null,null,null,null,null,null,{"$f":"IF(AND(REFERENTES!R84<>\"\",          REFERENTES!R84<>96321,    REFERENTES!R84<>96222            ),CONCATENATE(REFERENTES!Q84,\"-\",REFERENTES!R84),\"\")","v":""},{"$f":"REFERENTES!P84","v":49000}]
[null,null,null,null,null,null,null,null,null,null,null,{"$f":"IF(AND(REFERENTES!R85<>\"\",          REFERENTES!R85<>96321,    REFERENTES!R85<>96222            ),CONCATENATE(REFERENTES!Q85,\"-\",REFERENTES!R85),\"\")","v":""},{"$f":"REFERENTES!P85","v":49001}]
[null,null,null,null,null,null,null,null,null,null,null,{"$f":"IF(AND(REFERENTES!R86<>\"\",          REFERENTES!R86<>96321,    REFERENTES!R86<>96222            ),CONCATENATE(REFERENTES!Q86,\"-\",REFERENTES!R86),\"\")","v":""},{"$f":"REFERENTES!P86","v":49003}]
[null,null,null,null,null,null,null,null,null,null,null,{"$f":"IF(AND(REFERENTES!R87<>\"\",          REFERENTES!R87<>96321,    REFERENTES!R87<>96222            ),CONCATENATE(REFERENTES!Q87,\"-\",REFERENTES!R87),\"\")","v":""},{"$f":"REFERENTES!P87","v":49004}]
[null,null,null,null,null,null,null,null,null,null,null,{"$f":"IF(AND(REFERENTES!R88<>\"\",          REFERENTES!R88<>96321,    REFERENTES!R88<>96222            ),CONCATENATE(REFERENTES!Q88,\"-\",REFERENTES!R88),\"\")","v":""},{"$f":"REFERENTES!P88","v":49006}]
[null,null,null,null,null,null,null,null,null,null,null,{"$f":"IF(AND(REFERENTES!R89<>\"\",          REFERENTES!R89<>96321,    REFERENTES!R89<>96222            ),CONCATENATE(REFERENTES!Q89,\"-\",REFERENTES!R89),\"\")","v":""},{"$f":"REFERENTES!P89","v":49007}]
[null,null,null,null,null,null,null,null,null,null,null,{"$f":"IF(AND(REFERENTES!R90<>\"\",          REFERENTES!R90<>96321,    REFERENTES!R90<>96222            ),CONCATENATE(REFERENTES!Q90,\"-\",REFERENTES!R90),\"\")","v":""},{"$f":"REFERENTES!P90","v":49008}]
[null,null,null,null,null,null,null,null,null,null,null,{"$f":"IF(AND(REFERENTES!R91<>\"\",          REFERENTES!R91<>96321,    REFERENTES!R91<>96222            ),CONCATENATE(REFERENTES!Q91,\"-\",REFERENTES!R91),\"\")","v":""},{"$f":"REFERENTES!P91","v":49009}]
[null,null,null,null,null,null,null,null,null,null,null,{"$f":"IF(AND(REFERENTES!R92<>\"\",          REFERENTES!R92<>96321,    REFERENTES!R92<>96222            ),CONCATENATE(REFERENTES!Q92,\"-\",REFERENTES!R92),\"\")","v":""},{"$f":"REFERENTES!P92","v":49010}]
[null,null,null,null,null,null,null,null,null,null,null,{"$f":"IF(AND(REFERENTES!R93<>\"\",          REFERENTES!R93<>96321,    REFERENTES!R93<>96222            ),CONCATENATE(REFERENTES!Q93,\"-\",REFERENTES!R93),\"\")","v":""},{"$f":"REFERENTES!P93","v":49011}]
[null,null,null,null,null,null,null,null,null,null,null,{"$f":"IF(AND(REFERENTES!R94<>\"\",          REFERENTES!R94<>96321,    REFERENTES!R94<>96222            ),CONCATENATE(REFERENTES!Q94,\"-\",REFERENTES!R94),\"\")","v":""},{"$f":"REFERENTES!P94","v":49012}]
[null,null,null,null,null,null,null,null,null,null,null,{"$f":"IF(AND(REFERENTES!R95<>\"\",          REFERENTES!R95<>96321,    REFERENTES!R95<>96222            ),CONCATENATE(REFERENTES!Q95,\"-\",REFERENTES!R95),\"\")","v":""},{"$f":"REFERENTES!P95","v":49013}]
[null,null,null,null,null,null,null,null,null,null,null,{"$f":"IF(AND(REFERENTES!R96<>\"\",          REFERENTES!R96<>96321,    REFERENTES!R96<>96222            ),CONCATENATE(REFERENTES!Q96,\"-\",REFERENTES!R96),\"\")","v":""},{"$f":"REFERENTES!P96","v":49014}]
[null,null,null,null,null,null,null,null,null,null,null,{"$f":"IF(AND(REFERENTES!R97<>\"\",          REFERENTES!R97<>96321,    REFERENTES!R97<>96222            ),CONCATENATE(REFERENTES!Q97,\"-\",REFERENTES!R97),\"\")","v":""},{"$f":"REFERENTES!P97","v":49015}]
[null,null,null,null,null,null,null,null,null,null,null,{"$f":"IF(AND(REFERENTES!R98<>\"\",          REFERENTES!R98<>96321,    REFERENTES!R98<>96222            ),CONCATENATE(REFERENTES!Q98,\"-\",REFERENTES!R98),\"\")","v":""},{"$f":"REFERENTES!P98","v":49016}]
[null,null,null,null,null,null,null,null,null,null,null,{"$f":"IF(AND(REFERENTES!R99<>\"\",          REFERENTES!R99<>96321,    REFERENTES!R99<>96222            ),CONCATENATE(REFERENTES!Q99,\"-\",REFERENTES!R99),\"\")","v":""},{"$f":"REFERENTES!P99","v":49017}]
[null,null,null,null,null,null,null,null,null,null,null,{"$f":"IF(AND(REFERENTES!R100<>\"\",          REFERENTES!R100<>96321,    REFERENTES!R100<>96222            ),CONCATENATE(REFERENTES!Q100,\"-\",REFERENTES!R100),\"\")","v":""},{"$f":"REFERENTES!P100","v":49018}]
[null,null,null,null,null,null,null,null,null,null,null,{"$f":"IF(AND(REFERENTES!R101<>\"\",          REFERENTES!R101<>96321,    REFERENTES!R101<>96222            ),CONCATENATE(REFERENTES!Q101,\"-\",REFERENTES!R101),\"\")","v":""},{"$f":"REFERENTES!P101","v":49019}]
[null,null,null,null,null,null,null,null,null,null,null,{"$f":"IF(AND(REFERENTES!R102<>\"\",          REFERENTES!R102<>96321,    REFERENTES!R102<>96222            ),CONCATENATE(REFERENTES!Q102,\"-\",REFERENTES!R102),\"\")","v":""},{"$f":"REFERENTES!P102","v":49020}]
[null,null,null,null,null,null,null,null,null,null,null,{"$f":"IF(AND(REFERENTES!R103<>\"\",          REFERENTES!R103<>96321,    REFERENTES!R103<>96222            ),CONCATENATE(REFERENTES!Q103,\"-\",REFERENTES!R103),\"\")","v":""},{"$f":"REFERENTES!P103","v":49021}]
[null,null,null,null,null,null,null,null,null,null,null,{"$f":"IF(AND(REFERENTES!R104<>\"\",          REFERENTES!R104<>96321,    REFERENTES!R104<>96222            ),CONCATENATE(REFERENTES!Q104,\"-\",REFERENTES!R104),\"\")","v":""},{"$f":"REFERENTES!P104","v":49022}]
[null,null,null,null,null,null,null,null,null,null,null,{"$f":"IF(AND(REFERENTES!R105<>\"\",          REFERENTES!R105<>96321,    REFERENTES!R105<>96222            ),CONCATENATE(REFERENTES!Q105,\"-\",REFERENTES!R105),\"\")","v":""},{"$f":"REFERENTES!P105","v":49023}]
[null,null,null,null,null,null,null,null,null,null,null,{"$f":"IF(AND(REFERENTES!R106<>\"\",          REFERENTES!R106<>96321,    REFERENTES!R106<>96222            ),CONCATENATE(REFERENTES!Q106,\"-\",REFERENTES!R106),\"\")","v":""},{"$f":"REFERENTES!P106","v":49024}]
[null,null,null,null,null,null,null,null,null,null,null,{"$f":"IF(AND(REFERENTES!R107<>\"\",          REFERENTES!R107<>96321,    REFERENTES!R107<>96222            ),CONCATENATE(REFERENTES!Q107,\"-\",REFERENTES!R107),\"\")","v":""},{"$f":"REFERENTES!P107","v":49025}]
[null,null,null,null,null,null,null,null,null,null,null,{"$f":"IF(AND(REFERENTES!R108<>\"\",          REFERENTES!R108<>96321,    REFERENTES!R108<>96222            ),CONCATENATE(REFERENTES!Q108,\"-\",REFERENTES!R108),\"\")","v":""},{"$f":"REFERENTES!P108","v":49026}]
[null,null,null,null,null,null,null,null,null,null,null,{"$f":"IF(AND(REFERENTES!R109<>\"\",          REFERENTES!R109<>96321,    REFERENTES!R109<>96222            ),CONCATENATE(REFERENTES!Q109,\"-\",REFERENTES!R109),\"\")","v":""},{"$f":"REFERENTES!P109","v":49027}]
[null,null,null,null,null,null,null,null,null,null,null,{"$f":"IF(AND(REFERENTES!R110<>\"\",          REFERENTES!R110<>96321,    REFERENTES!R110<>96222            ),CONCATENATE(REFERENTES!Q110,\"-\",REFERENTES!R110),\"\")","v":""},{"$f":"REFERENTES!P110","v":49028}]
[null,null,null,null,null,null,null,null,null,null,null,{"$f":"IF(AND(REFERENTES!R111<>\"\",          REFERENTES!R111<>96321,    REFERENTES!R111<>96222            ),CONCATENATE(REFERENTES!Q111,\"-\",REFERENTES!R111),\"\")","v":""},{"$f":"REFERENTES!P111","v":49029}]
[null,null,null,null,null,null,null,null,null,null,null,{"$f":"IF(AND(REFERENTES!R112<>\"\",          REFERENTES!R112<>96321,    REFERENTES!R112<>96222            ),CONCATENATE(REFERENTES!Q112,\"-\",REFERENTES!R112),\"\")","v":""},{"$f":"REFERENTES!P112","v":49030}]
[null,null,null,null,null,null,null,null,null,null,null,{"$f":"IF(AND(REFERENTES!R113<>\"\",          REFERENTES!R113<>96321,    REFERENTES!R113<>96222            ),CONCATENATE(REFERENTES!Q113,\"-\",REFERENTES!R113),\"\")","v":""},{"$f":"REFERENTES!P113","v":49031}]
[null,null,null,null,null,null,null,null,null,null,null,{"$f":"IF(AND(REFERENTES!R114<>\"\",          REFERENTES!R114<>96321,    REFERENTES!R114<>96222            ),CONCATENATE(REFERENTES!Q114,\"-\",REFERENTES!R114),\"\")","v":""},{"$f":"REFERENTES!P114","v":49032}]
[null,null,null,null,null,null,null,null,null,null,null,{"$f":"IF(AND(REFERENTES!R115<>\"\",          REFERENTES!R115<>96321,    REFERENTES!R115<>96222            ),CONCATENATE(REFERENTES!Q115,\"-\",REFERENTES!R115),\"\")","v":""},{"$f":"REFERENTES!P115","v":49033}]
[null,null,null,null,null,null,null,null,null,null,null,{"$f":"IF(AND(REFERENTES!R116<>\"\",          REFERENTES!R116<>96321,    REFERENTES!R116<>96222            ),CONCATENATE(REFERENTES!Q116,\"-\",REFERENTES!R116),\"\")","v":""},{"$f":"REFERENTES!P116","v":49034}]
[null,null,null,null,null,null,null,null,null,null,null,{"$f":"IF(AND(REFERENTES!R117<>\"\",          REFERENTES!R117<>96321,    REFERENTES!R117<>96222            ),CONCATENATE(REFERENTES!Q117,\"-\",REFERENTES!R117),\"\")","v":""},{"$f":"REFERENTES!P117","v":49035}]
[null,null,null,null,null,null,null,null,null,null,null,{"$f":"IF(AND(REFERENTES!R118<>\"\",          REFERENTES!R118<>96321,    REFERENTES!R118<>96222            ),CONCATENATE(REFERENTES!Q118,\"-\",REFERENTES!R118),\"\")","v":""},{"$f":"REFERENTES!P118","v":49036}]
[null,null,null,null,null,null,null,null,null,null,null,{"$f":"IF(AND(REFERENTES!R119<>\"\",          REFERENTES!R119<>96321,    REFERENTES!R119<>96222            ),CONCATENATE(REFERENTES!Q119,\"-\",REFERENTES!R119),\"\")","v":""},{"$f":"REFERENTES!P119","v":49037}]
[null,null,null,null,null,null,null,null,null,null,null,{"$f":"IF(AND(REFERENTES!R120<>\"\",          REFERENTES!R120<>96321,    REFERENTES!R120<>96222            ),CONCATENATE(REFERENTES!Q120,\"-\",REFERENTES!R120),\"\")","v":""},{"$f":"REFERENTES!P120","v":49038}]
[null,null,null,null,null,null,null,null,null,null,null,{"$f":"IF(AND(REFERENTES!R121<>\"\",          REFERENTES!R121<>96321,    REFERENTES!R121<>96222            ),CONCATENATE(REFERENTES!Q121,\"-\",REFERENTES!R121),\"\")","v":""},{"$f":"REFERENTES!P121","v":49039}]
[null,null,null,null,null,null,null,null,null,null,null,{"$f":"IF(AND(REFERENTES!R122<>\"\",          REFERENTES!R122<>96321,    REFERENTES!R122<>96222            ),CONCATENATE(REFERENTES!Q122,\"-\",REFERENTES!R122),\"\")","v":""},{"$f":"REFERENTES!P122","v":49040}]
[null,null,null,null,null,null,null,null,null,null,null,{"$f":"IF(AND(REFERENTES!R123<>\"\",          REFERENTES!R123<>96321,    REFERENTES!R123<>96222            ),CONCATENATE(REFERENTES!Q123,\"-\",REFERENTES!R123),\"\")","v":""},{"$f":"REFERENTES!P123","v":49041}]
[null,null,null,null,null,null,null,null,null,null,null,{"$f":"IF(AND(REFERENTES!R124<>\"\",          REFERENTES!R124<>96321,    REFERENTES!R124<>96222            ),CONCATENATE(REFERENTES!Q124,\"-\",REFERENTES!R124),\"\")","v":""},{"$f":"REFERENTES!P124","v":49042}]
[null,null,null,null,null,null,null,null,null,null,null,{"$f":"IF(AND(REFERENTES!R125<>\"\",          REFERENTES!R125<>96321,    REFERENTES!R125<>96222            ),CONCATENATE(REFERENTES!Q125,\"-\",REFERENTES!R125),\"\")","v":""},{"$f":"REFERENTES!P125","v":49044}]
[null,null,null,null,null,null,null,null,null,null,null,{"$f":"IF(AND(REFERENTES!R126<>\"\",          REFERENTES!R126<>96321,    REFERENTES!R126<>96222            ),CONCATENATE(REFERENTES!Q126,\"-\",REFERENTES!R126),\"\")","v":""},{"$f":"REFERENTES!P126","v":49046}]
[null,null,null,null,null,null,null,null,null,null,null,{"$f":"IF(AND(REFERENTES!R127<>\"\",          REFERENTES!R127<>96321,    REFERENTES!R127<>96222            ),CONCATENATE(REFERENTES!Q127,\"-\",REFERENTES!R127),\"\")","v":""},{"$f":"REFERENTES!P127","v":49048}]
[null,null,null,null,null,null,null,null,null,null,null,{"$f":"IF(AND(REFERENTES!R128<>\"\",          REFERENTES!R128<>96321,    REFERENTES!R128<>96222            ),CONCATENATE(REFERENTES!Q128,\"-\",REFERENTES!R128),\"\")","v":""},{"$f":"REFERENTES!P128","v":49050}]
[null,null,null,null,null,null,null,null,null,null,null,{"$f":"IF(AND(REFERENTES!R129<>\"\",          REFERENTES!R129<>96321,    REFERENTES!R129<>96222            ),CONCATENATE(REFERENTES!Q129,\"-\",REFERENTES!R129),\"\")","v":""},{"$f":"REFERENTES!P129","v":49052}]
[null,null,null,null,null,null,null,null,null,null,null,{"$f":"IF(AND(REFERENTES!R130<>\"\",          REFERENTES!R130<>96321,    REFERENTES!R130<>96222            ),CONCATENATE(REFERENTES!Q130,\"-\",REFERENTES!R130),\"\")","v":""},{"$f":"REFERENTES!P130","v":49054}]
[null,null,null,null,null,null,null,null,null,null,null,{"$f":"IF(AND(REFERENTES!R131<>\"\",          REFERENTES!R131<>96321,    REFERENTES!R131<>96222            ),CONCATENATE(REFERENTES!Q131,\"-\",REFERENTES!R131),\"\")","v":""},{"$f":"REFERENTES!P131","v":49056}]
[null,null,null,null,null,null,null,null,null,null,null,{"$f":"IF(AND(REFERENTES!R132<>\"\",          REFERENTES!R132<>96321,    REFERENTES!R132<>96222            ),CONCATENATE(REFERENTES!Q132,\"-\",REFERENTES!R132),\"\")","v":""},{"$f":"REFERENTES!P132","v":49057}]
[null,null,null,null,null,null,null,null,null,null,null,{"$f":"IF(AND(REFERENTES!R133<>\"\",          REFERENTES!R133<>96321,    REFERENTES!R133<>96222            ),CONCATENATE(REFERENTES!Q133,\"-\",REFERENTES!R133),\"\")","v":""},{"$f":"REFERENTES!P133","v":49058}]
[null,null,null,null,null,null,null,null,null,null,null,{"$f":"IF(AND(REFERENTES!R134<>\"\",          REFERENTES!R134<>96321,    REFERENTES!R134<>96222            ),CONCATENATE(REFERENTES!Q134,\"-\",REFERENTES!R134),\"\")","v":""},{"$f":"REFERENTES!P134","v":49059}]
[null,null,null,null,null,null,null,null,null,null,null,{"$f":"IF(AND(REFERENTES!R135<>\"\",          REFERENTES!R135<>96321,    REFERENTES!R135<>96222            ),CONCATENATE(REFERENTES!Q135,\"-\",REFERENTES!R135),\"\")","v":""},{"$f":"REFERENTES!P135","v":49060}]
[null,null,null,null,null,null,null,null,null,null,null,{"$f":"IF(AND(REFERENTES!R136<>\"\",          REFERENTES!R136<>96321,    REFERENTES!R136<>96222            ),CONCATENATE(REFERENTES!Q136,\"-\",REFERENTES!R136),\"\")","v":"VAR-1"},{"$f":"REFERENTES!P136","v":49084}]
[null,null,null,null,null,null,null,null,null,null,null,{"$f":"IF(AND(REFERENTES!R137<>\"\",          REFERENTES!R137<>96321,    REFERENTES!R137<>96222            ),CONCATENATE(REFERENTES!Q137,\"-\",REFERENTES!R137),\"\")","v":"VAR-2"},{"$f":"REFERENTES!P137","v":49085}]
[null,null,null,null,null,null,null,null,null,null,null,{"$f":"IF(AND(REFERENTES!R138<>\"\",          REFERENTES!R138<>96321,    REFERENTES!R138<>96222            ),CONCATENATE(REFERENTES!Q138,\"-\",REFERENTES!R138),\"\")","v":"VAR-3"},{"$f":"REFERENTES!P138","v":49086}]
[null,null,null,null,null,null,null,null,null,null,null,{"$f":"IF(AND(REFERENTES!R139<>\"\",          REFERENTES!R139<>96321,    REFERENTES!R139<>96222            ),CONCATENATE(REFERENTES!Q139,\"-\",REFERENTES!R139),\"\")","v":""},{"$f":"REFERENTES!P139","v":51551}]
[null,null,null,null,null,null,null,null,null,null,null,{"$f":"IF(AND(REFERENTES!R140<>\"\",          REFERENTES!R140<>96321,    REFERENTES!R140<>96222            ),CONCATENATE(REFERENTES!Q140,\"-\",REFERENTES!R140),\"\")","v":""},{"$f":"REFERENTES!P140","v":51552}]
[null,null,null,null,null,null,null,null,null,null,null,{"$f":"IF(AND(REFERENTES!R141<>\"\",          REFERENTES!R141<>96321,    REFERENTES!R141<>96222            ),CONCATENATE(REFERENTES!Q141,\"-\",REFERENTES!R141),\"\")","v":""},{"$f":"REFERENTES!P141","v":51553}]
[null,null,null,null,null,null,null,null,null,null,null,{"$f":"IF(AND(REFERENTES!R142<>\"\",          REFERENTES!R142<>96321,    REFERENTES!R142<>96222            ),CONCATENATE(REFERENTES!Q142,\"-\",REFERENTES!R142),\"\")","v":""},{"$f":"REFERENTES!P142","v":51554}]
[null,null,null,null,null,null,null,null,null,null,null,{"$f":"IF(AND(REFERENTES!R143<>\"\",          REFERENTES!R143<>96321,    REFERENTES!R143<>96222            ),CONCATENATE(REFERENTES!Q143,\"-\",REFERENTES!R143),\"\")","v":""},{"$f":"REFERENTES!P143","v":51555}]
[null,null,null,null,null,null,null,null,null,null,null,{"$f":"IF(AND(REFERENTES!R144<>\"\",          REFERENTES!R144<>96321,    REFERENTES!R144<>96222            ),CONCATENATE(REFERENTES!Q144,\"-\",REFERENTES!R144),\"\")","v":""},{"$f":"REFERENTES!P144","v":51556}]
[null,null,null,null,null,null,null,null,null,null,null,{"$f":"IF(AND(REFERENTES!R145<>\"\",          REFERENTES!R145<>96321,    REFERENTES!R145<>96222            ),CONCATENATE(REFERENTES!Q145,\"-\",REFERENTES!R145),\"\")","v":""},{"$f":"REFERENTES!P145","v":51557}]
[null,null,null,null,null,null,null,null,null,null,null,{"$f":"IF(AND(REFERENTES!R146<>\"\",          REFERENTES!R146<>96321,    REFERENTES!R146<>96222            ),CONCATENATE(REFERENTES!Q146,\"-\",REFERENTES!R146),\"\")","v":"SAN-9622"},{"$f":"REFERENTES!P146","v":51565}]
[null,null,null,null,null,null,null,null,null,null,null,{"$f":"IF(AND(REFERENTES!R147<>\"\",          REFERENTES!R147<>96321,    REFERENTES!R147<>96222            ),CONCATENATE(REFERENTES!Q147,\"-\",REFERENTES!R147),\"\")","v":"GOR-9622"},{"$f":"REFERENTES!P147","v":51567}]
[null,null,null,null,null,null,null,null,null,null,null,{"$f":"IF(AND(REFERENTES!R148<>\"\",          REFERENTES!R148<>96321,    REFERENTES!R148<>96222            ),CONCATENATE(REFERENTES!Q148,\"-\",REFERENTES!R148),\"\")","v":"NET-2"},{"$f":"REFERENTES!P148","v":52325}]
[null,null,null,null,null,null,null,null,null,null,null,{"$f":"IF(AND(REFERENTES!R149<>\"\",          REFERENTES!R149<>96321,    REFERENTES!R149<>96222            ),CONCATENATE(REFERENTES!Q149,\"-\",REFERENTES!R149),\"\")","v":""},{"$f":"REFERENTES!P149","v":0}]
[null,null,null,null,null,null,null,null,null,null,null,{"$f":"IF(AND(REFERENTES!R150<>\"\",          REFERENTES!R150<>96321,    REFERENTES!R150<>96222            ),CONCATENATE(REFERENTES!Q150,\"-\",REFERENTES!R150),\"\")","v":""},{"$f":"REFERENTES!P150","v":0}]
[null,null,null,null,null,null,null,null,null,null,null,{"$f":"IF(AND(REFERENTES!R151<>\"\",          REFERENTES!R151<>96321,    REFERENTES!R151<>96222            ),CONCATENATE(REFERENTES!Q151,\"-\",REFERENTES!R151),\"\")","v":""},{"$f":"REFERENTES!P151","v":0}]
[null,null,null,null,null,null,null,null,null,null,null,{"$f":"IF(AND(REFERENTES!R152<>\"\",          REFERENTES!R152<>96321,    REFERENTES!R152<>96222            ),CONCATENATE(REFERENTES!Q152,\"-\",REFERENTES!R152),\"\")","v":""},{"$f":"REFERENTES!P152","v":0}]
[null,null,null,null,null,null,null,null,null,null,null,{"$f":"IF(AND(REFERENTES!R153<>\"\",          REFERENTES!R153<>96321,    REFERENTES!R153<>96222            ),CONCATENATE(REFERENTES!Q153,\"-\",REFERENTES!R153),\"\")","v":""},{"$f":"REFERENTES!P153","v":0}]

{"sheet":"Resumen","index":6,"n_rows":301,"n_cols":8,"rows_kept":301,"cut":false,"hidden":false,"merged":[[0,7,2,11]]}
["estacion","individuos","registros","Etiquetas de fila","Suma de individuos","Cuenta de registros",null,"Esta tabla debe ser actualizada cada vez que introduzca nuevos datos, para ello debe hacer clic sobre cualquier parte de la tabla y presionar las teclas ALT + F5 de manera conjunta."]
[{"$f":"IF(DATOS!R5=\"\",\"\",DATOS!R5)","v":""},{"$f":"IF(DATOS!AG5=\"\",\"\",DATOS!AG5)","v":""},{"$f":"IF(DATOS!V5=\"\",\"\",DATOS!V5)","v":""},null,0,300]
[{"$f":"IF(DATOS!R6=\"\",\"\",DATOS!R6)","v":""},{"$f":"IF(DATOS!AG6=\"\",\"\",DATOS!AG6)","v":""},{"$f":"IF(DATOS!V6=\"\",\"\",DATOS!V6)","v":""},"Total general",0,300]
[{"$f":"IF(DATOS!R7=\"\",\"\",DATOS!R7)","v":""},{"$f":"IF(DATOS!AG7=\"\",\"\",DATOS!AG7)","v":""},{"$f":"IF(DATOS!V7=\"\",\"\",DATOS!V7)","v":""}]
[{"$f":"IF(DATOS!R8=\"\",\"\",DATOS!R8)","v":""},{"$f":"IF(DATOS!AG8=\"\",\"\",DATOS!AG8)","v":""},{"$f":"IF(DATOS!V8=\"\",\"\",DATOS!V8)","v":""}]
[{"$f":"IF(DATOS!R9=\"\",\"\",DATOS!R9)","v":""},{"$f":"IF(DATOS!AG9=\"\",\"\",DATOS!AG9)","v":""},{"$f":"IF(DATOS!V9=\"\",\"\",DATOS!V9)","v":""}]
[{"$f":"IF(DATOS!R10=\"\",\"\",DATOS!R10)","v":""},{"$f":"IF(DATOS!AG10=\"\",\"\",DATOS!AG10)","v":""},{"$f":"IF(DATOS!V10=\"\",\"\",DATOS!V10)","v":""}]
[{"$f":"IF(DATOS!R11=\"\",\"\",DATOS!R11)","v":""},{"$f":"IF(DATOS!AG11=\"\",\"\",DATOS!AG11)","v":""},{"$f":"IF(DATOS!V11=\"\",\"\",DATOS!V11)","v":""}]
[{"$f":"IF(DATOS!R12=\"\",\"\",DATOS!R12)","v":""},{"$f":"IF(DATOS!AG12=\"\",\"\",DATOS!AG12)","v":""},{"$f":"IF(DATOS!V12=\"\",\"\",DATOS!V12)","v":""}]
[{"$f":"IF(DATOS!R13=\"\",\"\",DATOS!R13)","v":""},{"$f":"IF(DATOS!AG13=\"\",\"\",DATOS!AG13)","v":""},{"$f":"IF(DATOS!V13=\"\",\"\",DATOS!V13)","v":""}]
[{"$f":"IF(DATOS!R14=\"\",\"\",DATOS!R14)","v":""},{"$f":"IF(DATOS!AG14=\"\",\"\",DATOS!AG14)","v":""},{"$f":"IF(DATOS!V14=\"\",\"\",DATOS!V14)","v":""}]
[{"$f":"IF(DATOS!R15=\"\",\"\",DATOS!R15)","v":""},{"$f":"IF(DATOS!AG15=\"\",\"\",DATOS!AG15)","v":""},{"$f":"IF(DATOS!V15=\"\",\"\",DATOS!V15)","v":""}]
[{"$f":"IF(DATOS!R16=\"\",\"\",DATOS!R16)","v":""},{"$f":"IF(DATOS!AG16=\"\",\"\",DATOS!AG16)","v":""},{"$f":"IF(DATOS!V16=\"\",\"\",DATOS!V16)","v":""}]
[{"$f":"IF(DATOS!R17=\"\",\"\",DATOS!R17)","v":""},{"$f":"IF(DATOS!AG17=\"\",\"\",DATOS!AG17)","v":""},{"$f":"IF(DATOS!V17=\"\",\"\",DATOS!V17)","v":""}]
[{"$f":"IF(DATOS!R18=\"\",\"\",DATOS!R18)","v":""},{"$f":"IF(DATOS!AG18=\"\",\"\",DATOS!AG18)","v":""},{"$f":"IF(DATOS!V18=\"\",\"\",DATOS!V18)","v":""}]
[{"$f":"IF(DATOS!R19=\"\",\"\",DATOS!R19)","v":""},{"$f":"IF(DATOS!AG19=\"\",\"\",DATOS!AG19)","v":""},{"$f":"IF(DATOS!V19=\"\",\"\",DATOS!V19)","v":""}]
[{"$f":"IF(DATOS!R20=\"\",\"\",DATOS!R20)","v":""},{"$f":"IF(DATOS!AG20=\"\",\"\",DATOS!AG20)","v":""},{"$f":"IF(DATOS!V20=\"\",\"\",DATOS!V20)","v":""}]
[{"$f":"IF(DATOS!R21=\"\",\"\",DATOS!R21)","v":""},{"$f":"IF(DATOS!AG21=\"\",\"\",DATOS!AG21)","v":""},{"$f":"IF(DATOS!V21=\"\",\"\",DATOS!V21)","v":""}]
[{"$f":"IF(DATOS!R22=\"\",\"\",DATOS!R22)","v":""},{"$f":"IF(DATOS!AG22=\"\",\"\",DATOS!AG22)","v":""},{"$f":"IF(DATOS!V22=\"\",\"\",DATOS!V22)","v":""}]
[{"$f":"IF(DATOS!R23=\"\",\"\",DATOS!R23)","v":""},{"$f":"IF(DATOS!AG23=\"\",\"\",DATOS!AG23)","v":""},{"$f":"IF(DATOS!V23=\"\",\"\",DATOS!V23)","v":""}]
[{"$f":"IF(DATOS!R24=\"\",\"\",DATOS!R24)","v":""},{"$f":"IF(DATOS!AG24=\"\",\"\",DATOS!AG24)","v":""},{"$f":"IF(DATOS!V24=\"\",\"\",DATOS!V24)","v":""}]
[{"$f":"IF(DATOS!R25=\"\",\"\",DATOS!R25)","v":""},{"$f":"IF(DATOS!AG25=\"\",\"\",DATOS!AG25)","v":""},{"$f":"IF(DATOS!V25=\"\",\"\",DATOS!V25)","v":""}]
[{"$f":"IF(DATOS!R26=\"\",\"\",DATOS!R26)","v":""},{"$f":"IF(DATOS!AG26=\"\",\"\",DATOS!AG26)","v":""},{"$f":"IF(DATOS!V26=\"\",\"\",DATOS!V26)","v":""}]
[{"$f":"IF(DATOS!R27=\"\",\"\",DATOS!R27)","v":""},{"$f":"IF(DATOS!AG27=\"\",\"\",DATOS!AG27)","v":""},{"$f":"IF(DATOS!V27=\"\",\"\",DATOS!V27)","v":""}]
[{"$f":"IF(DATOS!R28=\"\",\"\",DATOS!R28)","v":""},{"$f":"IF(DATOS!AG28=\"\",\"\",DATOS!AG28)","v":""},{"$f":"IF(DATOS!V28=\"\",\"\",DATOS!V28)","v":""}]
[{"$f":"IF(DATOS!R29=\"\",\"\",DATOS!R29)","v":""},{"$f":"IF(DATOS!AG29=\"\",\"\",DATOS!AG29)","v":""},{"$f":"IF(DATOS!V29=\"\",\"\",DATOS!V29)","v":""}]
[{"$f":"IF(DATOS!R30=\"\",\"\",DATOS!R30)","v":""},{"$f":"IF(DATOS!AG30=\"\",\"\",DATOS!AG30)","v":""},{"$f":"IF(DATOS!V30=\"\",\"\",DATOS!V30)","v":""}]
[{"$f":"IF(DATOS!R31=\"\",\"\",DATOS!R31)","v":""},{"$f":"IF(DATOS!AG31=\"\",\"\",DATOS!AG31)","v":""},{"$f":"IF(DATOS!V31=\"\",\"\",DATOS!V31)","v":""}]
[{"$f":"IF(DATOS!R32=\"\",\"\",DATOS!R32)","v":""},{"$f":"IF(DATOS!AG32=\"\",\"\",DATOS!AG32)","v":""},{"$f":"IF(DATOS!V32=\"\",\"\",DATOS!V32)","v":""}]
[{"$f":"IF(DATOS!R33=\"\",\"\",DATOS!R33)","v":""},{"$f":"IF(DATOS!AG33=\"\",\"\",DATOS!AG33)","v":""},{"$f":"IF(DATOS!V33=\"\",\"\",DATOS!V33)","v":""}]
[{"$f":"IF(DATOS!R34=\"\",\"\",DATOS!R34)","v":""},{"$f":"IF(DATOS!AG34=\"\",\"\",DATOS!AG34)","v":""},{"$f":"IF(DATOS!V34=\"\",\"\",DATOS!V34)","v":""}]
[{"$f":"IF(DATOS!R35=\"\",\"\",DATOS!R35)","v":""},{"$f":"IF(DATOS!AG35=\"\",\"\",DATOS!AG35)","v":""},{"$f":"IF(DATOS!V35=\"\",\"\",DATOS!V35)","v":""}]
[{"$f":"IF(DATOS!R36=\"\",\"\",DATOS!R36)","v":""},{"$f":"IF(DATOS!AG36=\"\",\"\",DATOS!AG36)","v":""},{"$f":"IF(DATOS!V36=\"\",\"\",DATOS!V36)","v":""}]
[{"$f":"IF(DATOS!R37=\"\",\"\",DATOS!R37)","v":""},{"$f":"IF(DATOS!AG37=\"\",\"\",DATOS!AG37)","v":""},{"$f":"IF(DATOS!V37=\"\",\"\",DATOS!V37)","v":""}]
[{"$f":"IF(DATOS!R38=\"\",\"\",DATOS!R38)","v":""},{"$f":"IF(DATOS!AG38=\"\",\"\",DATOS!AG38)","v":""},{"$f":"IF(DATOS!V38=\"\",\"\",DATOS!V38)","v":""}]
[{"$f":"IF(DATOS!R39=\"\",\"\",DATOS!R39)","v":""},{"$f":"IF(DATOS!AG39=\"\",\"\",DATOS!AG39)","v":""},{"$f":"IF(DATOS!V39=\"\",\"\",DATOS!V39)","v":""}]
[{"$f":"IF(DATOS!R40=\"\",\"\",DATOS!R40)","v":""},{"$f":"IF(DATOS!AG40=\"\",\"\",DATOS!AG40)","v":""},{"$f":"IF(DATOS!V40=\"\",\"\",DATOS!V40)","v":""}]
[{"$f":"IF(DATOS!R41=\"\",\"\",DATOS!R41)","v":""},{"$f":"IF(DATOS!AG41=\"\",\"\",DATOS!AG41)","v":""},{"$f":"IF(DATOS!V41=\"\",\"\",DATOS!V41)","v":""}]
[{"$f":"IF(DATOS!R42=\"\",\"\",DATOS!R42)","v":""},{"$f":"IF(DATOS!AG42=\"\",\"\",DATOS!AG42)","v":""},{"$f":"IF(DATOS!V42=\"\",\"\",DATOS!V42)","v":""}]
[{"$f":"IF(DATOS!R43=\"\",\"\",DATOS!R43)","v":""},{"$f":"IF(DATOS!AG43=\"\",\"\",DATOS!AG43)","v":""},{"$f":"IF(DATOS!V43=\"\",\"\",DATOS!V43)","v":""}]
[{"$f":"IF(DATOS!R44=\"\",\"\",DATOS!R44)","v":""},{"$f":"IF(DATOS!AG44=\"\",\"\",DATOS!AG44)","v":""},{"$f":"IF(DATOS!V44=\"\",\"\",DATOS!V44)","v":""}]
[{"$f":"IF(DATOS!R45=\"\",\"\",DATOS!R45)","v":""},{"$f":"IF(DATOS!AG45=\"\",\"\",DATOS!AG45)","v":""},{"$f":"IF(DATOS!V45=\"\",\"\",DATOS!V45)","v":""}]
[{"$f":"IF(DATOS!R46=\"\",\"\",DATOS!R46)","v":""},{"$f":"IF(DATOS!AG46=\"\",\"\",DATOS!AG46)","v":""},{"$f":"IF(DATOS!V46=\"\",\"\",DATOS!V46)","v":""}]
[{"$f":"IF(DATOS!R47=\"\",\"\",DATOS!R47)","v":""},{"$f":"IF(DATOS!AG47=\"\",\"\",DATOS!AG47)","v":""},{"$f":"IF(DATOS!V47=\"\",\"\",DATOS!V47)","v":""}]
[{"$f":"IF(DATOS!R48=\"\",\"\",DATOS!R48)","v":""},{"$f":"IF(DATOS!AG48=\"\",\"\",DATOS!AG48)","v":""},{"$f":"IF(DATOS!V48=\"\",\"\",DATOS!V48)","v":""}]
[{"$f":"IF(DATOS!R49=\"\",\"\",DATOS!R49)","v":""},{"$f":"IF(DATOS!AG49=\"\",\"\",DATOS!AG49)","v":""},{"$f":"IF(DATOS!V49=\"\",\"\",DATOS!V49)","v":""}]
[{"$f":"IF(DATOS!R50=\"\",\"\",DATOS!R50)","v":""},{"$f":"IF(DATOS!AG50=\"\",\"\",DATOS!AG50)","v":""},{"$f":"IF(DATOS!V50=\"\",\"\",DATOS!V50)","v":""}]
[{"$f":"IF(DATOS!R51=\"\",\"\",DATOS!R51)","v":""},{"$f":"IF(DATOS!AG51=\"\",\"\",DATOS!AG51)","v":""},{"$f":"IF(DATOS!V51=\"\",\"\",DATOS!V51)","v":""}]
[{"$f":"IF(DATOS!R52=\"\",\"\",DATOS!R52)","v":""},{"$f":"IF(DATOS!AG52=\"\",\"\",DATOS!AG52)","v":""},{"$f":"IF(DATOS!V52=\"\",\"\",DATOS!V52)","v":""}]
[{"$f":"IF(DATOS!R53=\"\",\"\",DATOS!R53)","v":""},{"$f":"IF(DATOS!AG53=\"\",\"\",DATOS!AG53)","v":""},{"$f":"IF(DATOS!V53=\"\",\"\",DATOS!V53)","v":""}]
[{"$f":"IF(DATOS!R54=\"\",\"\",DATOS!R54)","v":""},{"$f":"IF(DATOS!AG54=\"\",\"\",DATOS!AG54)","v":""},{"$f":"IF(DATOS!V54=\"\",\"\",DATOS!V54)","v":""}]
[{"$f":"IF(DATOS!R55=\"\",\"\",DATOS!R55)","v":""},{"$f":"IF(DATOS!AG55=\"\",\"\",DATOS!AG55)","v":""},{"$f":"IF(DATOS!V55=\"\",\"\",DATOS!V55)","v":""}]
[{"$f":"IF(DATOS!R56=\"\",\"\",DATOS!R56)","v":""},{"$f":"IF(DATOS!AG56=\"\",\"\",DATOS!AG56)","v":""},{"$f":"IF(DATOS!V56=\"\",\"\",DATOS!V56)","v":""}]
[{"$f":"IF(DATOS!R57=\"\",\"\",DATOS!R57)","v":""},{"$f":"IF(DATOS!AG57=\"\",\"\",DATOS!AG57)","v":""},{"$f":"IF(DATOS!V57=\"\",\"\",DATOS!V57)","v":""}]
[{"$f":"IF(DATOS!R58=\"\",\"\",DATOS!R58)","v":""},{"$f":"IF(DATOS!AG58=\"\",\"\",DATOS!AG58)","v":""},{"$f":"IF(DATOS!V58=\"\",\"\",DATOS!V58)","v":""}]
[{"$f":"IF(DATOS!R59=\"\",\"\",DATOS!R59)","v":""},{"$f":"IF(DATOS!AG59=\"\",\"\",DATOS!AG59)","v":""},{"$f":"IF(DATOS!V59=\"\",\"\",DATOS!V59)","v":""}]
[{"$f":"IF(DATOS!R60=\"\",\"\",DATOS!R60)","v":""},{"$f":"IF(DATOS!AG60=\"\",\"\",DATOS!AG60)","v":""},{"$f":"IF(DATOS!V60=\"\",\"\",DATOS!V60)","v":""}]
[{"$f":"IF(DATOS!R61=\"\",\"\",DATOS!R61)","v":""},{"$f":"IF(DATOS!AG61=\"\",\"\",DATOS!AG61)","v":""},{"$f":"IF(DATOS!V61=\"\",\"\",DATOS!V61)","v":""}]
[{"$f":"IF(DATOS!R62=\"\",\"\",DATOS!R62)","v":""},{"$f":"IF(DATOS!AG62=\"\",\"\",DATOS!AG62)","v":""},{"$f":"IF(DATOS!V62=\"\",\"\",DATOS!V62)","v":""}]
[{"$f":"IF(DATOS!R63=\"\",\"\",DATOS!R63)","v":""},{"$f":"IF(DATOS!AG63=\"\",\"\",DATOS!AG63)","v":""},{"$f":"IF(DATOS!V63=\"\",\"\",DATOS!V63)","v":""}]
[{"$f":"IF(DATOS!R64=\"\",\"\",DATOS!R64)","v":""},{"$f":"IF(DATOS!AG64=\"\",\"\",DATOS!AG64)","v":""},{"$f":"IF(DATOS!V64=\"\",\"\",DATOS!V64)","v":""}]
[{"$f":"IF(DATOS!R65=\"\",\"\",DATOS!R65)","v":""},{"$f":"IF(DATOS!AG65=\"\",\"\",DATOS!AG65)","v":""},{"$f":"IF(DATOS!V65=\"\",\"\",DATOS!V65)","v":""}]
[{"$f":"IF(DATOS!R66=\"\",\"\",DATOS!R66)","v":""},{"$f":"IF(DATOS!AG66=\"\",\"\",DATOS!AG66)","v":""},{"$f":"IF(DATOS!V66=\"\",\"\",DATOS!V66)","v":""}]
[{"$f":"IF(DATOS!R67=\"\",\"\",DATOS!R67)","v":""},{"$f":"IF(DATOS!AG67=\"\",\"\",DATOS!AG67)","v":""},{"$f":"IF(DATOS!V67=\"\",\"\",DATOS!V67)","v":""}]
[{"$f":"IF(DATOS!R68=\"\",\"\",DATOS!R68)","v":""},{"$f":"IF(DATOS!AG68=\"\",\"\",DATOS!AG68)","v":""},{"$f":"IF(DATOS!V68=\"\",\"\",DATOS!V68)","v":""}]
[{"$f":"IF(DATOS!R69=\"\",\"\",DATOS!R69)","v":""},{"$f":"IF(DATOS!AG69=\"\",\"\",DATOS!AG69)","v":""},{"$f":"IF(DATOS!V69=\"\",\"\",DATOS!V69)","v":""}]
[{"$f":"IF(DATOS!R70=\"\",\"\",DATOS!R70)","v":""},{"$f":"IF(DATOS!AG70=\"\",\"\",DATOS!AG70)","v":""},{"$f":"IF(DATOS!V70=\"\",\"\",DATOS!V70)","v":""}]
[{"$f":"IF(DATOS!R71=\"\",\"\",DATOS!R71)","v":""},{"$f":"IF(DATOS!AG71=\"\",\"\",DATOS!AG71)","v":""},{"$f":"IF(DATOS!V71=\"\",\"\",DATOS!V71)","v":""}]
[{"$f":"IF(DATOS!R72=\"\",\"\",DATOS!R72)","v":""},{"$f":"IF(DATOS!AG72=\"\",\"\",DATOS!AG72)","v":""},{"$f":"IF(DATOS!V72=\"\",\"\",DATOS!V72)","v":""}]
[{"$f":"IF(DATOS!R73=\"\",\"\",DATOS!R73)","v":""},{"$f":"IF(DATOS!AG73=\"\",\"\",DATOS!AG73)","v":""},{"$f":"IF(DATOS!V73=\"\",\"\",DATOS!V73)","v":""}]
[{"$f":"IF(DATOS!R74=\"\",\"\",DATOS!R74)","v":""},{"$f":"IF(DATOS!AG74=\"\",\"\",DATOS!AG74)","v":""},{"$f":"IF(DATOS!V74=\"\",\"\",DATOS!V74)","v":""}]
[{"$f":"IF(DATOS!R75=\"\",\"\",DATOS!R75)","v":""},{"$f":"IF(DATOS!AG75=\"\",\"\",DATOS!AG75)","v":""},{"$f":"IF(DATOS!V75=\"\",\"\",DATOS!V75)","v":""}]
[{"$f":"IF(DATOS!R76=\"\",\"\",DATOS!R76)","v":""},{"$f":"IF(DATOS!AG76=\"\",\"\",DATOS!AG76)","v":""},{"$f":"IF(DATOS!V76=\"\",\"\",DATOS!V76)","v":""}]
[{"$f":"IF(DATOS!R77=\"\",\"\",DATOS!R77)","v":""},{"$f":"IF(DATOS!AG77=\"\",\"\",DATOS!AG77)","v":""},{"$f":"IF(DATOS!V77=\"\",\"\",DATOS!V77)","v":""}]
[{"$f":"IF(DATOS!R78=\"\",\"\",DATOS!R78)","v":""},{"$f":"IF(DATOS!AG78=\"\",\"\",DATOS!AG78)","v":""},{"$f":"IF(DATOS!V78=\"\",\"\",DATOS!V78)","v":""}]
[{"$f":"IF(DATOS!R79=\"\",\"\",DATOS!R79)","v":""},{"$f":"IF(DATOS!AG79=\"\",\"\",DATOS!AG79)","v":""},{"$f":"IF(DATOS!V79=\"\",\"\",DATOS!V79)","v":""}]
[{"$f":"IF(DATOS!R80=\"\",\"\",DATOS!R80)","v":""},{"$f":"IF(DATOS!AG80=\"\",\"\",DATOS!AG80)","v":""},{"$f":"IF(DATOS!V80=\"\",\"\",DATOS!V80)","v":""}]
[{"$f":"IF(DATOS!R81=\"\",\"\",DATOS!R81)","v":""},{"$f":"IF(DATOS!AG81=\"\",\"\",DATOS!AG81)","v":""},{"$f":"IF(DATOS!V81=\"\",\"\",DATOS!V81)","v":""}]
[{"$f":"IF(DATOS!R82=\"\",\"\",DATOS!R82)","v":""},{"$f":"IF(DATOS!AG82=\"\",\"\",DATOS!AG82)","v":""},{"$f":"IF(DATOS!V82=\"\",\"\",DATOS!V82)","v":""}]
[{"$f":"IF(DATOS!R83=\"\",\"\",DATOS!R83)","v":""},{"$f":"IF(DATOS!AG83=\"\",\"\",DATOS!AG83)","v":""},{"$f":"IF(DATOS!V83=\"\",\"\",DATOS!V83)","v":""}]
[{"$f":"IF(DATOS!R84=\"\",\"\",DATOS!R84)","v":""},{"$f":"IF(DATOS!AG84=\"\",\"\",DATOS!AG84)","v":""},{"$f":"IF(DATOS!V84=\"\",\"\",DATOS!V84)","v":""}]
[{"$f":"IF(DATOS!R85=\"\",\"\",DATOS!R85)","v":""},{"$f":"IF(DATOS!AG85=\"\",\"\",DATOS!AG85)","v":""},{"$f":"IF(DATOS!V85=\"\",\"\",DATOS!V85)","v":""}]
[{"$f":"IF(DATOS!R86=\"\",\"\",DATOS!R86)","v":""},{"$f":"IF(DATOS!AG86=\"\",\"\",DATOS!AG86)","v":""},{"$f":"IF(DATOS!V86=\"\",\"\",DATOS!V86)","v":""}]
[{"$f":"IF(DATOS!R87=\"\",\"\",DATOS!R87)","v":""},{"$f":"IF(DATOS!AG87=\"\",\"\",DATOS!AG87)","v":""},{"$f":"IF(DATOS!V87=\"\",\"\",DATOS!V87)","v":""}]
[{"$f":"IF(DATOS!R88=\"\",\"\",DATOS!R88)","v":""},{"$f":"IF(DATOS!AG88=\"\",\"\",DATOS!AG88)","v":""},{"$f":"IF(DATOS!V88=\"\",\"\",DATOS!V88)","v":""}]
[{"$f":"IF(DATOS!R89=\"\",\"\",DATOS!R89)","v":""},{"$f":"IF(DATOS!AG89=\"\",\"\",DATOS!AG89)","v":""},{"$f":"IF(DATOS!V89=\"\",\"\",DATOS!V89)","v":""}]
[{"$f":"IF(DATOS!R90=\"\",\"\",DATOS!R90)","v":""},{"$f":"IF(DATOS!AG90=\"\",\"\",DATOS!AG90)","v":""},{"$f":"IF(DATOS!V90=\"\",\"\",DATOS!V90)","v":""}]
[{"$f":"IF(DATOS!R91=\"\",\"\",DATOS!R91)","v":""},{"$f":"IF(DATOS!AG91=\"\",\"\",DATOS!AG91)","v":""},{"$f":"IF(DATOS!V91=\"\",\"\",DATOS!V91)","v":""}]
[{"$f":"IF(DATOS!R92=\"\",\"\",DATOS!R92)","v":""},{"$f":"IF(DATOS!AG92=\"\",\"\",DATOS!AG92)","v":""},{"$f":"IF(DATOS!V92=\"\",\"\",DATOS!V92)","v":""}]
[{"$f":"IF(DATOS!R93=\"\",\"\",DATOS!R93)","v":""},{"$f":"IF(DATOS!AG93=\"\",\"\",DATOS!AG93)","v":""},{"$f":"IF(DATOS!V93=\"\",\"\",DATOS!V93)","v":""}]
[{"$f":"IF(DATOS!R94=\"\",\"\",DATOS!R94)","v":""},{"$f":"IF(DATOS!AG94=\"\",\"\",DATOS!AG94)","v":""},{"$f":"IF(DATOS!V94=\"\",\"\",DATOS!V94)","v":""}]
[{"$f":"IF(DATOS!R95=\"\",\"\",DATOS!R95)","v":""},{"$f":"IF(DATOS!AG95=\"\",\"\",DATOS!AG95)","v":""},{"$f":"IF(DATOS!V95=\"\",\"\",DATOS!V95)","v":""}]
[{"$f":"IF(DATOS!R96=\"\",\"\",DATOS!R96)","v":""},{"$f":"IF(DATOS!AG96=\"\",\"\",DATOS!AG96)","v":""},{"$f":"IF(DATOS!V96=\"\",\"\",DATOS!V96)","v":""}]
[{"$f":"IF(DATOS!R97=\"\",\"\",DATOS!R97)","v":""},{"$f":"IF(DATOS!AG97=\"\",\"\",DATOS!AG97)","v":""},{"$f":"IF(DATOS!V97=\"\",\"\",DATOS!V97)","v":""}]
[{"$f":"IF(DATOS!R98=\"\",\"\",DATOS!R98)","v":""},{"$f":"IF(DATOS!AG98=\"\",\"\",DATOS!AG98)","v":""},{"$f":"IF(DATOS!V98=\"\",\"\",DATOS!V98)","v":""}]
[{"$f":"IF(DATOS!R99=\"\",\"\",DATOS!R99)","v":""},{"$f":"IF(DATOS!AG99=\"\",\"\",DATOS!AG99)","v":""},{"$f":"IF(DATOS!V99=\"\",\"\",DATOS!V99)","v":""}]
[{"$f":"IF(DATOS!R100=\"\",\"\",DATOS!R100)","v":""},{"$f":"IF(DATOS!AG100=\"\",\"\",DATOS!AG100)","v":""},{"$f":"IF(DATOS!V100=\"\",\"\",DATOS!V100)","v":""}]
[{"$f":"IF(DATOS!R101=\"\",\"\",DATOS!R101)","v":""},{"$f":"IF(DATOS!AG101=\"\",\"\",DATOS!AG101)","v":""},{"$f":"IF(DATOS!V101=\"\",\"\",DATOS!V101)","v":""}]
[{"$f":"IF(DATOS!R102=\"\",\"\",DATOS!R102)","v":""},{"$f":"IF(DATOS!AG102=\"\",\"\",DATOS!AG102)","v":""},{"$f":"IF(DATOS!V102=\"\",\"\",DATOS!V102)","v":""}]
[{"$f":"IF(DATOS!R103=\"\",\"\",DATOS!R103)","v":""},{"$f":"IF(DATOS!AG103=\"\",\"\",DATOS!AG103)","v":""},{"$f":"IF(DATOS!V103=\"\",\"\",DATOS!V103)","v":""}]
[{"$f":"IF(DATOS!R104=\"\",\"\",DATOS!R104)","v":""},{"$f":"IF(DATOS!AG104=\"\",\"\",DATOS!AG104)","v":""},{"$f":"IF(DATOS!V104=\"\",\"\",DATOS!V104)","v":""}]
[{"$f":"IF(DATOS!R105=\"\",\"\",DATOS!R105)","v":""},{"$f":"IF(DATOS!AG105=\"\",\"\",DATOS!AG105)","v":""},{"$f":"IF(DATOS!V105=\"\",\"\",DATOS!V105)","v":""}]
[{"$f":"IF(DATOS!R106=\"\",\"\",DATOS!R106)","v":""},{"$f":"IF(DATOS!AG106=\"\",\"\",DATOS!AG106)","v":""},{"$f":"IF(DATOS!V106=\"\",\"\",DATOS!V106)","v":""}]
[{"$f":"IF(DATOS!R107=\"\",\"\",DATOS!R107)","v":""},{"$f":"IF(DATOS!AG107=\"\",\"\",DATOS!AG107)","v":""},{"$f":"IF(DATOS!V107=\"\",\"\",DATOS!V107)","v":""}]
[{"$f":"IF(DATOS!R108=\"\",\"\",DATOS!R108)","v":""},{"$f":"IF(DATOS!AG108=\"\",\"\",DATOS!AG108)","v":""},{"$f":"IF(DATOS!V108=\"\",\"\",DATOS!V108)","v":""}]
[{"$f":"IF(DATOS!R109=\"\",\"\",DATOS!R109)","v":""},{"$f":"IF(DATOS!AG109=\"\",\"\",DATOS!AG109)","v":""},{"$f":"IF(DATOS!V109=\"\",\"\",DATOS!V109)","v":""}]
[{"$f":"IF(DATOS!R110=\"\",\"\",DATOS!R110)","v":""},{"$f":"IF(DATOS!AG110=\"\",\"\",DATOS!AG110)","v":""},{"$f":"IF(DATOS!V110=\"\",\"\",DATOS!V110)","v":""}]
[{"$f":"IF(DATOS!R111=\"\",\"\",DATOS!R111)","v":""},{"$f":"IF(DATOS!AG111=\"\",\"\",DATOS!AG111)","v":""},{"$f":"IF(DATOS!V111=\"\",\"\",DATOS!V111)","v":""}]
[{"$f":"IF(DATOS!R112=\"\",\"\",DATOS!R112)","v":""},{"$f":"IF(DATOS!AG112=\"\",\"\",DATOS!AG112)","v":""},{"$f":"IF(DATOS!V112=\"\",\"\",DATOS!V112)","v":""}]
[{"$f":"IF(DATOS!R113=\"\",\"\",DATOS!R113)","v":""},{"$f":"IF(DATOS!AG113=\"\",\"\",DATOS!AG113)","v":""},{"$f":"IF(DATOS!V113=\"\",\"\",DATOS!V113)","v":""}]
[{"$f":"IF(DATOS!R114=\"\",\"\",DATOS!R114)","v":""},{"$f":"IF(DATOS!AG114=\"\",\"\",DATOS!AG114)","v":""},{"$f":"IF(DATOS!V114=\"\",\"\",DATOS!V114)","v":""}]
[{"$f":"IF(DATOS!R115=\"\",\"\",DATOS!R115)","v":""},{"$f":"IF(DATOS!AG115=\"\",\"\",DATOS!AG115)","v":""},{"$f":"IF(DATOS!V115=\"\",\"\",DATOS!V115)","v":""}]
[{"$f":"IF(DATOS!R116=\"\",\"\",DATOS!R116)","v":""},{"$f":"IF(DATOS!AG116=\"\",\"\",DATOS!AG116)","v":""},{"$f":"IF(DATOS!V116=\"\",\"\",DATOS!V116)","v":""}]
[{"$f":"IF(DATOS!R117=\"\",\"\",DATOS!R117)","v":""},{"$f":"IF(DATOS!AG117=\"\",\"\",DATOS!AG117)","v":""},{"$f":"IF(DATOS!V117=\"\",\"\",DATOS!V117)","v":""}]
[{"$f":"IF(DATOS!R118=\"\",\"\",DATOS!R118)","v":""},{"$f":"IF(DATOS!AG118=\"\",\"\",DATOS!AG118)","v":""},{"$f":"IF(DATOS!V118=\"\",\"\",DATOS!V118)","v":""}]
[{"$f":"IF(DATOS!R119=\"\",\"\",DATOS!R119)","v":""},{"$f":"IF(DATOS!AG119=\"\",\"\",DATOS!AG119)","v":""},{"$f":"IF(DATOS!V119=\"\",\"\",DATOS!V119)","v":""}]
[{"$f":"IF(DATOS!R120=\"\",\"\",DATOS!R120)","v":""},{"$f":"IF(DATOS!AG120=\"\",\"\",DATOS!AG120)","v":""},{"$f":"IF(DATOS!V120=\"\",\"\",DATOS!V120)","v":""}]
[{"$f":"IF(DATOS!R121=\"\",\"\",DATOS!R121)","v":""},{"$f":"IF(DATOS!AG121=\"\",\"\",DATOS!AG121)","v":""},{"$f":"IF(DATOS!V121=\"\",\"\",DATOS!V121)","v":""}]
[{"$f":"IF(DATOS!R122=\"\",\"\",DATOS!R122)","v":""},{"$f":"IF(DATOS!AG122=\"\",\"\",DATOS!AG122)","v":""},{"$f":"IF(DATOS!V122=\"\",\"\",DATOS!V122)","v":""}]
[{"$f":"IF(DATOS!R123=\"\",\"\",DATOS!R123)","v":""},{"$f":"IF(DATOS!AG123=\"\",\"\",DATOS!AG123)","v":""},{"$f":"IF(DATOS!V123=\"\",\"\",DATOS!V123)","v":""}]
[{"$f":"IF(DATOS!R124=\"\",\"\",DATOS!R124)","v":""},{"$f":"IF(DATOS!AG124=\"\",\"\",DATOS!AG124)","v":""},{"$f":"IF(DATOS!V124=\"\",\"\",DATOS!V124)","v":""}]
[{"$f":"IF(DATOS!R125=\"\",\"\",DATOS!R125)","v":""},{"$f":"IF(DATOS!AG125=\"\",\"\",DATOS!AG125)","v":""},{"$f":"IF(DATOS!V125=\"\",\"\",DATOS!V125)","v":""}]
[{"$f":"IF(DATOS!R126=\"\",\"\",DATOS!R126)","v":""},{"$f":"IF(DATOS!AG126=\"\",\"\",DATOS!AG126)","v":""},{"$f":"IF(DATOS!V126=\"\",\"\",DATOS!V126)","v":""}]
[{"$f":"IF(DATOS!R127=\"\",\"\",DATOS!R127)","v":""},{"$f":"IF(DATOS!AG127=\"\",\"\",DATOS!AG127)","v":""},{"$f":"IF(DATOS!V127=\"\",\"\",DATOS!V127)","v":""}]
[{"$f":"IF(DATOS!R128=\"\",\"\",DATOS!R128)","v":""},{"$f":"IF(DATOS!AG128=\"\",\"\",DATOS!AG128)","v":""},{"$f":"IF(DATOS!V128=\"\",\"\",DATOS!V128)","v":""}]
[{"$f":"IF(DATOS!R129=\"\",\"\",DATOS!R129)","v":""},{"$f":"IF(DATOS!AG129=\"\",\"\",DATOS!AG129)","v":""},{"$f":"IF(DATOS!V129=\"\",\"\",DATOS!V129)","v":""}]
[{"$f":"IF(DATOS!R130=\"\",\"\",DATOS!R130)","v":""},{"$f":"IF(DATOS!AG130=\"\",\"\",DATOS!AG130)","v":""},{"$f":"IF(DATOS!V130=\"\",\"\",DATOS!V130)","v":""}]
[{"$f":"IF(DATOS!R131=\"\",\"\",DATOS!R131)","v":""},{"$f":"IF(DATOS!AG131=\"\",\"\",DATOS!AG131)","v":""},{"$f":"IF(DATOS!V131=\"\",\"\",DATOS!V131)","v":""}]
[{"$f":"IF(DATOS!R132=\"\",\"\",DATOS!R132)","v":""},{"$f":"IF(DATOS!AG132=\"\",\"\",DATOS!AG132)","v":""},{"$f":"IF(DATOS!V132=\"\",\"\",DATOS!V132)","v":""}]
[{"$f":"IF(DATOS!R133=\"\",\"\",DATOS!R133)","v":""},{"$f":"IF(DATOS!AG133=\"\",\"\",DATOS!AG133)","v":""},{"$f":"IF(DATOS!V133=\"\",\"\",DATOS!V133)","v":""}]
[{"$f":"IF(DATOS!R134=\"\",\"\",DATOS!R134)","v":""},{"$f":"IF(DATOS!AG134=\"\",\"\",DATOS!AG134)","v":""},{"$f":"IF(DATOS!V134=\"\",\"\",DATOS!V134)","v":""}]
[{"$f":"IF(DATOS!R135=\"\",\"\",DATOS!R135)","v":""},{"$f":"IF(DATOS!AG135=\"\",\"\",DATOS!AG135)","v":""},{"$f":"IF(DATOS!V135=\"\",\"\",DATOS!V135)","v":""}]
[{"$f":"IF(DATOS!R136=\"\",\"\",DATOS!R136)","v":""},{"$f":"IF(DATOS!AG136=\"\",\"\",DATOS!AG136)","v":""},{"$f":"IF(DATOS!V136=\"\",\"\",DATOS!V136)","v":""}]
[{"$f":"IF(DATOS!R137=\"\",\"\",DATOS!R137)","v":""},{"$f":"IF(DATOS!AG137=\"\",\"\",DATOS!AG137)","v":""},{"$f":"IF(DATOS!V137=\"\",\"\",DATOS!V137)","v":""}]
[{"$f":"IF(DATOS!R138=\"\",\"\",DATOS!R138)","v":""},{"$f":"IF(DATOS!AG138=\"\",\"\",DATOS!AG138)","v":""},{"$f":"IF(DATOS!V138=\"\",\"\",DATOS!V138)","v":""}]
[{"$f":"IF(DATOS!R139=\"\",\"\",DATOS!R139)","v":""},{"$f":"IF(DATOS!AG139=\"\",\"\",DATOS!AG139)","v":""},{"$f":"IF(DATOS!V139=\"\",\"\",DATOS!V139)","v":""}]
[{"$f":"IF(DATOS!R140=\"\",\"\",DATOS!R140)","v":""},{"$f":"IF(DATOS!AG140=\"\",\"\",DATOS!AG140)","v":""},{"$f":"IF(DATOS!V140=\"\",\"\",DATOS!V140)","v":""}]
[{"$f":"IF(DATOS!R141=\"\",\"\",DATOS!R141)","v":""},{"$f":"IF(DATOS!AG141=\"\",\"\",DATOS!AG141)","v":""},{"$f":"IF(DATOS!V141=\"\",\"\",DATOS!V141)","v":""}]
[{"$f":"IF(DATOS!R142=\"\",\"\",DATOS!R142)","v":""},{"$f":"IF(DATOS!AG142=\"\",\"\",DATOS!AG142)","v":""},{"$f":"IF(DATOS!V142=\"\",\"\",DATOS!V142)","v":""}]
[{"$f":"IF(DATOS!R143=\"\",\"\",DATOS!R143)","v":""},{"$f":"IF(DATOS!AG143=\"\",\"\",DATOS!AG143)","v":""},{"$f":"IF(DATOS!V143=\"\",\"\",DATOS!V143)","v":""}]
[{"$f":"IF(DATOS!R144=\"\",\"\",DATOS!R144)","v":""},{"$f":"IF(DATOS!AG144=\"\",\"\",DATOS!AG144)","v":""},{"$f":"IF(DATOS!V144=\"\",\"\",DATOS!V144)","v":""}]
[{"$f":"IF(DATOS!R145=\"\",\"\",DATOS!R145)","v":""},{"$f":"IF(DATOS!AG145=\"\",\"\",DATOS!AG145)","v":""},{"$f":"IF(DATOS!V145=\"\",\"\",DATOS!V145)","v":""}]
[{"$f":"IF(DATOS!R146=\"\",\"\",DATOS!R146)","v":""},{"$f":"IF(DATOS!AG146=\"\",\"\",DATOS!AG146)","v":""},{"$f":"IF(DATOS!V146=\"\",\"\",DATOS!V146)","v":""}]
[{"$f":"IF(DATOS!R147=\"\",\"\",DATOS!R147)","v":""},{"$f":"IF(DATOS!AG147=\"\",\"\",DATOS!AG147)","v":""},{"$f":"IF(DATOS!V147=\"\",\"\",DATOS!V147)","v":""}]
[{"$f":"IF(DATOS!R148=\"\",\"\",DATOS!R148)","v":""},{"$f":"IF(DATOS!AG148=\"\",\"\",DATOS!AG148)","v":""},{"$f":"IF(DATOS!V148=\"\",\"\",DATOS!V148)","v":""}]
[{"$f":"IF(DATOS!R149=\"\",\"\",DATOS!R149)","v":""},{"$f":"IF(DATOS!AG149=\"\",\"\",DATOS!AG149)","v":""},{"$f":"IF(DATOS!V149=\"\",\"\",DATOS!V149)","v":""}]
[{"$f":"IF(DATOS!R150=\"\",\"\",DATOS!R150)","v":""},{"$f":"IF(DATOS!AG150=\"\",\"\",DATOS!AG150)","v":""},{"$f":"IF(DATOS!V150=\"\",\"\",DATOS!V150)","v":""}]
[{"$f":"IF(DATOS!R151=\"\",\"\",DATOS!R151)","v":""},{"$f":"IF(DATOS!AG151=\"\",\"\",DATOS!AG151)","v":""},{"$f":"IF(DATOS!V151=\"\",\"\",DATOS!V151)","v":""}]
[{"$f":"IF(DATOS!R152=\"\",\"\",DATOS!R152)","v":""},{"$f":"IF(DATOS!AG152=\"\",\"\",DATOS!AG152)","v":""},{"$f":"IF(DATOS!V152=\"\",\"\",DATOS!V152)","v":""}]
[{"$f":"IF(DATOS!R153=\"\",\"\",DATOS!R153)","v":""},{"$f":"IF(DATOS!AG153=\"\",\"\",DATOS!AG153)","v":""},{"$f":"IF(DATOS!V153=\"\",\"\",DATOS!V153)","v":""}]
[{"$f":"IF(DATOS!R154=\"\",\"\",DATOS!R154)","v":""},{"$f":"IF(DATOS!AG154=\"\",\"\",DATOS!AG154)","v":""},{"$f":"IF(DATOS!V154=\"\",\"\",DATOS!V154)","v":""}]
[{"$f":"IF(DATOS!R155=\"\",\"\",DATOS!R155)","v":""},{"$f":"IF(DATOS!AG155=\"\",\"\",DATOS!AG155)","v":""},{"$f":"IF(DATOS!V155=\"\",\"\",DATOS!V155)","v":""}]
[{"$f":"IF(DATOS!R156=\"\",\"\",DATOS!R156)","v":""},{"$f":"IF(DATOS!AG156=\"\",\"\",DATOS!AG156)","v":""},{"$f":"IF(DATOS!V156=\"\",\"\",DATOS!V156)","v":""}]
[{"$f":"IF(DATOS!R157=\"\",\"\",DATOS!R157)","v":""},{"$f":"IF(DATOS!AG157=\"\",\"\",DATOS!AG157)","v":""},{"$f":"IF(DATOS!V157=\"\",\"\",DATOS!V157)","v":""}]
[{"$f":"IF(DATOS!R158=\"\",\"\",DATOS!R158)","v":""},{"$f":"IF(DATOS!AG158=\"\",\"\",DATOS!AG158)","v":""},{"$f":"IF(DATOS!V158=\"\",\"\",DATOS!V158)","v":""}]
[{"$f":"IF(DATOS!R159=\"\",\"\",DATOS!R159)","v":""},{"$f":"IF(DATOS!AG159=\"\",\"\",DATOS!AG159)","v":""},{"$f":"IF(DATOS!V159=\"\",\"\",DATOS!V159)","v":""}]
[{"$f":"IF(DATOS!R160=\"\",\"\",DATOS!R160)","v":""},{"$f":"IF(DATOS!AG160=\"\",\"\",DATOS!AG160)","v":""},{"$f":"IF(DATOS!V160=\"\",\"\",DATOS!V160)","v":""}]
[{"$f":"IF(DATOS!R161=\"\",\"\",DATOS!R161)","v":""},{"$f":"IF(DATOS!AG161=\"\",\"\",DATOS!AG161)","v":""},{"$f":"IF(DATOS!V161=\"\",\"\",DATOS!V161)","v":""}]
[{"$f":"IF(DATOS!R162=\"\",\"\",DATOS!R162)","v":""},{"$f":"IF(DATOS!AG162=\"\",\"\",DATOS!AG162)","v":""},{"$f":"IF(DATOS!V162=\"\",\"\",DATOS!V162)","v":""}]
[{"$f":"IF(DATOS!R163=\"\",\"\",DATOS!R163)","v":""},{"$f":"IF(DATOS!AG163=\"\",\"\",DATOS!AG163)","v":""},{"$f":"IF(DATOS!V163=\"\",\"\",DATOS!V163)","v":""}]
[{"$f":"IF(DATOS!R164=\"\",\"\",DATOS!R164)","v":""},{"$f":"IF(DATOS!AG164=\"\",\"\",DATOS!AG164)","v":""},{"$f":"IF(DATOS!V164=\"\",\"\",DATOS!V164)","v":""}]
[{"$f":"IF(DATOS!R165=\"\",\"\",DATOS!R165)","v":""},{"$f":"IF(DATOS!AG165=\"\",\"\",DATOS!AG165)","v":""},{"$f":"IF(DATOS!V165=\"\",\"\",DATOS!V165)","v":""}]
[{"$f":"IF(DATOS!R166=\"\",\"\",DATOS!R166)","v":""},{"$f":"IF(DATOS!AG166=\"\",\"\",DATOS!AG166)","v":""},{"$f":"IF(DATOS!V166=\"\",\"\",DATOS!V166)","v":""}]
[{"$f":"IF(DATOS!R167=\"\",\"\",DATOS!R167)","v":""},{"$f":"IF(DATOS!AG167=\"\",\"\",DATOS!AG167)","v":""},{"$f":"IF(DATOS!V167=\"\",\"\",DATOS!V167)","v":""}]
[{"$f":"IF(DATOS!R168=\"\",\"\",DATOS!R168)","v":""},{"$f":"IF(DATOS!AG168=\"\",\"\",DATOS!AG168)","v":""},{"$f":"IF(DATOS!V168=\"\",\"\",DATOS!V168)","v":""}]
[{"$f":"IF(DATOS!R169=\"\",\"\",DATOS!R169)","v":""},{"$f":"IF(DATOS!AG169=\"\",\"\",DATOS!AG169)","v":""},{"$f":"IF(DATOS!V169=\"\",\"\",DATOS!V169)","v":""}]
[{"$f":"IF(DATOS!R170=\"\",\"\",DATOS!R170)","v":""},{"$f":"IF(DATOS!AG170=\"\",\"\",DATOS!AG170)","v":""},{"$f":"IF(DATOS!V170=\"\",\"\",DATOS!V170)","v":""}]
[{"$f":"IF(DATOS!R171=\"\",\"\",DATOS!R171)","v":""},{"$f":"IF(DATOS!AG171=\"\",\"\",DATOS!AG171)","v":""},{"$f":"IF(DATOS!V171=\"\",\"\",DATOS!V171)","v":""}]
[{"$f":"IF(DATOS!R172=\"\",\"\",DATOS!R172)","v":""},{"$f":"IF(DATOS!AG172=\"\",\"\",DATOS!AG172)","v":""},{"$f":"IF(DATOS!V172=\"\",\"\",DATOS!V172)","v":""}]
[{"$f":"IF(DATOS!R173=\"\",\"\",DATOS!R173)","v":""},{"$f":"IF(DATOS!AG173=\"\",\"\",DATOS!AG173)","v":""},{"$f":"IF(DATOS!V173=\"\",\"\",DATOS!V173)","v":""}]
[{"$f":"IF(DATOS!R174=\"\",\"\",DATOS!R174)","v":""},{"$f":"IF(DATOS!AG174=\"\",\"\",DATOS!AG174)","v":""},{"$f":"IF(DATOS!V174=\"\",\"\",DATOS!V174)","v":""}]
[{"$f":"IF(DATOS!R175=\"\",\"\",DATOS!R175)","v":""},{"$f":"IF(DATOS!AG175=\"\",\"\",DATOS!AG175)","v":""},{"$f":"IF(DATOS!V175=\"\",\"\",DATOS!V175)","v":""}]
[{"$f":"IF(DATOS!R176=\"\",\"\",DATOS!R176)","v":""},{"$f":"IF(DATOS!AG176=\"\",\"\",DATOS!AG176)","v":""},{"$f":"IF(DATOS!V176=\"\",\"\",DATOS!V176)","v":""}]
[{"$f":"IF(DATOS!R177=\"\",\"\",DATOS!R177)","v":""},{"$f":"IF(DATOS!AG177=\"\",\"\",DATOS!AG177)","v":""},{"$f":"IF(DATOS!V177=\"\",\"\",DATOS!V177)","v":""}]
[{"$f":"IF(DATOS!R178=\"\",\"\",DATOS!R178)","v":""},{"$f":"IF(DATOS!AG178=\"\",\"\",DATOS!AG178)","v":""},{"$f":"IF(DATOS!V178=\"\",\"\",DATOS!V178)","v":""}]
[{"$f":"IF(DATOS!R179=\"\",\"\",DATOS!R179)","v":""},{"$f":"IF(DATOS!AG179=\"\",\"\",DATOS!AG179)","v":""},{"$f":"IF(DATOS!V179=\"\",\"\",DATOS!V179)","v":""}]
[{"$f":"IF(DATOS!R180=\"\",\"\",DATOS!R180)","v":""},{"$f":"IF(DATOS!AG180=\"\",\"\",DATOS!AG180)","v":""},{"$f":"IF(DATOS!V180=\"\",\"\",DATOS!V180)","v":""}]
[{"$f":"IF(DATOS!R181=\"\",\"\",DATOS!R181)","v":""},{"$f":"IF(DATOS!AG181=\"\",\"\",DATOS!AG181)","v":""},{"$f":"IF(DATOS!V181=\"\",\"\",DATOS!V181)","v":""}]
[{"$f":"IF(DATOS!R182=\"\",\"\",DATOS!R182)","v":""},{"$f":"IF(DATOS!AG182=\"\",\"\",DATOS!AG182)","v":""},{"$f":"IF(DATOS!V182=\"\",\"\",DATOS!V182)","v":""}]
[{"$f":"IF(DATOS!R183=\"\",\"\",DATOS!R183)","v":""},{"$f":"IF(DATOS!AG183=\"\",\"\",DATOS!AG183)","v":""},{"$f":"IF(DATOS!V183=\"\",\"\",DATOS!V183)","v":""}]
[{"$f":"IF(DATOS!R184=\"\",\"\",DATOS!R184)","v":""},{"$f":"IF(DATOS!AG184=\"\",\"\",DATOS!AG184)","v":""},{"$f":"IF(DATOS!V184=\"\",\"\",DATOS!V184)","v":""}]
[{"$f":"IF(DATOS!R185=\"\",\"\",DATOS!R185)","v":""},{"$f":"IF(DATOS!AG185=\"\",\"\",DATOS!AG185)","v":""},{"$f":"IF(DATOS!V185=\"\",\"\",DATOS!V185)","v":""}]
[{"$f":"IF(DATOS!R186=\"\",\"\",DATOS!R186)","v":""},{"$f":"IF(DATOS!AG186=\"\",\"\",DATOS!AG186)","v":""},{"$f":"IF(DATOS!V186=\"\",\"\",DATOS!V186)","v":""}]
[{"$f":"IF(DATOS!R187=\"\",\"\",DATOS!R187)","v":""},{"$f":"IF(DATOS!AG187=\"\",\"\",DATOS!AG187)","v":""},{"$f":"IF(DATOS!V187=\"\",\"\",DATOS!V187)","v":""}]
[{"$f":"IF(DATOS!R188=\"\",\"\",DATOS!R188)","v":""},{"$f":"IF(DATOS!AG188=\"\",\"\",DATOS!AG188)","v":""},{"$f":"IF(DATOS!V188=\"\",\"\",DATOS!V188)","v":""}]
[{"$f":"IF(DATOS!R189=\"\",\"\",DATOS!R189)","v":""},{"$f":"IF(DATOS!AG189=\"\",\"\",DATOS!AG189)","v":""},{"$f":"IF(DATOS!V189=\"\",\"\",DATOS!V189)","v":""}]
[{"$f":"IF(DATOS!R190=\"\",\"\",DATOS!R190)","v":""},{"$f":"IF(DATOS!AG190=\"\",\"\",DATOS!AG190)","v":""},{"$f":"IF(DATOS!V190=\"\",\"\",DATOS!V190)","v":""}]
[{"$f":"IF(DATOS!R191=\"\",\"\",DATOS!R191)","v":""},{"$f":"IF(DATOS!AG191=\"\",\"\",DATOS!AG191)","v":""},{"$f":"IF(DATOS!V191=\"\",\"\",DATOS!V191)","v":""}]
[{"$f":"IF(DATOS!R192=\"\",\"\",DATOS!R192)","v":""},{"$f":"IF(DATOS!AG192=\"\",\"\",DATOS!AG192)","v":""},{"$f":"IF(DATOS!V192=\"\",\"\",DATOS!V192)","v":""}]
[{"$f":"IF(DATOS!R193=\"\",\"\",DATOS!R193)","v":""},{"$f":"IF(DATOS!AG193=\"\",\"\",DATOS!AG193)","v":""},{"$f":"IF(DATOS!V193=\"\",\"\",DATOS!V193)","v":""}]
[{"$f":"IF(DATOS!R194=\"\",\"\",DATOS!R194)","v":""},{"$f":"IF(DATOS!AG194=\"\",\"\",DATOS!AG194)","v":""},{"$f":"IF(DATOS!V194=\"\",\"\",DATOS!V194)","v":""}]
[{"$f":"IF(DATOS!R195=\"\",\"\",DATOS!R195)","v":""},{"$f":"IF(DATOS!AG195=\"\",\"\",DATOS!AG195)","v":""},{"$f":"IF(DATOS!V195=\"\",\"\",DATOS!V195)","v":""}]
[{"$f":"IF(DATOS!R196=\"\",\"\",DATOS!R196)","v":""},{"$f":"IF(DATOS!AG196=\"\",\"\",DATOS!AG196)","v":""},{"$f":"IF(DATOS!V196=\"\",\"\",DATOS!V196)","v":""}]
[{"$f":"IF(DATOS!R197=\"\",\"\",DATOS!R197)","v":""},{"$f":"IF(DATOS!AG197=\"\",\"\",DATOS!AG197)","v":""},{"$f":"IF(DATOS!V197=\"\",\"\",DATOS!V197)","v":""}]
[{"$f":"IF(DATOS!R198=\"\",\"\",DATOS!R198)","v":""},{"$f":"IF(DATOS!AG198=\"\",\"\",DATOS!AG198)","v":""},{"$f":"IF(DATOS!V198=\"\",\"\",DATOS!V198)","v":""}]
[{"$f":"IF(DATOS!R199=\"\",\"\",DATOS!R199)","v":""},{"$f":"IF(DATOS!AG199=\"\",\"\",DATOS!AG199)","v":""},{"$f":"IF(DATOS!V199=\"\",\"\",DATOS!V199)","v":""}]
[{"$f":"IF(DATOS!R200=\"\",\"\",DATOS!R200)","v":""},{"$f":"IF(DATOS!AG200=\"\",\"\",DATOS!AG200)","v":""},{"$f":"IF(DATOS!V200=\"\",\"\",DATOS!V200)","v":""}]
[{"$f":"IF(DATOS!R201=\"\",\"\",DATOS!R201)","v":""},{"$f":"IF(DATOS!AG201=\"\",\"\",DATOS!AG201)","v":""},{"$f":"IF(DATOS!V201=\"\",\"\",DATOS!V201)","v":""}]
[{"$f":"IF(DATOS!R202=\"\",\"\",DATOS!R202)","v":""},{"$f":"IF(DATOS!AG202=\"\",\"\",DATOS!AG202)","v":""},{"$f":"IF(DATOS!V202=\"\",\"\",DATOS!V202)","v":""}]
[{"$f":"IF(DATOS!R203=\"\",\"\",DATOS!R203)","v":""},{"$f":"IF(DATOS!AG203=\"\",\"\",DATOS!AG203)","v":""},{"$f":"IF(DATOS!V203=\"\",\"\",DATOS!V203)","v":""}]
[{"$f":"IF(DATOS!R204=\"\",\"\",DATOS!R204)","v":""},{"$f":"IF(DATOS!AG204=\"\",\"\",DATOS!AG204)","v":""},{"$f":"IF(DATOS!V204=\"\",\"\",DATOS!V204)","v":""}]
[{"$f":"IF(DATOS!R205=\"\",\"\",DATOS!R205)","v":""},{"$f":"IF(DATOS!AG205=\"\",\"\",DATOS!AG205)","v":""},{"$f":"IF(DATOS!V205=\"\",\"\",DATOS!V205)","v":""}]
[{"$f":"IF(DATOS!R206=\"\",\"\",DATOS!R206)","v":""},{"$f":"IF(DATOS!AG206=\"\",\"\",DATOS!AG206)","v":""},{"$f":"IF(DATOS!V206=\"\",\"\",DATOS!V206)","v":""}]
[{"$f":"IF(DATOS!R207=\"\",\"\",DATOS!R207)","v":""},{"$f":"IF(DATOS!AG207=\"\",\"\",DATOS!AG207)","v":""},{"$f":"IF(DATOS!V207=\"\",\"\",DATOS!V207)","v":""}]
[{"$f":"IF(DATOS!R208=\"\",\"\",DATOS!R208)","v":""},{"$f":"IF(DATOS!AG208=\"\",\"\",DATOS!AG208)","v":""},{"$f":"IF(DATOS!V208=\"\",\"\",DATOS!V208)","v":""}]
[{"$f":"IF(DATOS!R209=\"\",\"\",DATOS!R209)","v":""},{"$f":"IF(DATOS!AG209=\"\",\"\",DATOS!AG209)","v":""},{"$f":"IF(DATOS!V209=\"\",\"\",DATOS!V209)","v":""}]
[{"$f":"IF(DATOS!R210=\"\",\"\",DATOS!R210)","v":""},{"$f":"IF(DATOS!AG210=\"\",\"\",DATOS!AG210)","v":""},{"$f":"IF(DATOS!V210=\"\",\"\",DATOS!V210)","v":""}]
[{"$f":"IF(DATOS!R211=\"\",\"\",DATOS!R211)","v":""},{"$f":"IF(DATOS!AG211=\"\",\"\",DATOS!AG211)","v":""},{"$f":"IF(DATOS!V211=\"\",\"\",DATOS!V211)","v":""}]
[{"$f":"IF(DATOS!R212=\"\",\"\",DATOS!R212)","v":""},{"$f":"IF(DATOS!AG212=\"\",\"\",DATOS!AG212)","v":""},{"$f":"IF(DATOS!V212=\"\",\"\",DATOS!V212)","v":""}]
[{"$f":"IF(DATOS!R213=\"\",\"\",DATOS!R213)","v":""},{"$f":"IF(DATOS!AG213=\"\",\"\",DATOS!AG213)","v":""},{"$f":"IF(DATOS!V213=\"\",\"\",DATOS!V213)","v":""}]
[{"$f":"IF(DATOS!R214=\"\",\"\",DATOS!R214)","v":""},{"$f":"IF(DATOS!AG214=\"\",\"\",DATOS!AG214)","v":""},{"$f":"IF(DATOS!V214=\"\",\"\",DATOS!V214)","v":""}]
[{"$f":"IF(DATOS!R215=\"\",\"\",DATOS!R215)","v":""},{"$f":"IF(DATOS!AG215=\"\",\"\",DATOS!AG215)","v":""},{"$f":"IF(DATOS!V215=\"\",\"\",DATOS!V215)","v":""}]
[{"$f":"IF(DATOS!R216=\"\",\"\",DATOS!R216)","v":""},{"$f":"IF(DATOS!AG216=\"\",\"\",DATOS!AG216)","v":""},{"$f":"IF(DATOS!V216=\"\",\"\",DATOS!V216)","v":""}]
[{"$f":"IF(DATOS!R217=\"\",\"\",DATOS!R217)","v":""},{"$f":"IF(DATOS!AG217=\"\",\"\",DATOS!AG217)","v":""},{"$f":"IF(DATOS!V217=\"\",\"\",DATOS!V217)","v":""}]
[{"$f":"IF(DATOS!R218=\"\",\"\",DATOS!R218)","v":""},{"$f":"IF(DATOS!AG218=\"\",\"\",DATOS!AG218)","v":""},{"$f":"IF(DATOS!V218=\"\",\"\",DATOS!V218)","v":""}]
[{"$f":"IF(DATOS!R219=\"\",\"\",DATOS!R219)","v":""},{"$f":"IF(DATOS!AG219=\"\",\"\",DATOS!AG219)","v":""},{"$f":"IF(DATOS!V219=\"\",\"\",DATOS!V219)","v":""}]
[{"$f":"IF(DATOS!R220=\"\",\"\",DATOS!R220)","v":""},{"$f":"IF(DATOS!AG220=\"\",\"\",DATOS!AG220)","v":""},{"$f":"IF(DATOS!V220=\"\",\"\",DATOS!V220)","v":""}]
[{"$f":"IF(DATOS!R221=\"\",\"\",DATOS!R221)","v":""},{"$f":"IF(DATOS!AG221=\"\",\"\",DATOS!AG221)","v":""},{"$f":"IF(DATOS!V221=\"\",\"\",DATOS!V221)","v":""}]
[{"$f":"IF(DATOS!R222=\"\",\"\",DATOS!R222)","v":""},{"$f":"IF(DATOS!AG222=\"\",\"\",DATOS!AG222)","v":""},{"$f":"IF(DATOS!V222=\"\",\"\",DATOS!V222)","v":""}]
[{"$f":"IF(DATOS!R223=\"\",\"\",DATOS!R223)","v":""},{"$f":"IF(DATOS!AG223=\"\",\"\",DATOS!AG223)","v":""},{"$f":"IF(DATOS!V223=\"\",\"\",DATOS!V223)","v":""}]
[{"$f":"IF(DATOS!R224=\"\",\"\",DATOS!R224)","v":""},{"$f":"IF(DATOS!AG224=\"\",\"\",DATOS!AG224)","v":""},{"$f":"IF(DATOS!V224=\"\",\"\",DATOS!V224)","v":""}]
[{"$f":"IF(DATOS!R225=\"\",\"\",DATOS!R225)","v":""},{"$f":"IF(DATOS!AG225=\"\",\"\",DATOS!AG225)","v":""},{"$f":"IF(DATOS!V225=\"\",\"\",DATOS!V225)","v":""}]
[{"$f":"IF(DATOS!R226=\"\",\"\",DATOS!R226)","v":""},{"$f":"IF(DATOS!AG226=\"\",\"\",DATOS!AG226)","v":""},{"$f":"IF(DATOS!V226=\"\",\"\",DATOS!V226)","v":""}]
[{"$f":"IF(DATOS!R227=\"\",\"\",DATOS!R227)","v":""},{"$f":"IF(DATOS!AG227=\"\",\"\",DATOS!AG227)","v":""},{"$f":"IF(DATOS!V227=\"\",\"\",DATOS!V227)","v":""}]
[{"$f":"IF(DATOS!R228=\"\",\"\",DATOS!R228)","v":""},{"$f":"IF(DATOS!AG228=\"\",\"\",DATOS!AG228)","v":""},{"$f":"IF(DATOS!V228=\"\",\"\",DATOS!V228)","v":""}]
[{"$f":"IF(DATOS!R229=\"\",\"\",DATOS!R229)","v":""},{"$f":"IF(DATOS!AG229=\"\",\"\",DATOS!AG229)","v":""},{"$f":"IF(DATOS!V229=\"\",\"\",DATOS!V229)","v":""}]
[{"$f":"IF(DATOS!R230=\"\",\"\",DATOS!R230)","v":""},{"$f":"IF(DATOS!AG230=\"\",\"\",DATOS!AG230)","v":""},{"$f":"IF(DATOS!V230=\"\",\"\",DATOS!V230)","v":""}]
[{"$f":"IF(DATOS!R231=\"\",\"\",DATOS!R231)","v":""},{"$f":"IF(DATOS!AG231=\"\",\"\",DATOS!AG231)","v":""},{"$f":"IF(DATOS!V231=\"\",\"\",DATOS!V231)","v":""}]
[{"$f":"IF(DATOS!R232=\"\",\"\",DATOS!R232)","v":""},{"$f":"IF(DATOS!AG232=\"\",\"\",DATOS!AG232)","v":""},{"$f":"IF(DATOS!V232=\"\",\"\",DATOS!V232)","v":""}]
[{"$f":"IF(DATOS!R233=\"\",\"\",DATOS!R233)","v":""},{"$f":"IF(DATOS!AG233=\"\",\"\",DATOS!AG233)","v":""},{"$f":"IF(DATOS!V233=\"\",\"\",DATOS!V233)","v":""}]
[{"$f":"IF(DATOS!R234=\"\",\"\",DATOS!R234)","v":""},{"$f":"IF(DATOS!AG234=\"\",\"\",DATOS!AG234)","v":""},{"$f":"IF(DATOS!V234=\"\",\"\",DATOS!V234)","v":""}]
[{"$f":"IF(DATOS!R235=\"\",\"\",DATOS!R235)","v":""},{"$f":"IF(DATOS!AG235=\"\",\"\",DATOS!AG235)","v":""},{"$f":"IF(DATOS!V235=\"\",\"\",DATOS!V235)","v":""}]
[{"$f":"IF(DATOS!R236=\"\",\"\",DATOS!R236)","v":""},{"$f":"IF(DATOS!AG236=\"\",\"\",DATOS!AG236)","v":""},{"$f":"IF(DATOS!V236=\"\",\"\",DATOS!V236)","v":""}]
[{"$f":"IF(DATOS!R237=\"\",\"\",DATOS!R237)","v":""},{"$f":"IF(DATOS!AG237=\"\",\"\",DATOS!AG237)","v":""},{"$f":"IF(DATOS!V237=\"\",\"\",DATOS!V237)","v":""}]
[{"$f":"IF(DATOS!R238=\"\",\"\",DATOS!R238)","v":""},{"$f":"IF(DATOS!AG238=\"\",\"\",DATOS!AG238)","v":""},{"$f":"IF(DATOS!V238=\"\",\"\",DATOS!V238)","v":""}]
[{"$f":"IF(DATOS!R239=\"\",\"\",DATOS!R239)","v":""},{"$f":"IF(DATOS!AG239=\"\",\"\",DATOS!AG239)","v":""},{"$f":"IF(DATOS!V239=\"\",\"\",DATOS!V239)","v":""}]
[{"$f":"IF(DATOS!R240=\"\",\"\",DATOS!R240)","v":""},{"$f":"IF(DATOS!AG240=\"\",\"\",DATOS!AG240)","v":""},{"$f":"IF(DATOS!V240=\"\",\"\",DATOS!V240)","v":""}]
[{"$f":"IF(DATOS!R241=\"\",\"\",DATOS!R241)","v":""},{"$f":"IF(DATOS!AG241=\"\",\"\",DATOS!AG241)","v":""},{"$f":"IF(DATOS!V241=\"\",\"\",DATOS!V241)","v":""}]
[{"$f":"IF(DATOS!R242=\"\",\"\",DATOS!R242)","v":""},{"$f":"IF(DATOS!AG242=\"\",\"\",DATOS!AG242)","v":""},{"$f":"IF(DATOS!V242=\"\",\"\",DATOS!V242)","v":""}]
[{"$f":"IF(DATOS!R243=\"\",\"\",DATOS!R243)","v":""},{"$f":"IF(DATOS!AG243=\"\",\"\",DATOS!AG243)","v":""},{"$f":"IF(DATOS!V243=\"\",\"\",DATOS!V243)","v":""}]
[{"$f":"IF(DATOS!R244=\"\",\"\",DATOS!R244)","v":""},{"$f":"IF(DATOS!AG244=\"\",\"\",DATOS!AG244)","v":""},{"$f":"IF(DATOS!V244=\"\",\"\",DATOS!V244)","v":""}]
[{"$f":"IF(DATOS!R245=\"\",\"\",DATOS!R245)","v":""},{"$f":"IF(DATOS!AG245=\"\",\"\",DATOS!AG245)","v":""},{"$f":"IF(DATOS!V245=\"\",\"\",DATOS!V245)","v":""}]
[{"$f":"IF(DATOS!R246=\"\",\"\",DATOS!R246)","v":""},{"$f":"IF(DATOS!AG246=\"\",\"\",DATOS!AG246)","v":""},{"$f":"IF(DATOS!V246=\"\",\"\",DATOS!V246)","v":""}]
[{"$f":"IF(DATOS!R247=\"\",\"\",DATOS!R247)","v":""},{"$f":"IF(DATOS!AG247=\"\",\"\",DATOS!AG247)","v":""},{"$f":"IF(DATOS!V247=\"\",\"\",DATOS!V247)","v":""}]
[{"$f":"IF(DATOS!R248=\"\",\"\",DATOS!R248)","v":""},{"$f":"IF(DATOS!AG248=\"\",\"\",DATOS!AG248)","v":""},{"$f":"IF(DATOS!V248=\"\",\"\",DATOS!V248)","v":""}]
[{"$f":"IF(DATOS!R249=\"\",\"\",DATOS!R249)","v":""},{"$f":"IF(DATOS!AG249=\"\",\"\",DATOS!AG249)","v":""},{"$f":"IF(DATOS!V249=\"\",\"\",DATOS!V249)","v":""}]
[{"$f":"IF(DATOS!R250=\"\",\"\",DATOS!R250)","v":""},{"$f":"IF(DATOS!AG250=\"\",\"\",DATOS!AG250)","v":""},{"$f":"IF(DATOS!V250=\"\",\"\",DATOS!V250)","v":""}]
[{"$f":"IF(DATOS!R251=\"\",\"\",DATOS!R251)","v":""},{"$f":"IF(DATOS!AG251=\"\",\"\",DATOS!AG251)","v":""},{"$f":"IF(DATOS!V251=\"\",\"\",DATOS!V251)","v":""}]
[{"$f":"IF(DATOS!R252=\"\",\"\",DATOS!R252)","v":""},{"$f":"IF(DATOS!AG252=\"\",\"\",DATOS!AG252)","v":""},{"$f":"IF(DATOS!V252=\"\",\"\",DATOS!V252)","v":""}]
[{"$f":"IF(DATOS!R253=\"\",\"\",DATOS!R253)","v":""},{"$f":"IF(DATOS!AG253=\"\",\"\",DATOS!AG253)","v":""},{"$f":"IF(DATOS!V253=\"\",\"\",DATOS!V253)","v":""}]
[{"$f":"IF(DATOS!R254=\"\",\"\",DATOS!R254)","v":""},{"$f":"IF(DATOS!AG254=\"\",\"\",DATOS!AG254)","v":""},{"$f":"IF(DATOS!V254=\"\",\"\",DATOS!V254)","v":""}]
[{"$f":"IF(DATOS!R255=\"\",\"\",DATOS!R255)","v":""},{"$f":"IF(DATOS!AG255=\"\",\"\",DATOS!AG255)","v":""},{"$f":"IF(DATOS!V255=\"\",\"\",DATOS!V255)","v":""}]
[{"$f":"IF(DATOS!R256=\"\",\"\",DATOS!R256)","v":""},{"$f":"IF(DATOS!AG256=\"\",\"\",DATOS!AG256)","v":""},{"$f":"IF(DATOS!V256=\"\",\"\",DATOS!V256)","v":""}]
[{"$f":"IF(DATOS!R257=\"\",\"\",DATOS!R257)","v":""},{"$f":"IF(DATOS!AG257=\"\",\"\",DATOS!AG257)","v":""},{"$f":"IF(DATOS!V257=\"\",\"\",DATOS!V257)","v":""}]
[{"$f":"IF(DATOS!R258=\"\",\"\",DATOS!R258)","v":""},{"$f":"IF(DATOS!AG258=\"\",\"\",DATOS!AG258)","v":""},{"$f":"IF(DATOS!V258=\"\",\"\",DATOS!V258)","v":""}]
[{"$f":"IF(DATOS!R259=\"\",\"\",DATOS!R259)","v":""},{"$f":"IF(DATOS!AG259=\"\",\"\",DATOS!AG259)","v":""},{"$f":"IF(DATOS!V259=\"\",\"\",DATOS!V259)","v":""}]
[{"$f":"IF(DATOS!R260=\"\",\"\",DATOS!R260)","v":""},{"$f":"IF(DATOS!AG260=\"\",\"\",DATOS!AG260)","v":""},{"$f":"IF(DATOS!V260=\"\",\"\",DATOS!V260)","v":""}]
[{"$f":"IF(DATOS!R261=\"\",\"\",DATOS!R261)","v":""},{"$f":"IF(DATOS!AG261=\"\",\"\",DATOS!AG261)","v":""},{"$f":"IF(DATOS!V261=\"\",\"\",DATOS!V261)","v":""}]
[{"$f":"IF(DATOS!R262=\"\",\"\",DATOS!R262)","v":""},{"$f":"IF(DATOS!AG262=\"\",\"\",DATOS!AG262)","v":""},{"$f":"IF(DATOS!V262=\"\",\"\",DATOS!V262)","v":""}]
[{"$f":"IF(DATOS!R263=\"\",\"\",DATOS!R263)","v":""},{"$f":"IF(DATOS!AG263=\"\",\"\",DATOS!AG263)","v":""},{"$f":"IF(DATOS!V263=\"\",\"\",DATOS!V263)","v":""}]
[{"$f":"IF(DATOS!R264=\"\",\"\",DATOS!R264)","v":""},{"$f":"IF(DATOS!AG264=\"\",\"\",DATOS!AG264)","v":""},{"$f":"IF(DATOS!V264=\"\",\"\",DATOS!V264)","v":""}]
[{"$f":"IF(DATOS!R265=\"\",\"\",DATOS!R265)","v":""},{"$f":"IF(DATOS!AG265=\"\",\"\",DATOS!AG265)","v":""},{"$f":"IF(DATOS!V265=\"\",\"\",DATOS!V265)","v":""}]
[{"$f":"IF(DATOS!R266=\"\",\"\",DATOS!R266)","v":""},{"$f":"IF(DATOS!AG266=\"\",\"\",DATOS!AG266)","v":""},{"$f":"IF(DATOS!V266=\"\",\"\",DATOS!V266)","v":""}]
[{"$f":"IF(DATOS!R267=\"\",\"\",DATOS!R267)","v":""},{"$f":"IF(DATOS!AG267=\"\",\"\",DATOS!AG267)","v":""},{"$f":"IF(DATOS!V267=\"\",\"\",DATOS!V267)","v":""}]
[{"$f":"IF(DATOS!R268=\"\",\"\",DATOS!R268)","v":""},{"$f":"IF(DATOS!AG268=\"\",\"\",DATOS!AG268)","v":""},{"$f":"IF(DATOS!V268=\"\",\"\",DATOS!V268)","v":""}]
[{"$f":"IF(DATOS!R269=\"\",\"\",DATOS!R269)","v":""},{"$f":"IF(DATOS!AG269=\"\",\"\",DATOS!AG269)","v":""},{"$f":"IF(DATOS!V269=\"\",\"\",DATOS!V269)","v":""}]
[{"$f":"IF(DATOS!R270=\"\",\"\",DATOS!R270)","v":""},{"$f":"IF(DATOS!AG270=\"\",\"\",DATOS!AG270)","v":""},{"$f":"IF(DATOS!V270=\"\",\"\",DATOS!V270)","v":""}]
[{"$f":"IF(DATOS!R271=\"\",\"\",DATOS!R271)","v":""},{"$f":"IF(DATOS!AG271=\"\",\"\",DATOS!AG271)","v":""},{"$f":"IF(DATOS!V271=\"\",\"\",DATOS!V271)","v":""}]
[{"$f":"IF(DATOS!R272=\"\",\"\",DATOS!R272)","v":""},{"$f":"IF(DATOS!AG272=\"\",\"\",DATOS!AG272)","v":""},{"$f":"IF(DATOS!V272=\"\",\"\",DATOS!V272)","v":""}]
[{"$f":"IF(DATOS!R273=\"\",\"\",DATOS!R273)","v":""},{"$f":"IF(DATOS!AG273=\"\",\"\",DATOS!AG273)","v":""},{"$f":"IF(DATOS!V273=\"\",\"\",DATOS!V273)","v":""}]
[{"$f":"IF(DATOS!R274=\"\",\"\",DATOS!R274)","v":""},{"$f":"IF(DATOS!AG274=\"\",\"\",DATOS!AG274)","v":""},{"$f":"IF(DATOS!V274=\"\",\"\",DATOS!V274)","v":""}]
[{"$f":"IF(DATOS!R275=\"\",\"\",DATOS!R275)","v":""},{"$f":"IF(DATOS!AG275=\"\",\"\",DATOS!AG275)","v":""},{"$f":"IF(DATOS!V275=\"\",\"\",DATOS!V275)","v":""}]
[{"$f":"IF(DATOS!R276=\"\",\"\",DATOS!R276)","v":""},{"$f":"IF(DATOS!AG276=\"\",\"\",DATOS!AG276)","v":""},{"$f":"IF(DATOS!V276=\"\",\"\",DATOS!V276)","v":""}]
[{"$f":"IF(DATOS!R277=\"\",\"\",DATOS!R277)","v":""},{"$f":"IF(DATOS!AG277=\"\",\"\",DATOS!AG277)","v":""},{"$f":"IF(DATOS!V277=\"\",\"\",DATOS!V277)","v":""}]
[{"$f":"IF(DATOS!R278=\"\",\"\",DATOS!R278)","v":""},{"$f":"IF(DATOS!AG278=\"\",\"\",DATOS!AG278)","v":""},{"$f":"IF(DATOS!V278=\"\",\"\",DATOS!V278)","v":""}]
[{"$f":"IF(DATOS!R279=\"\",\"\",DATOS!R279)","v":""},{"$f":"IF(DATOS!AG279=\"\",\"\",DATOS!AG279)","v":""},{"$f":"IF(DATOS!V279=\"\",\"\",DATOS!V279)","v":""}]
[{"$f":"IF(DATOS!R280=\"\",\"\",DATOS!R280)","v":""},{"$f":"IF(DATOS!AG280=\"\",\"\",DATOS!AG280)","v":""},{"$f":"IF(DATOS!V280=\"\",\"\",DATOS!V280)","v":""}]
[{"$f":"IF(DATOS!R281=\"\",\"\",DATOS!R281)","v":""},{"$f":"IF(DATOS!AG281=\"\",\"\",DATOS!AG281)","v":""},{"$f":"IF(DATOS!V281=\"\",\"\",DATOS!V281)","v":""}]
[{"$f":"IF(DATOS!R282=\"\",\"\",DATOS!R282)","v":""},{"$f":"IF(DATOS!AG282=\"\",\"\",DATOS!AG282)","v":""},{"$f":"IF(DATOS!V282=\"\",\"\",DATOS!V282)","v":""}]
[{"$f":"IF(DATOS!R283=\"\",\"\",DATOS!R283)","v":""},{"$f":"IF(DATOS!AG283=\"\",\"\",DATOS!AG283)","v":""},{"$f":"IF(DATOS!V283=\"\",\"\",DATOS!V283)","v":""}]
[{"$f":"IF(DATOS!R284=\"\",\"\",DATOS!R284)","v":""},{"$f":"IF(DATOS!AG284=\"\",\"\",DATOS!AG284)","v":""},{"$f":"IF(DATOS!V284=\"\",\"\",DATOS!V284)","v":""}]
[{"$f":"IF(DATOS!R285=\"\",\"\",DATOS!R285)","v":""},{"$f":"IF(DATOS!AG285=\"\",\"\",DATOS!AG285)","v":""},{"$f":"IF(DATOS!V285=\"\",\"\",DATOS!V285)","v":""}]
[{"$f":"IF(DATOS!R286=\"\",\"\",DATOS!R286)","v":""},{"$f":"IF(DATOS!AG286=\"\",\"\",DATOS!AG286)","v":""},{"$f":"IF(DATOS!V286=\"\",\"\",DATOS!V286)","v":""}]
[{"$f":"IF(DATOS!R287=\"\",\"\",DATOS!R287)","v":""},{"$f":"IF(DATOS!AG287=\"\",\"\",DATOS!AG287)","v":""},{"$f":"IF(DATOS!V287=\"\",\"\",DATOS!V287)","v":""}]
[{"$f":"IF(DATOS!R288=\"\",\"\",DATOS!R288)","v":""},{"$f":"IF(DATOS!AG288=\"\",\"\",DATOS!AG288)","v":""},{"$f":"IF(DATOS!V288=\"\",\"\",DATOS!V288)","v":""}]
[{"$f":"IF(DATOS!R289=\"\",\"\",DATOS!R289)","v":""},{"$f":"IF(DATOS!AG289=\"\",\"\",DATOS!AG289)","v":""},{"$f":"IF(DATOS!V289=\"\",\"\",DATOS!V289)","v":""}]
[{"$f":"IF(DATOS!R290=\"\",\"\",DATOS!R290)","v":""},{"$f":"IF(DATOS!AG290=\"\",\"\",DATOS!AG290)","v":""},{"$f":"IF(DATOS!V290=\"\",\"\",DATOS!V290)","v":""}]
[{"$f":"IF(DATOS!R291=\"\",\"\",DATOS!R291)","v":""},{"$f":"IF(DATOS!AG291=\"\",\"\",DATOS!AG291)","v":""},{"$f":"IF(DATOS!V291=\"\",\"\",DATOS!V291)","v":""}]
[{"$f":"IF(DATOS!R292=\"\",\"\",DATOS!R292)","v":""},{"$f":"IF(DATOS!AG292=\"\",\"\",DATOS!AG292)","v":""},{"$f":"IF(DATOS!V292=\"\",\"\",DATOS!V292)","v":""}]
[{"$f":"IF(DATOS!R293=\"\",\"\",DATOS!R293)","v":""},{"$f":"IF(DATOS!AG293=\"\",\"\",DATOS!AG293)","v":""},{"$f":"IF(DATOS!V293=\"\",\"\",DATOS!V293)","v":""}]
[{"$f":"IF(DATOS!R294=\"\",\"\",DATOS!R294)","v":""},{"$f":"IF(DATOS!AG294=\"\",\"\",DATOS!AG294)","v":""},{"$f":"IF(DATOS!V294=\"\",\"\",DATOS!V294)","v":""}]
[{"$f":"IF(DATOS!R295=\"\",\"\",DATOS!R295)","v":""},{"$f":"IF(DATOS!AG295=\"\",\"\",DATOS!AG295)","v":""},{"$f":"IF(DATOS!V295=\"\",\"\",DATOS!V295)","v":""}]
[{"$f":"IF(DATOS!R296=\"\",\"\",DATOS!R296)","v":""},{"$f":"IF(DATOS!AG296=\"\",\"\",DATOS!AG296)","v":""},{"$f":"IF(DATOS!V296=\"\",\"\",DATOS!V296)","v":""}]
[{"$f":"IF(DATOS!R297=\"\",\"\",DATOS!R297)","v":""},{"$f":"IF(DATOS!AG297=\"\",\"\",DATOS!AG297)","v":""},{"$f":"IF(DATOS!V297=\"\",\"\",DATOS!V297)","v":""}]
[{"$f":"IF(DATOS!R298=\"\",\"\",DATOS!R298)","v":""},{"$f":"IF(DATOS!AG298=\"\",\"\",DATOS!AG298)","v":""},{"$f":"IF(DATOS!V298=\"\",\"\",DATOS!V298)","v":""}]
[{"$f":"IF(DATOS!R299=\"\",\"\",DATOS!R299)","v":""},{"$f":"IF(DATOS!AG299=\"\",\"\",DATOS!AG299)","v":""},{"$f":"IF(DATOS!V299=\"\",\"\",DATOS!V299)","v":""}]
[{"$f":"IF(DATOS!R300=\"\",\"\",DATOS!R300)","v":""},{"$f":"IF(DATOS!AG300=\"\",\"\",DATOS!AG300)","v":""},{"$f":"IF(DATOS!V300=\"\",\"\",DATOS!V300)","v":""}]
[{"$f":"IF(DATOS!R301=\"\",\"\",DATOS!R301)","v":""},{"$f":"IF(DATOS!AG301=\"\",\"\",DATOS!AG301)","v":""},{"$f":"IF(DATOS!V301=\"\",\"\",DATOS!V301)","v":""}]
[{"$f":"IF(DATOS!R302=\"\",\"\",DATOS!R302)","v":""},{"$f":"IF(DATOS!AG302=\"\",\"\",DATOS!AG302)","v":""},{"$f":"IF(DATOS!V302=\"\",\"\",DATOS!V302)","v":""}]
[{"$f":"IF(DATOS!R303=\"\",\"\",DATOS!R303)","v":""},{"$f":"IF(DATOS!AG303=\"\",\"\",DATOS!AG303)","v":""},{"$f":"IF(DATOS!V303=\"\",\"\",DATOS!V303)","v":""}]
[{"$f":"IF(DATOS!R304=\"\",\"\",DATOS!R304)","v":""},{"$f":"IF(DATOS!AG304=\"\",\"\",DATOS!AG304)","v":""},{"$f":"IF(DATOS!V304=\"\",\"\",DATOS!V304)","v":""}]

{"sheet":"AGD_MUESTREOS","index":7,"n_rows":0,"n_cols":0,"rows_kept":0,"cut":false,"hidden":true,"merged":[]}

{"sheet":"AGD_PARAMETRO","index":8,"n_rows":0,"n_cols":0,"rows_kept":0,"cut":false,"hidden":true,"merged":[]}

{"sheet":"AGD_MUESTRAS","index":9,"n_rows":0,"n_cols":0,"rows_kept":0,"cut":false,"hidden":true,"merged":[]}

{"sheet":"AGD_MUESTRAS_VARIABLES","index":10,"n_rows":0,"n_cols":0,"rows_kept":0,"cut":false,"hidden":true,"merged":[]}

{"sheet":"AGD_AUTORIAS","index":11,"n_rows":0,"n_cols":0,"rows_kept":0,"cut":false,"hidden":true,"merged":[]}