{"text_format":"1","workbook":"xlsx","n_sheets":12,"sheets":["Registro de cambios","configuracion","DIGITADOR","DATOS","REFERENTES","OTRAS REFERENTES","Resumen","AGD_MUESTREOS","AGD_PARAMETRO","AGD_MUESTRAS","AGD_MUESTRAS_VARIABLES","AGD_AUTORIAS"],"not_rendered":{"charts":0,"images":0,"macros":1,"external_links":1,"defined_names":30,"comments":1,"pivot_tables":1},"unopened":[],"bounds":{"document_bytes":16777216,"sheet_cells":100000,"rows_first":2000,"rows_last":500,"rows_between":2000,"halvings":0,"cell_chars":16384,"cell_head_chars":4096},"cells_cut":0,"cells_raw":0,"read":"whole","date_system":"1900"}

{"sheet":"Registro de cambios","index":0,"n_rows":7,"n_cols":7,"rows_kept":7,"cut":false,"hidden":true,"merged":[[1,3,1,6]]}
[]
[null,null,null,"REGISTRO DE CAMBIOS"]
[null,null,null,"VERSIÓN No.","CAMBIO REALIZADO","AUTOR","VIGENTE DESDE"]
[null,null,null,"20240917i","Actualización del código de la macro.\n\nSe eliminó la URL de la antigua API de portete:\n       http://portete.invemar.org.co:7003/ArgosWebServices-RESTWebService-context-root/rest/1.0\n\nFue reemplazada por la URL de la API de ARGOS:\n       https://argos.invemar.org.co/api/\n\nLa API contiene End Points que permiten tener mayor control, facilitan la descarga de referentes (listas de usuarios, estaciones, especies, etc.) que corresponden a criterios específicos como el proyecto usado en la plantilla para evitar descargar data innecesaria.\n\nDel mismo modo, también permite la carga de información a la BDD del INVEMAR.\n\nLa macro toma los Endpoints desde la hoja configuracion de una tabla llamada \"Configuración referentes\", a la que se le puede modificar las rutas de la API o agregar nuevas. cabe resaltar que se puede \"quemar\" directamente en la macro los Endpoints que lo requieran.\n\nRevisión de la hoja configuracion para el correcto mapeo de columnas que se estaban descartando al momento de cargar la información al sistema. En la hoja \"DATOS\" se modifican las formulas de las columnas CODMUESTREO, \"ID_MUESTRA\", \"ID_MUESTREO\". En la hoja \"DIGITADOR\", se agrega la tabla \"ATRIBUTOS ADICIONALES\". En la hoja \"OTRAS REFERENCIAS\", se agrega la tabla \"CODIGOS LOV\".\n\n \n","Cristian Charris","2024-09-23"]
[null,null,null,"20200130i","Para trazabilididad la hoja se incluye el nombre del archivo fuente y la posibilidad de anotar el DOI principal del metadato\nPor usabilidad las pestañas que son de interes para el usuario son las verdes\nSi se define mas de un proyecto los referentes de estaciones e investigadores se descargan consecutivo en las mismas columnas\nSe controla la versión para la plantilla mediante comparación dato en AGLOV de la BD.",null,"2020-01-30"]
[null,null,null,"20190313m","Se coloca un listado en el campo \"Proyecto\" en la hoja \"DIGITADOR\". Por lo anterior se modifica la hoja de \"configuracion\".",null,"2019-03-13"]
[null,null,null,"20190413i","Se modifica la generación de los ID de muestreo y se agrega macro que genera número aleatorio en la hoja \"DIGITADOR\".",null,"2018-04-13"]

{"sheet":"configuracion","index":1,"n_rows":71,"n_cols":9,"rows_kept":71,"cut":false,"hidden":true,"merged":[[61,0,61,2],[28,0,35,0],[37,0,42,0],[45,0,45,1],[0,0,2,0],[3,0,5,0],[7,0,8,0],[9,0,15,0],[17,0,21,0],[23,0,26,0]]}
["general","urlServicio","https://argos.invemar.org.co/api/"]
[null,"fila de inicio",5]
[null,"fila de fin",150]
["metodologias","Metodologias",23]
[null,"Referentes",150]
[null,"Cantidad maxima de referentes ",150]
["estaciones/investigadores","proyectos",{"$f":"DIGITADOR!B9","v":1480}]
["Lista especies","metodologias",23]
[null,"proyectos",{"$f":"DIGITADOR!B9","v":1480}]
["MUESTREOS","ID_MUESTREO","DATOS,D"]
{"$rows_left_out":62}
{"sheet":"DIGITADOR","index":2,"n_rows":28,"n_cols":13,"rows_kept":28,"cut":false,"hidden":false,"merged":[[19,0,19,1],[15,0,15,1],[11,3,13,9],[5,0,6,0],[0,0,0,1],[0,3,5,9],[6,3,8,9],[9,3,10,9]]}
["Recolección de Datos Abundancia Peces Corales",null,null,"Recomendaciones generales: \n¡Precaución! No inserte Filas o Columnas.\nEn los casos en que falte un valor a ingresar que provenga de la hoja de referencias, informe para que el administrador del sistema haga las adiciones necesarias.\nEsta es una plantilla programada. Las columnas de color oscuro se llenan automaticamente, principalmente a partir de los contenidos de la hoja de referencias. \nNO UTILICE PUNTO Y COMA (;) en ningun campo, por ser el separador de variables (columnas). Tampoco escriba las unidades de medida, no son necesarias.\nPara el correcto funcionamiento de la hoja debe estar activa la opcion de Excel de ejecutar macros (al abrir la hoja acepte la opcion habilitar macros, mensaje de Excel que aparece en la parte superior de la hoja en un recuadro amarillo). La extensión del archivo debe ser .xlsm\nSe recomienda renombrar el archivo de la siguiente manera: SIMAC_Abundancia_NombreEstacion_FechaMonitoreo.xlsm",null,null,null,null,null,null,null,null,7051]
["Código del responsable",{"$f":"IF(B3=\"\",\"\",INDEX(REFERENTES!V:W,MATCH(B3,REFERENTES!W:W,0),1))","v":""}]
["Nombre del responsible"]
["Entidad"]
["Versión de la plantilla",{"$f":"'Registro de cambios'!$D$4","v":"20240917i"}]
["Fecha en la que ingresa los datos en esta hoja","DD/MM/AAAA"]
[null,"2024-09-13",null,"Previamente a iniciar el llenado de la plantilla, debe presionar el botón \"Descargar referentes\" para que los referentes de ésta plantilla sean actualizados. \nLuego de llenar completamente la plantilla, haga clic sobre el botón \"Generar tablas\" para que los datos sean organizados antes de cargarlos al Sistema de Información.\nAntes de presionar el botón \"Generar tablas\" verifique que:\na. No haya celdas con valores como \"#N/A\" o \"#¡REF!\"\nb. No se esten aplicando filtros en la hoja de datos \nPara finalizar, presione el botón \"Cargar datos\"."]
["Proyecto convenio"]
["Código del proyecto",{"$f":"IF(B10=\"\",\"\",INDEX('OTRAS REFERENTES'!F7:G15,MATCH(DIGITADOR!B10,'OTRAS REFERENTES'!F7:F16,0),2))","v":1480}]
["Nombre Proyecto","Sistema de Monitoreo de los Arrecifes Coralinos en Colombia",null,"Si requiere ayuda contacte a:\nJulio Bohorquez (julio.bohorquez@invemar.org.co)  - Apoyo técnico software"]
{"$rows_left_out":19}
{"sheet":"DATOS","index":3,"n_rows":104,"n_cols":30,"rows_kept":104,"cut":false,"hidden":false,"merged":[[1,26,1,28],[3,19,3,20],[1,2,3,2],[0,3,1,6],[1,9,1,10],[1,14,1,24],[2,7,3,7]]}
[{"$f":"DIGITADOR!B7+F5","v":"2024-09-13"},null,null,"Fecha"]
[{"$f":"TEXT(A1,\"yyyymmdd\")","v":"20240913"},null,"CODIGO",null,null,null,null,null,null,"Investigador",null,null,null,null,"Datos generales de la muestra",null,null,null,null,null,null,null,null,null,null,null,null,null,null,"ABUNDANCIA"]
[null,null,null,null,null,null,"DATE","MES","TEMPO",null,null,"UNIKE_KEY",null,null,null,null,null,null,null,null,null,null,null,null,null,null,null,null,null,"N"]
[null,null,null,"AGD\nMUESTREO","FECHA","HORA","FECHA + HORA",null,"Temporada","DATOS TOMADOS POR","COD",null,"ENTIDAD","OBS.","ESTACION","ID\nESTACION","CONSECUTIVO","ID_MUESTRA","COD\nMUESTREO","SUSTRATO",null,"PROFUNDIDAD","COD\nPROFUNDIDAD","CENSO","UBICACION","CUADRANTE","ESPECIE","DESCRIPCION\nESPECIE","COD\nSIBM","VALOR"]
[null,{"$f":"DIGITADOR!$B$2","v":""},1,{"$f":"IF(S5=\"\",\"\",IF(COUNTIF($S$5:S5, S5)>1, \"\", S5))","v":""},null,null,{"$f":"IF(E5=\"\",\"\",E5+F5)","v":""},{"$f":"IF(G5<>\"\",MONTH(G5),\"\")","v":""},{"$f":"IF(D5=\"\",\"\",1)","v":""},null,{"$f":"IF(J5=\"\",\"\",INDEX(REFERENTES!$V:$W,MATCH(J5,REFERENTES!$W:$W,0),1))","v":""},{"$f":"IF(G5=\"\",\"\",CONCATENATE(G5,P5,K5,1))","v":""},null,null,null,{"$f":"IF(O5=\"\",\"\",VLOOKUP(O5,'OTRAS REFERENTES'!$L$5:$M$148,2,FALSE))","v":""},1,{"$f":"IF(S5=\"\",\"\",CONCATENATE(S5,ROW()-2))","v":""},{"$f":"IF(O5=\"\",\"\",IF(O5=\"\",\"\",CONCATENATE(DIGITADOR!$M$1,E5,P5)))","v":""},{"$f":"IF(R5=\"\",\"\",\"OA\")","v":""},{"$f":"IF(T5=\"\",\"\",\"SO\")","v":""},null,{"$f":"IF(V5=\"\",\"\",VLOOKUP(V5,'OTRAS REFERENTES'!$A$7:$B$9,2,FALSE))","v":""},null,{"$f":"CONCATENATE(W5,X5)","v":""},null,null,{"$f":"IF(AA5=\"\",\"\",INDEX(REFERENTES!$G:$H,MATCH(AA5,REFERENTES!$G:$G,0),2))","v":""},{"$f":"IF(AA5=\"\",\"\",INDEX(REFERENTES!$G:$I,MATCH(AA5,REFERENTES!$G:$G,0),3))","v":""}]
[null,{"$f":"DIGITADOR!$B$2","v":""},2,{"$f":"IF(S6=\"\",\"\",IF(COUNTIF($S$5:S6, S6)>1, \"\", S6))","v":""},null,null,{"$f":"IF(E6=\"\",\"\",E6+F6)","v":""},"",{"$f":"IF(D6=\"\",\"\",1)","v":""},null,{"$f":"IF(J6=\"\",\"\",INDEX(REFERENTES!$V:$W,MATCH(J6,REFERENTES!$W:$W,0),1))","v":""},{"$f":"IF(G6=\"\",\"\",CONCATENATE(G6,P6,K6,1))","v":""},null,null,null,{"$f":"IF(O6=\"\",\"\",VLOOKUP(O6,'OTRAS REFERENTES'!$L$5:$M$148,2,FALSE))","v":""},2,{"$f":"IF(S6=\"\",\"\",CONCATENATE(S6,ROW()-2))","v":""},{"$f":"IF(O6=\"\",\"\",IF(O6=\"\",\"\",CONCATENATE(DIGITADOR!$M$1,E6,P6)))","v":""},{"$f":"IF(R6=\"\",\"\",\"OA\")","v":""},{"$f":"IF(T6=\"\",\"\",\"SO\")","v":""},null,{"$f":"IF(V6=\"\",\"\",VLOOKUP(V6,'OTRAS REFERENTES'!$A$7:$B$9,2,FALSE))","v":""},null,{"$f":"CONCATENATE(W6,X6)","v":""},null,null,{"$f":"IF(AA6=\"\",\"\",INDEX(REFERENTES!$G:$H,MATCH(AA6,REFERENTES!$G:$G,0),2))","v":""},{"$f":"IF(AA6=\"\",\"\",INDEX(REFERENTES!$G:$I,MATCH(AA6,REFERENTES!$G:$G,0),3))","v":""}]
[null,{"$f":"DIGITADOR!$B$2","v":""},3,{"$f":"IF(S7=\"\",\"\",IF(COUNTIF($S$5:S7, S7)>1, \"\", S7))","v":""},null,null,"","","",null,{"$f":"IF(J7=\"\",\"\",INDEX(REFERENTES!$V:$W,MATCH(J7,REFERENTES!$W:$W,0),1))","v":""},"",null,null,null,{"$f":"IF(O7=\"\",\"\",VLOOKUP(O7,'OTRAS REFERENTES'!$L$5:$M$148,2,FALSE))","v":""},3,"",{"$f":"IF(O7=\"\",\"\",IF(O7=\"\",\"\",CONCATENATE(DIGITADOR!$M$1,E7,P7)))","v":""},"","",null,{"$f":"IF(V7=\"\",\"\",VLOOKUP(V7,'OTRAS REFERENTES'!$A$7:$B$9,2,FALSE))","v":""},null,"",null,null,{"$f":"IF(AA7=\"\",\"\",INDEX(REFERENTES!$G:$H,MATCH(AA7,REFERENTES!$G:$G,0),2))","v":""},{"$f":"IF(AA7=\"\",\"\",INDEX(REFERENTES!$G:$I,MATCH(AA7,REFERENTES!$G:$G,0),3))","v":""}]
[null,{"$f":"DIGITADOR!$B$2","v":""},4,{"$f":"IF(S8=\"\",\"\",IF(COUNTIF($S$5:S8, S8)>1, \"\", S8))","v":""},null,null,"","","",null,{"$f":"IF(J8=\"\",\"\",INDEX(REFERENTES!$V:$W,MATCH(J8,REFERENTES!$W:$W,0),1))","v":""},"",null,null,null,{"$f":"IF(O8=\"\",\"\",VLOOKUP(O8,'OTRAS REFERENTES'!$L$5:$M$148,2,FALSE))","v":""},4,"",{"$f":"IF(O8=\"\",\"\",IF(O8=\"\",\"\",CONCATENATE(DIGITADOR!$M$1,E8,P8)))","v":""},"","",null,{"$f":"IF(V8=\"\",\"\",VLOOKUP(V8,'OTRAS REFERENTES'!$A$7:$B$9,2,FALSE))","v":""},null,"",null,null,{"$f":"IF(AA8=\"\",\"\",INDEX(REFERENTES!$G:$H,MATCH(AA8,REFERENTES!$G:$G,0),2))","v":""},{"$f":"IF(AA8=\"\",\"\",INDEX(REFERENTES!$G:$I,MATCH(AA8,REFERENTES!$G:$G,0),3))","v":""}]
[null,{"$f":"DIGITADOR!$B$2","v":""},5,{"$f":"IF(S9=\"\",\"\",IF(COUNTIF($S$5:S9, S9)>1, \"\", S9))","v":""},null,null,"","","",null,{"$f":"IF(J9=\"\",\"\",INDEX(REFERENTES!$V:$W,MATCH(J9,REFERENTES!$W:$W,0),1))","v":""},"",null,null,null,{"$f":"IF(O9=\"\",\"\",VLOOKUP(O9,'OTRAS REFERENTES'!$L$5:$M$148,2,FALSE))","v":""},5,"",{"$f":"IF(O9=\"\",\"\",IF(O9=\"\",\"\",CONCATENATE(DIGITADOR!$M$1,E9,P9)))","v":""},"","",null,{"$f":"IF(V9=\"\",\"\",VLOOKUP(V9,'OTRAS REFERENTES'!$A$7:$B$9,2,FALSE))","v":""},null,"",null,null,{"$f":"IF(AA9=\"\",\"\",INDEX(REFERENTES!$G:$H,MATCH(AA9,REFERENTES!$G:$G,0),2))","v":""},{"$f":"IF(AA9=\"\",\"\",INDEX(REFERENTES!$G:$I,MATCH(AA9,REFERENTES!$G:$G,0),3))","v":""}]
[null,{"$f":"DIGITADOR!$B$2","v":""},6,{"$f":"IF(S10=\"\",\"\",IF(COUNTIF($S$5:S10, S10)>1, \"\", S10))","v":""},null,null,"","","",null,{"$f":"IF(J10=\"\",\"\",INDEX(REFERENTES!$V:$W,MATCH(J10,REFERENTES!$W:$W,0),1))","v":""},"",null,null,null,{"$f":"IF(O10=\"\",\"\",VLOOKUP(O10,'OTRAS REFERENTES'!$L$5:$M$148,2,FALSE))","v":""},6,"",{"$f":"IF(O10=\"\",\"\",IF(O10=\"\",\"\",CONCATENATE(DIGITADOR!$M$1,E10,P10)))","v":""},"","",null,{"$f":"IF(V10=\"\",\"\",VLOOKUP(V10,'OTRAS REFERENTES'!$A$7:$B$9,2,FALSE))","v":""},null,"",null,null,{"$f":"IF(AA10=\"\",\"\",INDEX(REFERENTES!$G:$H,MATCH(AA10,REFERENTES!$G:$G,0),2))","v":""},{"$f":"IF(AA10=\"\",\"\",INDEX(REFERENTES!$G:$I,MATCH(AA10,REFERENTES!$G:$G,0),3))","v":""}]
{"$rows_left_out":95}
{"sheet":"REFERENTES","index":4,"n_rows":437,"n_cols":23,"rows_kept":437,"cut":false,"hidden":false,"merged":[]}
["AG_ESPECIES",148023,null,"AG_LOV",1030,null,"descripcion","cod_letras",null,null,null,null,null,null,null,"secuencia_loc","prefijo_cdg_est_loc","codigo_estacion_loc","descripcion_estacion_loc","lugar",null,"codigo","nombre"]
["Apogon affinis","Aaff",null,"CORALINA","CORALINA",null,"Apogon affinis","Aaff","70.55.346",null,null,null,null,null,null,14311,"ACU",1,null,"Acuario 1",null,3907,"Ameth  Vargas Campo"]
["Acanthemblemaria aspera","Aasp",null,"Fundacion Malpelo","F. Malpelo",null,"Acanthemblemaria aspera","Aasp","70.55.577",null,null,null,null,null,null,14312,"ACU",2,null,"Acuario 2",null,593,"Andrea Polanco"]
["Apogon atradorsatus","Aatr",null,"Instituto de Investigaciones Marinas y Costeras","INVEMAR",null,"Apogon atradorsatus","Aatr","70.55.3219",null,null,null,null,null,null,14338,"AGU",1,"se encuentra localizada bien al fondo de la ensenada","Aguacate S",null,4408,"Andres Felipe Acosta Chaparro"]
["Acanthurus bahianus","Abah",null,"Parques Nacionales","ParquesNacionales",null,"Acanthurus bahianus","Abah","70.55.666",null,null,null,null,null,null,14341,"AZU",1,"A unos 60 metros de la costa en marea baja. localizada a 2º 57' 30.6\" N - 78º 10' 41.0\" O","Azufrada 1",null,3956,"Carlos Aponte"]
["Abudefduf concolor","Abco",null,"PNN_GORGONA","PNN_GORGONA",null,"Abudefduf concolor","Abco","70.55.2706",null,null,null,null,null,null,14342,"AZU",2,"A unos 70m de la costa en marea baja","Azufrada 2",null,1834,"Diana Isabel Gómez López"]
["Acanthemblemaria betinensis","Abet",null,"UJTL","UJTL",null,"Acanthemblemaria betinensis","Abet","70.55.578",null,null,null,null,null,null,43726,"POR",1,"Bahía Portete","Bahía Portete",null,1775,"Diego Duque"]
["Apogon binotatus","Abin",null,"Universidad Nacional","UNal",null,"Apogon binotatus","Abin","70.55.348",null,null,null,null,null,null,55425,"BGO",1,null,"Bonito Gordo (PNN Tayrona)",null,3646,"Elizabeth Galeano Galeano"]
["Anisotremus caesius","Acae",null,"Universidad del Valle","UNIVALLE",null,"Anisotremus caesius","Acae","70.55.3217",null,null,null,null,null,null,14333,"CTI",2,"incluye una parcela en el nivel medio de prof","Cabo Tiburón M",null,1784,"Johanna Carolina Vega Sequeda"]
["Acanthurus sp.","Acan",null,null,null,null,"Acanthurus sp.","Acan","70.46.339",null,null,null,null,null,null,14334,"CTI",1,"la estación es una parcela somera (3 m) forma","Cabo Tiburón S",null,6356,"Jose Francisco Campo Campo"]
{"$rows_left_out":428}
{"sheet":"OTRAS REFERENTES","index":5,"n_rows":148,"n_cols":13,"rows_kept":148,"cut":false,"hidden":false,"merged":[[0,0,2,10],[4,0,4,1],[4,5,4,6],[26,0,26,2]]}
["Estas son listas para variables con valores que no se encuentran codificados, pero que deben manejarse de manera estandarizada. \nSi se requiere agregar un valor nuevo hagalo debajo de la lista correspondiente"]
[]
[]
[]
["PROFUNDIDAD",null,null,"METODOS",null,"PROYECTOS",null,null,null,null,null,{"$f":"IF(AND(REFERENTES!R2<>\"\",          REFERENTES!R2<>96321,    REFERENTES!R2<>96222            ),CONCATENATE(REFERENTES!Q2,\"-\",REFERENTES!R2),\"\")","v":"ACU-1"},{"$f":"REFERENTES!P2","v":14311}]
["Descripcion","Codigo",null,"NOMBRE_MT","CODIGO","Descripcion","Codigo",null,null,null,null,{"$f":"IF(AND(REFERENTES!R3<>\"\",          REFERENTES!R3<>96321,    REFERENTES!R3<>96222            ),CONCATENATE(REFERENTES!Q3,\"-\",REFERENTES!R3),\"\")","v":"ACU-2"},{"$f":"REFERENTES!P3","v":14312}]
["Somero","S",null,"Manual de métodos de SIMAC: Cadena rotulada cada diez eslabones","Car","Sistema de Monitoreo de los Arrecifes Coralinos en Colombia",1480,null,null,null,null,{"$f":"IF(AND(REFERENTES!R4<>\"\",          REFERENTES!R4<>96321,    REFERENTES!R4<>96222            ),CONCATENATE(REFERENTES!Q4,\"-\",REFERENTES!R4),\"\")","v":"AGU-1"},{"$f":"REFERENTES!P4","v":14338}]
["Medio","M",null,null,null,"Restauración banco de las Ánimas, departamento del Magdalena",3316,null,null,null,null,{"$f":"IF(AND(REFERENTES!R5<>\"\",          REFERENTES!R5<>96321,    REFERENTES!R5<>96222            ),CONCATENATE(REFERENTES!Q5,\"-\",REFERENTES!R5),\"\")","v":"AZU-1"},{"$f":"REFERENTES!P5","v":14341}]
["Profundo","P",null,null,null,null,null,null,null,null,null,{"$f":"IF(AND(REFERENTES!R6<>\"\",          REFERENTES!R6<>96321,    REFERENTES!R6<>96222            ),CONCATENATE(REFERENTES!Q6,\"-\",REFERENTES!R6),\"\")","v":"AZU-2"},{"$f":"REFERENTES!P6","v":14342}]
[null,null,null,null,null,null,null,null,null,null,null,{"$f":"IF(AND(REFERENTES!R7<>\"\",          REFERENTES!R7<>96321,    REFERENTES!R7<>96222            ),CONCATENATE(REFERENTES!Q7,\"-\",REFERENTES!R7),\"\")","v":"POR-1"},{"$f":"REFERENTES!P7","v":43726}]
{"$rows_left_out":139}
{"sheet":"Resumen","index":6,"n_rows":101,"n_cols":8,"rows_kept":101,"cut":false,"hidden":false,"merged":[[0,7,2,11]]}
["estacion","abundancia","registros","Etiquetas de fila","Cuenta de registros","Suma de abundancia",null,"Esta tabla debe ser actualizada cada vez que introduzca nuevos datos, para ello debe hacer clic sobre cualquier parte de la tabla y presionar las teclas ALT + F5 de manera conjunta."]
[{"$f":"IF(DATOS!O5=\"\",\"\",DATOS!O5)","v":""},{"$f":"IF(DATOS!AD5=\"\",\"\",DATOS!AD5)","v":""},{"$f":"IF(DATOS!X5=\"\",\"\",DATOS!X5)","v":""},null,100,0]
[{"$f":"IF(DATOS!O6=\"\",\"\",DATOS!O6)","v":""},{"$f":"IF(DATOS!AD6=\"\",\"\",DATOS!AD6)","v":""},{"$f":"IF(DATOS!X6=\"\",\"\",DATOS!X6)","v":""},"Total general",100,0]
[{"$f":"IF(DATOS!O7=\"\",\"\",DATOS!O7)","v":""},{"$f":"IF(DATOS!AD7=\"\",\"\",DATOS!AD7)","v":""},{"$f":"IF(DATOS!X7=\"\",\"\",DATOS!X7)","v":""}]
[{"$f":"IF(DATOS!O8=\"\",\"\",DATOS!O8)","v":""},{"$f":"IF(DATOS!AD8=\"\",\"\",DATOS!AD8)","v":""},{"$f":"IF(DATOS!X8=\"\",\"\",DATOS!X8)","v":""}]
[{"$f":"IF(DATOS!O9=\"\",\"\",DATOS!O9)","v":""},{"$f":"IF(DATOS!AD9=\"\",\"\",DATOS!AD9)","v":""},{"$f":"IF(DATOS!X9=\"\",\"\",DATOS!X9)","v":""}]
[{"$f":"IF(DATOS!O10=\"\",\"\",DATOS!O10)","v":""},{"$f":"IF(DATOS!AD10=\"\",\"\",DATOS!AD10)","v":""},{"$f":"IF(DATOS!X10=\"\",\"\",DATOS!X10)","v":""}]
[{"$f":"IF(DATOS!O11=\"\",\"\",DATOS!O11)","v":""},{"$f":"IF(DATOS!AD11=\"\",\"\",DATOS!AD11)","v":""},{"$f":"IF(DATOS!X11=\"\",\"\",DATOS!X11)","v":""}]
[{"$f":"IF(DATOS!O12=\"\",\"\",DATOS!O12)","v":""},{"$f":"IF(DATOS!AD12=\"\",\"\",DATOS!AD12)","v":""},{"$f":"IF(DATOS!X12=\"\",\"\",DATOS!X12)","v":""}]
[{"$f":"IF(DATOS!O13=\"\",\"\",DATOS!O13)","v":""},{"$f":"IF(DATOS!AD13=\"\",\"\",DATOS!AD13)","v":""},{"$f":"IF(DATOS!X13=\"\",\"\",DATOS!X13)","v":""}]
{"$rows_left_out":92}
{"sheet":"AGD_MUESTREOS","index":7,"n_rows":0,"n_cols":0,"rows_kept":0,"cut":false,"hidden":true,"merged":[]}

{"sheet":"AGD_PARAMETRO","index":8,"n_rows":0,"n_cols":0,"rows_kept":0,"cut":false,"hidden":true,"merged":[]}

{"sheet":"AGD_MUESTRAS","index":9,"n_rows":0,"n_cols":0,"rows_kept":0,"cut":false,"hidden":true,"merged":[]}

{"sheet":"AGD_MUESTRAS_VARIABLES","index":10,"n_rows":0,"n_cols":0,"rows_kept":0,"cut":false,"hidden":true,"merged":[]}

{"sheet":"AGD_AUTORIAS","index":11,"n_rows":0,"n_cols":0,"rows_kept":0,"cut":false,"hidden":true,"merged":[]}