{"text_format":"1","workbook":"xlsx","n_sheets":6,"sheets":["configuracion","Registro de cambios","DIGITADOR","DATOS","REFERENTES","OTRAS REFERENTES"],"not_rendered":{"charts":0,"images":0,"macros":1,"external_links":1,"defined_names":20,"comments":0,"pivot_tables":0},"unopened":[],"bounds":{"document_bytes":16777216,"sheet_cells":100000,"rows_first":2000,"rows_last":500,"rows_between":2000,"halvings":0,"cell_chars":16384,"cell_head_chars":4096},"cells_cut":0,"cells_raw":0,"read":"row_number_cap","date_system":"1900"}

{"sheet":"configuracion","index":0,"n_rows":70,"n_cols":11,"rows_kept":70,"cut":false,"hidden":true,"merged":[[65,0,65,1],[60,0,60,1],[28,0,35,0],[37,0,42,0],[45,0,45,1],[0,0,2,0],[3,0,5,0],[7,0,8,0],[9,0,15,0],[17,0,21,0],[23,0,26,0]]}
["general","urlServicio","https://argos.invemar.org.co/api/"]
[null,"fila de inicio",3]
[null,"fila de fin",153]
["metodologias","Metodologias",862]
[null,"Referentes",862]
[null,"Cantidad maxima de referentes ",200]
["estaciones/investigadores","proyectos",2239]
["Lista especies","metodologias",3]
[null,"proyectos",2239]
["MUESTREOS","ID_MUESTREO","DATOS,B"]
[null,"ID_ESTACION","DATOS,K"]
[null,"ID_PROYECTO",2239]
[null,"ID_METODOLOGIA",861]
[null,"ID_TEMATICAS",257]
[null,"FECHA","DATOS,I"]
[null,"NOTAS"]
[null,"cantidad",150]
["parametro muestreo","ID_MUESTREO","DATOS,B","DATOS,B","DATOS,B","DATOS,B","DATOS,B","DATOS,B","DATOS,B"]
[null,"ID_PARAMETRO",1055,1169,1170,127,901,860,127]
[null,"ID_METODOLOGIA",861,861,861,861,861,861,861]
[null,"ID_UNIDAD_MEDIDA",100,100,100,100,100,109,100]
[null,"VALOR","DIGITADOR,B,5","DIGITADOR,B,12","DIGITADOR,B,11","DIGITADOR,B,25","DIGITADOR,B,14","DIGITADOR,B,15","DIGITADOR,B,9"]
[null,"cantidad",150,150,150,150,150,150,150]
["muestra","ID_MUESTRA","DATOS,D"]
[null,"ID_MUESTREO","DATOS,F"]
[null,"NOTAS","DATOS,X"]
[null,"ES_REPLICA",1]
[null,"cantidad",150]
["muestra variable","ID_PARAMETRO",250,585,252,270,883,566,249,860,1232]
[null,"ID_METODOLOGIA",861,861,861,861,861,861,861,861,861]
[null,"ID_UNIDAD_MEDIDA",100,100,100,10,100,10,100,109,109]
[null,"ID_MUESTRA","DATOS,D","DATOS,D","DATOS,D","DATOS,D","DATOS,D","DATOS,D","DATOS,D","DATOS,D","DATOS,D"]
[null,"ID_METODO"]
[null,"VALOR","DATOS,M","DATOS,Q","DATOS,S","DATOS,T","DATOS,V","DATOS,W","DATOS,O","DATOS,N","DATOS,L"]
[null,"QUALITY_FLAG"]
[null,"PRECISION"]
[null,"cantidad",150,150,150,150,150,150,150,150,150]
["autoria","ID_FUNCIONARIO","DIGITADOR,B,2","DIGITADOR,B,19","DIGITADOR,B,21","DIGITADOR,B,23"]
[null,"ID_TAREA",5,"DIGITADOR,A,19","DIGITADOR,A,21","DIGITADOR,A,23"]
[null,"ORDEN",1,2,3,4]
[null,"FECHA","DIGITADOR,B,7","DATOS,I","DATOS,I","DATOS,I"]
[null,"ID_MUESTREO","DATOS,B","DATOS,B","DATOS,B","DATOS,B"]
[null,"ENTIDAD","DIGITADOR,B,4","DIGITADOR,B,4","DIGITADOR,B,4","DIGITADOR,B,4"]
[null,"cantidad",150,150,150,150]
[]
[null,null,"REGISTROS CARGADOS"]
["MUESTREOS",null,null,null,null,null,null,250,100,"PARCELA_REGENERACION"]
["parametro muestreo",null,null,null,null,null,null,252,100,"ESTADO_ARBOL"]
["muestra",null,null,null,null,null,null,270,10,"ALTURA_PLANTULA"]
["muestra variable",null,null,null,null,null,null,566,10,"DIAMETRO_PLANTULA"]
["autoria",null,null,null,null,null,null,585,100,"ESPECIE"]
["registros correctos",null,null,null,null,null,null,860,109,"AREA_SUBPARCELA"]
["Fecha de carga",null,null,null,null,null,null,883,100,"CATEGORIA_PLANTULA"]
["json error",null,null,null,null,null,null,901,100,"NUM_SUBPARCELAS"]
["error",null,null,null,null,null,null,1055,100,"VERSION_PLANTILLA"]
[null,null,null,null,null,null,null,1169,100,"URL_METADATO"]
[null,null,null,null,null,null,null,1170,100,"ARCHIVO_FUENTE"]
[null,null,null,null,null,null,null,249,100,"ID_ARBOL"]
[null,null,null,null,null,null,null,250,100,"SUBPARCELA"]
[null,null,null,null,null,null,null,1232,109,"AREA_PARCELA"]
["CONFIGURACION REFERENTES - OTRAS REFERENCIAS"]
["URL - SERVICIO","https://argos.invemar.org.co/api/estaciones/get-entidades"]
["ATRIBUTOS DE LA API1","codigo_in","nombre_in"]
["RANGO DE LOS ATRIBUTOS DE LA API","B63:C64"]
[]
["CONFIGURACION REFERENTES"]
["URL - AGM Campo",{"$f":"CONCATENATE(\"parametros/agmcampo/\",$C$4,\"\")","v":"parametros/agmcampo/862"}]
["URL - Especies",{"$f":"CONCATENATE(\"especies/filt/\",$C$9,\",\",$C$8,\"/\")","v":"especies/filt/2239,3/"}]
["URL - Estaciones",{"$f":"CONCATENATE(\"estaciones/35/\",$C$9,\"\")","v":"estaciones/35/2239"}]
["URL - Usuarios",{"$f":"CONCATENATE(\"parametros/usersByProject/\",$C$7,\"\")","v":"parametros/usersByProject/2239"}]

{"sheet":"Registro de cambios","index":1,"n_rows":12,"n_cols":6,"rows_kept":12,"cut":false,"hidden":true,"merged":[[1,3,1,5]]}
[]
[null,null,null,"REGISTRO DE CAMBIOS"]
[null,null,null,"VERSIÓN No.","CAMBIO REALIZADO","VIGENTE DESDE"]
[null,null,null,"20240514i","1) Se actualizo el servicio para que consuma la nueva API.                                                                               2)Se tuvo que organizar en cada  lista el origen de los datos en la hoja DATOS.                                                    3) Se organizo la hoja REFERENTES","2024-05-14"]
[null,null,null,"20230316i","1)Se agrego un nuevo boton \"Ordenar \" en la hoja DATOS para ordenar los datos y no generar ID_MUESTREO distintos.                                                                                               2) Se modifico la regla para generar el ID_MUESTREO, antes se tenia en cuenta la fecha del monitoreo , ahora se tiene en cuenta es el ID_PARCELA del monitoreo.                                                                                                           3)Se agrego un nuevo boton \"Validar Datos\" en la hoja DIGITADOR , para asi validar que ningun campo quede vacio antes de cargar los datos.","2023-03-16"]
[null,null,null,"20220927i","Se modifico la formula de subparcelas muestreadas que se encuentra en la hoja Digitador.\n \n","2022-09-27"]
[null,null,null,"20220804i","Se modifico algunos campos para que fueran obligatorios y algunos campos id se les coloco lista desplegable para generar el nombre automatico","2022-08-04"]
[null,null,null,"20220510i","Actualizacion del listado de parcelas y estaciones","2022-05-10"]
[null,null,null,"20220502i","se ordenaron los referentes de geograficos, se mapeo el proyecto financiador, por defecto todas las plantillas de sigma guardan sus datos al 2239","2022-05-02"]
[null,null,null,"20220204i","cambio en el endpoint de newreferentes devsiam->argos","2022-02-04"]
[null,null,null,"20220111m","Ajustes al boton de descargar referentes, renombre de la plantilla (monitoreo)","2022-01-11"]
[null,null,null,"20210709i","Creación de plantilla de cargue de datos del proyecto de Restauración de manglares.(Andres Cuello)","2021-07-09"]

{"sheet":"DIGITADOR","index":2,"n_rows":40,"n_cols":4,"rows_kept":40,"cut":false,"hidden":false,"merged":[[26,0,26,1],[0,3,5,9],[6,3,8,9],[9,3,13,9],[14,3,16,9],[5,0,6,0],[0,0,0,1],[16,0,16,1]]}
["Recolección de Datos Restauración SIGMA",null,null,"Recomendaciones generales: \n¡Precaución! No inserte Filas o Columnas.\nEn los casos en que falte un valor a ingresar que provenga de la hoja de referencias, informe para que el administrador del sistema haga las adiciones necesarias.\nEsta es una plantilla programada. Las columnas de color oscuro se llenan automaticamente, principalmente a partir de los contenidos de la hoja de referencias. \nNO UTILICE PUNTO Y COMA (;) en ningun campo, por ser el separador de variables (columnas). Tampoco escriba las unidades de medida, no son necesarias.\nPara el correcto funcionamiento de la hoja debe estar activa la opcion de Excel de ejecutar macros (al abrir la hoja acepte la opcion habilitar macros, mensaje de Excel que aparece en la parte superior de la hoja en un recuadro amarillo). La extensión del archivo debe ser .xlsm\nSe recomienda renombrar el archivo de la siguiente manera: SIGMA_Regeneracion_NombreEstacion_FechaMonitoreo.xlsm"]
["CODIGO DIGITADOR",{"$f":"IF(B3=\"\",\"\",INDEX(REFERENTES!$V$2:$W$60,MATCH(DIGITADOR!B3,REFERENTES!$W$2:$W$60,0),1))","v":""}]
["NOMBRE DIGITADOR"]
["ENTIDAD"]
["PLANTILLA",{"$f":"'Registro de cambios'!$D4","v":"20240514i"}]
["Fecha en la que ingresa los datos en esta hoja","DD/MM/AAAA"]
[null,"3000-01-01",null,"Previamente a iniciar el llenado de la plantilla, debe presionar el botón \"Descargar Referentes\" para que los referentes de ésta plantilla sean actualizados. \nLuego de llenar completamente la plantilla verifique que:\na. No haya celdas con valores como \"#N/A\" o \"#¡REF!\"\nb. No se esten aplicando filtros en la hoja de datos                                                                                                                                                                                          c.Una vez diligenciados los datos, en la hoja datos presionar el boton \"Ordenar\" esto con el fin para ordenar las fechas y no generar ID_MUESTREOS diferentes.                                                                                                                                                                                                                                      d.Luego presionar el botón \"Validar datos\" para corroborar que todo esté en orden.                                                                                                                            e.En caso de error de campos vacios corregir."]
[]
["Nombre del proyecto"]
["Codigo del proyecto",{"$f":"IF($B$9=\"\",\"\",INDEX('OTRAS REFERENTES'!$D$7:$F$18,MATCH(DIGITADOR!$B$9,'OTRAS REFERENTES'!$E$7:$E$18,0),1))","v":""},null,"Si requiere ayuda contacte a:\nadministrador.sigma@invemar.org.co  - Administrador SIGMA"]
["Nombre del Archivo",{"$f":"MID(CELL(\"FILENAME\",N50),FIND(\"[\",CELL(\"FILENAME\",N50))+1,   FIND(\"]\",CELL(\"FILENAME\",N50))-FIND(\"[\",CELL(\"FILENAME\",N50))-1)","v":"SIGMA_Monitoreo_Restauracion_20230316i.xlsm"}]
["DOI Metadato"]
["Fuente Plantilla ","http://cinto.invemar.org.co/download/Plantillas_ARGOS_Plus/"]
["Subparcelas Muestreadas",{"$f":"MAX(DATOS!AB:AB)","v":0}]
["Area Subparcela",null,null,"El custodio de los datos es el único autorizado para distribuir este conjunto de datos. El observador y el digitador se comprometen a tomar las medidas necesarias para salvaguardar este conjunto de datos de modo que copia de los mismos no sean obtenidas y/o usadas por terceros no relacionados con el propósito para la cual se recolectó."]
[]
["Indique los INVESTIGADORES que participaron de la toma de datos en campo"]
["ROL","NOMBRE"]
[{"$f":"IF(A20=\"\",\"\",INDEX('OTRAS REFERENTES'!$U$7:$V$15,MATCH(A20,'OTRAS REFERENTES'!V7:V18,0),1))","v":""},{"$f":"IF(B20=\"\",\"\",INDEX(REFERENTES!$V$2:$W$60,MATCH(DIGITADOR!B20,REFERENTES!$W$2:$W$60,0),1))","v":""}]
[]
[{"$f":"IF(A22=\"\",\"\",INDEX('OTRAS REFERENTES'!$U$7:$V$15,MATCH(A22,'OTRAS REFERENTES'!V7:V18,0),1))","v":""},{"$f":"IF(B22=\"\",\"\",INDEX(REFERENTES!$V$2:$W$60,MATCH(DIGITADOR!B22,REFERENTES!$W$2:$W$60,0),1))","v":""}]
[]
[{"$f":"IF(A24=\"\",\"\",INDEX('OTRAS REFERENTES'!$U$7:$V$15,MATCH(A24,'OTRAS REFERENTES'!V7:V18,0),1))","v":""},{"$f":"IF(B24=\"\",\"\",INDEX(REFERENTES!$V$2:$W$60,MATCH(DIGITADOR!B24,REFERENTES!$W$2:$W$60,0),1))","v":""}]
[]
[]
[]
[]
[]
[]
[]
[]
[null,"REGISTROS GENERADOS","REGISTROS CARGADOS"]
["Muestreos",{"$f":"IF(configuracion!B47=\"\",\"\",configuracion!B47)","v":""},{"$f":"IF(configuracion!C47=\"\",\"\",configuracion!C47)","v":""}]
["Parámetros del muestreo",{"$f":"IF(configuracion!B48=\"\",\"\",configuracion!B48)","v":""},{"$f":"IF(configuracion!C48=\"\",\"\",configuracion!C48)","v":""}]
["Muestras",{"$f":"IF(configuracion!B49=\"\",\"\",configuracion!B49)","v":""},{"$f":"IF(configuracion!C49=\"\",\"\",configuracion!C49)","v":""}]
["Variables",{"$f":"IF(configuracion!B50=\"\",\"\",configuracion!B50)","v":""},{"$f":"IF(configuracion!C50=\"\",\"\",configuracion!C50)","v":""}]
["Autores",{"$f":"IF(configuracion!B51=\"\",\"\",configuracion!B51)","v":""},{"$f":"IF(configuracion!C51=\"\",\"\",configuracion!C51)","v":""}]
["Registros correctos",{"$f":"IF(C36=\"\",\"\",IF(C36=0,0,IF(B36-C36=0,C36,\"Fallaron \"&B36-C36&\" registros\")))","v":""}]
["json error",{"$f":"IF(C37=\"\",\"\",IF(C37=0,0,IF(B37-C37=0,C37,\"Fallaron \"&B37-C37&\" registros\")))","v":""}]
["error",{"$f":"IF(C38=\"\",\"\",IF(C38=0,0,IF(B38-C38=0,C38,\"Fallaron \"&B38-C38&\" registros\")))","v":""}]

{"sheet":"DATOS","index":3,"n_rows":152,"n_cols":28,"rows_kept":152,"cut":false,"hidden":false,"merged":[[0,5,1,5],[0,12,1,12],[0,13,1,13],[0,1,1,1],[0,2,1,2],[0,3,1,3],[0,4,1,4],[0,6,1,6],[0,7,1,7],[0,8,1,8],[0,9,0,10],[0,23,1,23],[0,11,1,11],[0,14,1,14],[0,19,1,19],[0,22,1,22],[0,15,0,16],[0,17,0,18],[0,20,0,21]],"read":"row_number_cap"}
[{"$f":"DIGITADOR!B7+H3","v":"3000-01-01"},"ID_MUESTREO (AGD_MUESTREO)","CONSECUTIVO","ID_MUESTRA","CONSECUTIVO DATE_PARCELA","CODMUESTREO","FECHA\n(DD/MM/AAAA)","HORA\n(HH:MM)","DATE","Parcela",null,"AREA_PARCELA (m2)","SUBPARCELA MUESTREADA","AREA SUBPARCELA (m2)","ID_PLANTULA","ESPECIE",null,"ESTADO",null,"ALTURA (cm) ","CAT_ALTURA (cm)",null,"DIAMETRO (cm) (OPCIONAL)","OBSERVACIONES (OPCIONAL)"]
[{"$f":"TEXT(A1,\"yyyymmddhhmm\")","v":"300001010000"},null,null,null,null,null,"DIA","HORA",null,"NOMBRE","ID",null,null,null,null,"NOMBRE","ID","NOMBRE","ID",null,"NOMBRE","ID"]
[1,{"$f":"IF(K3<>\"\", F3,\"\")","v":""},1,{"$f":"IF(G3=\"\",\"\",CONCATENATE(C3,F3))","v":""},{"$f":"CONCATENATE(I3,K3)","v":""},{"$f":"IF(K3<>\"\",CONCATENATE(DIGITADOR!$B$2,$A$2,DIGITADOR!$M$1,A3),\"\")","v":""},null,null,{"$f":"IF(G3<>\"\",G3+H3,\"\")","v":""},null,{"$f":"IF(J3=\"\",\"\",INDEX('OTRAS REFERENTES'!$AB:$AC,MATCH(J3,'OTRAS REFERENTES'!$AB:$AB,0),2))","v":""},null,null,null,null,{"$f":"IF(Q3=\"\",\"\",INDEX(REFERENTES!$G:$H,MATCH(Q3,REFERENTES!$H:$H,0),1))","v":""},null,null,{"$f":"IF(R3=\"\",\"\",INDEX('OTRAS REFERENTES'!$AI:$AJ,MATCH(R3,'OTRAS REFERENTES'!$AJ:$AJ,0),1))","v":""},null,{"$f":"IF(T3=\"\",\"\",IF(AND(T3>=0,T3<=50),\"De 0 cm a 50 cm\",IF(AND(T3>50,T3<=150),\"De 50 cm a 150 cm\",\"Mayor a 150 cm\")))","v":""},{"$f":"IF(T3=\"\",LEFT(U3,1),IF(T3=\"\",\"\",IF(AND(T3>=0,T3<=50),\"A\",IF(AND(T3>50,T3<=150),\"B\",\"C\"))))","v":""},null,null,null,null,{"$f":"IF(SUMPRODUCT(--EXACT(J3&M3,$AA$2:AA2)),\"\",J3&M3)","v":""},{"$f":"IF(SUMPRODUCT(--EXACT(J3&M3,$AB$2:AB2)),\"\",1)","v":""}]
[{"$f":"IF(E4=E3,A3,A3+1)","v":1},{"$f":"IF(F4<>F3, F4,\"\")","v":""},2,"",{"$f":"CONCATENATE(I4,K4)","v":""},{"$f":"IF(K4<>\"\",CONCATENATE(DIGITADOR!$B$2,$A$2,DIGITADOR!$M$1,A4),\"\")","v":""},null,null,"",null,{"$f":"IF(J4=\"\",\"\",INDEX('OTRAS REFERENTES'!$AB:$AC,MATCH(J4,'OTRAS REFERENTES'!$AB:$AB,0),2))","v":""},null,null,null,null,{"$f":"IF(Q4=\"\",\"\",INDEX(REFERENTES!$G:$H,MATCH(Q4,REFERENTES!$H:$H,0),1))","v":""},null,null,{"$f":"IF(R4=\"\",\"\",INDEX('OTRAS REFERENTES'!$AI:$AJ,MATCH(R4,'OTRAS REFERENTES'!$AJ:$AJ,0),1))","v":""},null,"","",null,null,null,null,{"$f":"IF(SUMPRODUCT(--EXACT(J4&M4,$AA$2:AA3)),\"\",J4&M4)","v":""},{"$f":"IF(SUMPRODUCT(--EXACT(J4&M4,$AA$2:AA3)),\"\",MAX($AB$3:AB3)+1)","v":""}]
[1,{"$f":"IF(F5<>F4, F5,\"\")","v":""},3,"","",{"$f":"IF(K5<>\"\",CONCATENATE(DIGITADOR!$B$2,$A$2,DIGITADOR!$M$1,A5),\"\")","v":""},null,null,"",null,{"$f":"IF(J5=\"\",\"\",INDEX('OTRAS REFERENTES'!$AB:$AC,MATCH(J5,'OTRAS REFERENTES'!$AB:$AB,0),2))","v":""},null,null,null,null,{"$f":"IF(Q5=\"\",\"\",INDEX(REFERENTES!$G:$H,MATCH(Q5,REFERENTES!$H:$H,0),1))","v":""},null,null,{"$f":"IF(R5=\"\",\"\",INDEX('OTRAS REFERENTES'!$AI:$AJ,MATCH(R5,'OTRAS REFERENTES'!$AJ:$AJ,0),1))","v":""},null,"","",null,null,null,null,{"$f":"IF(SUMPRODUCT(--EXACT(J5&M5,$AA$2:AA4)),\"\",J5&M5)","v":""},{"$f":"IF(SUMPRODUCT(--EXACT(J5&M5,$AA$2:AA4)),\"\",MAX($AB$3:AB4)+1)","v":""}]
[1,"",4,"","",{"$f":"IF(K6<>\"\",CONCATENATE(DIGITADOR!$B$2,$A$2,DIGITADOR!$M$1,A6),\"\")","v":""},null,null,"",null,{"$f":"IF(J6=\"\",\"\",INDEX('OTRAS REFERENTES'!$AB:$AC,MATCH(J6,'OTRAS REFERENTES'!$AB:$AB,0),2))","v":""},null,null,null,null,{"$f":"IF(Q6=\"\",\"\",INDEX(REFERENTES!$G:$H,MATCH(Q6,REFERENTES!$H:$H,0),1))","v":""},null,null,{"$f":"IF(R6=\"\",\"\",INDEX('OTRAS REFERENTES'!$AI:$AJ,MATCH(R6,'OTRAS REFERENTES'!$AJ:$AJ,0),1))","v":""},null,"","",null,null,null,null,{"$f":"IF(SUMPRODUCT(--EXACT(J6&M6,$AA$2:AA5)),\"\",J6&M6)","v":""},{"$f":"IF(SUMPRODUCT(--EXACT(J6&M6,$AA$2:AA5)),\"\",MAX($AB$3:AB5)+1)","v":""}]
[1,"",5,"","",{"$f":"IF(K7<>\"\",CONCATENATE(DIGITADOR!$B$2,$A$2,DIGITADOR!$M$1,A7),\"\")","v":""},null,null,"",null,{"$f":"IF(J7=\"\",\"\",INDEX('OTRAS REFERENTES'!$AB:$AC,MATCH(J7,'OTRAS REFERENTES'!$AB:$AB,0),2))","v":""},null,null,null,null,{"$f":"IF(Q7=\"\",\"\",INDEX(REFERENTES!$G:$H,MATCH(Q7,REFERENTES!$H:$H,0),1))","v":""},null,null,{"$f":"IF(R7=\"\",\"\",INDEX('OTRAS REFERENTES'!$AI:$AJ,MATCH(R7,'OTRAS REFERENTES'!$AJ:$AJ,0),1))","v":""},null,"","",null,null,null,null,{"$f":"IF(SUMPRODUCT(--EXACT(J7&M7,$AA$2:AA6)),\"\",J7&M7)","v":""},{"$f":"IF(SUMPRODUCT(--EXACT(J7&M7,$AA$2:AA6)),\"\",MAX($AB$3:AB6)+1)","v":""}]
[1,{"$f":"IF(F8<>F7, F8,\"\")","v":""},6,"","",{"$f":"IF(K8<>\"\",CONCATENATE(DIGITADOR!$B$2,$A$2,DIGITADOR!$M$1,A8),\"\")","v":""},null,null,"",null,{"$f":"IF(J8=\"\",\"\",INDEX('OTRAS REFERENTES'!$AB:$AC,MATCH(J8,'OTRAS REFERENTES'!$AB:$AB,0),2))","v":""},null,null,null,null,{"$f":"IF(Q8=\"\",\"\",INDEX(REFERENTES!$G:$H,MATCH(Q8,REFERENTES!$H:$H,0),1))","v":""},null,null,{"$f":"IF(R8=\"\",\"\",INDEX('OTRAS REFERENTES'!$AI:$AJ,MATCH(R8,'OTRAS REFERENTES'!$AJ:$AJ,0),1))","v":""},null,"","",null,null,null,null,{"$f":"IF(SUMPRODUCT(--EXACT(J8&M8,$AA$2:AA7)),\"\",J8&M8)","v":""},{"$f":"IF(SUMPRODUCT(--EXACT(J8&M8,$AA$2:AA7)),\"\",MAX($AB$3:AB7)+1)","v":""}]
[1,"",7,"","",{"$f":"IF(K9<>\"\",CONCATENATE(DIGITADOR!$B$2,$A$2,DIGITADOR!$M$1,A9),\"\")","v":""},null,null,"",null,{"$f":"IF(J9=\"\",\"\",INDEX('OTRAS REFERENTES'!$AB:$AC,MATCH(J9,'OTRAS REFERENTES'!$AB:$AB,0),2))","v":""},null,null,null,null,{"$f":"IF(Q9=\"\",\"\",INDEX(REFERENTES!$G:$H,MATCH(Q9,REFERENTES!$H:$H,0),1))","v":""},null,null,{"$f":"IF(R9=\"\",\"\",INDEX('OTRAS REFERENTES'!$AI:$AJ,MATCH(R9,'OTRAS REFERENTES'!$AJ:$AJ,0),1))","v":""},null,"","",null,null,null,null,{"$f":"IF(SUMPRODUCT(--EXACT(J9&M9,$AA$2:AA8)),\"\",J9&M9)","v":""},{"$f":"IF(SUMPRODUCT(--EXACT(J9&M9,$AA$2:AA8)),\"\",MAX($AB$3:AB8)+1)","v":""}]
[1,"",8,"","",{"$f":"IF(K10<>\"\",CONCATENATE(DIGITADOR!$B$2,$A$2,DIGITADOR!$M$1,A10),\"\")","v":""},null,null,"",null,{"$f":"IF(J10=\"\",\"\",INDEX('OTRAS REFERENTES'!$AB:$AC,MATCH(J10,'OTRAS REFERENTES'!$AB:$AB,0),2))","v":""},null,null,null,null,{"$f":"IF(Q10=\"\",\"\",INDEX(REFERENTES!$G:$H,MATCH(Q10,REFERENTES!$H:$H,0),1))","v":""},null,null,{"$f":"IF(R10=\"\",\"\",INDEX('OTRAS REFERENTES'!$AI:$AJ,MATCH(R10,'OTRAS REFERENTES'!$AJ:$AJ,0),1))","v":""},null,"","",null,null,null,null,{"$f":"IF(SUMPRODUCT(--EXACT(J10&M10,$AA$2:AA9)),\"\",J10&M10)","v":""},{"$f":"IF(SUMPRODUCT(--EXACT(J10&M10,$AA$2:AA9)),\"\",MAX($AB$3:AB9)+1)","v":""}]
[1,"",9,"","",{"$f":"IF(K11<>\"\",CONCATENATE(DIGITADOR!$B$2,$A$2,DIGITADOR!$M$1,A11),\"\")","v":""},null,null,"",null,{"$f":"IF(J11=\"\",\"\",INDEX('OTRAS REFERENTES'!$AB:$AC,MATCH(J11,'OTRAS REFERENTES'!$AB:$AB,0),2))","v":""},null,null,null,null,{"$f":"IF(Q11=\"\",\"\",INDEX(REFERENTES!$G:$H,MATCH(Q11,REFERENTES!$H:$H,0),1))","v":""},null,null,{"$f":"IF(R11=\"\",\"\",INDEX('OTRAS REFERENTES'!$AI:$AJ,MATCH(R11,'OTRAS REFERENTES'!$AJ:$AJ,0),1))","v":""},null,"","",null,null,null,null,{"$f":"IF(SUMPRODUCT(--EXACT(J11&M11,$AA$2:AA10)),\"\",J11&M11)","v":""},{"$f":"IF(SUMPRODUCT(--EXACT(J11&M11,$AA$2:AA10)),\"\",MAX($AB$3:AB10)+1)","v":""}]
[1,"",10,"","",{"$f":"IF(K12<>\"\",CONCATENATE(DIGITADOR!$B$2,$A$2,DIGITADOR!$M$1,A12),\"\")","v":""},null,null,"",null,{"$f":"IF(J12=\"\",\"\",INDEX('OTRAS REFERENTES'!$AB:$AC,MATCH(J12,'OTRAS REFERENTES'!$AB:$AB,0),2))","v":""},null,null,null,null,{"$f":"IF(Q12=\"\",\"\",INDEX(REFERENTES!$G:$H,MATCH(Q12,REFERENTES!$H:$H,0),1))","v":""},null,null,{"$f":"IF(R12=\"\",\"\",INDEX('OTRAS REFERENTES'!$AI:$AJ,MATCH(R12,'OTRAS REFERENTES'!$AJ:$AJ,0),1))","v":""},null,"","",null,null,null,null,{"$f":"IF(SUMPRODUCT(--EXACT(J12&M12,$AA$2:AA11)),\"\",J12&M12)","v":""},{"$f":"IF(SUMPRODUCT(--EXACT(J12&M12,$AA$2:AA11)),\"\",MAX($AB$3:AB11)+1)","v":""}]
[1,"",11,"","",{"$f":"IF(K13<>\"\",CONCATENATE(DIGITADOR!$B$2,$A$2,DIGITADOR!$M$1,A13),\"\")","v":""},null,null,"",null,{"$f":"IF(J13=\"\",\"\",INDEX('OTRAS REFERENTES'!$AB:$AC,MATCH(J13,'OTRAS REFERENTES'!$AB:$AB,0),2))","v":""},null,null,null,null,{"$f":"IF(Q13=\"\",\"\",INDEX(REFERENTES!$G:$H,MATCH(Q13,REFERENTES!$H:$H,0),1))","v":""},null,null,{"$f":"IF(R13=\"\",\"\",INDEX('OTRAS REFERENTES'!$AI:$AJ,MATCH(R13,'OTRAS REFERENTES'!$AJ:$AJ,0),1))","v":""},null,"","",null,null,null,null,{"$f":"IF(SUMPRODUCT(--EXACT(J13&M13,$AA$2:AA12)),\"\",J13&M13)","v":""},{"$f":"IF(SUMPRODUCT(--EXACT(J13&M13,$AA$2:AA12)),\"\",MAX($AB$3:AB12)+1)","v":""}]
[1,"",12,"","",{"$f":"IF(K14<>\"\",CONCATENATE(DIGITADOR!$B$2,$A$2,DIGITADOR!$M$1,A14),\"\")","v":""},null,null,"",null,{"$f":"IF(J14=\"\",\"\",INDEX('OTRAS REFERENTES'!$AB:$AC,MATCH(J14,'OTRAS REFERENTES'!$AB:$AB,0),2))","v":""},null,null,null,null,{"$f":"IF(Q14=\"\",\"\",INDEX(REFERENTES!$G:$H,MATCH(Q14,REFERENTES!$H:$H,0),1))","v":""},null,null,{"$f":"IF(R14=\"\",\"\",INDEX('OTRAS REFERENTES'!$AI:$AJ,MATCH(R14,'OTRAS REFERENTES'!$AJ:$AJ,0),1))","v":""},null,"","",null,null,null,null,{"$f":"IF(SUMPRODUCT(--EXACT(J14&M14,$AA$2:AA13)),\"\",J14&M14)","v":""},{"$f":"IF(SUMPRODUCT(--EXACT(J14&M14,$AA$2:AA13)),\"\",MAX($AB$3:AB13)+1)","v":""}]
[1,"",13,"","",{"$f":"IF(K15<>\"\",CONCATENATE(DIGITADOR!$B$2,$A$2,DIGITADOR!$M$1,A15),\"\")","v":""},null,null,"",null,{"$f":"IF(J15=\"\",\"\",INDEX('OTRAS REFERENTES'!$AB:$AC,MATCH(J15,'OTRAS REFERENTES'!$AB:$AB,0),2))","v":""},null,null,null,null,{"$f":"IF(Q15=\"\",\"\",INDEX(REFERENTES!$G:$H,MATCH(Q15,REFERENTES!$H:$H,0),1))","v":""},null,null,{"$f":"IF(R15=\"\",\"\",INDEX('OTRAS REFERENTES'!$AI:$AJ,MATCH(R15,'OTRAS REFERENTES'!$AJ:$AJ,0),1))","v":""},null,"","",null,null,null,null,{"$f":"IF(SUMPRODUCT(--EXACT(J15&M15,$AA$2:AA14)),\"\",J15&M15)","v":""},{"$f":"IF(SUMPRODUCT(--EXACT(J15&M15,$AA$2:AA14)),\"\",MAX($AB$3:AB14)+1)","v":""}]
[1,"",14,"","",{"$f":"IF(K16<>\"\",CONCATENATE(DIGITADOR!$B$2,$A$2,DIGITADOR!$M$1,A16),\"\")","v":""},null,null,"",null,{"$f":"IF(J16=\"\",\"\",INDEX('OTRAS REFERENTES'!$AB:$AC,MATCH(J16,'OTRAS REFERENTES'!$AB:$AB,0),2))","v":""},null,null,null,null,{"$f":"IF(Q16=\"\",\"\",INDEX(REFERENTES!$G:$H,MATCH(Q16,REFERENTES!$H:$H,0),1))","v":""},null,null,{"$f":"IF(R16=\"\",\"\",INDEX('OTRAS REFERENTES'!$AI:$AJ,MATCH(R16,'OTRAS REFERENTES'!$AJ:$AJ,0),1))","v":""},null,"","",null,null,null,null,{"$f":"IF(SUMPRODUCT(--EXACT(J16&M16,$AA$2:AA15)),\"\",J16&M16)","v":""},{"$f":"IF(SUMPRODUCT(--EXACT(J16&M16,$AA$2:AA15)),\"\",MAX($AB$3:AB15)+1)","v":""}]
[1,"",15,"","",{"$f":"IF(K17<>\"\",CONCATENATE(DIGITADOR!$B$2,$A$2,DIGITADOR!$M$1,A17),\"\")","v":""},null,null,"",null,{"$f":"IF(J17=\"\",\"\",INDEX('OTRAS REFERENTES'!$AB:$AC,MATCH(J17,'OTRAS REFERENTES'!$AB:$AB,0),2))","v":""},null,null,null,null,{"$f":"IF(Q17=\"\",\"\",INDEX(REFERENTES!$G:$H,MATCH(Q17,REFERENTES!$H:$H,0),1))","v":""},null,null,{"$f":"IF(R17=\"\",\"\",INDEX('OTRAS REFERENTES'!$AI:$AJ,MATCH(R17,'OTRAS REFERENTES'!$AJ:$AJ,0),1))","v":""},null,"","",null,null,null,null,{"$f":"IF(SUMPRODUCT(--EXACT(J17&M17,$AA$2:AA16)),\"\",J17&M17)","v":""},{"$f":"IF(SUMPRODUCT(--EXACT(J17&M17,$AA$2:AA16)),\"\",MAX($AB$3:AB16)+1)","v":""}]
[1,"",16,"","",{"$f":"IF(K18<>\"\",CONCATENATE(DIGITADOR!$B$2,$A$2,DIGITADOR!$M$1,A18),\"\")","v":""},null,null,"",null,{"$f":"IF(J18=\"\",\"\",INDEX('OTRAS REFERENTES'!$AB:$AC,MATCH(J18,'OTRAS REFERENTES'!$AB:$AB,0),2))","v":""},null,null,null,null,{"$f":"IF(Q18=\"\",\"\",INDEX(REFERENTES!$G:$H,MATCH(Q18,REFERENTES!$H:$H,0),1))","v":""},null,null,{"$f":"IF(R18=\"\",\"\",INDEX('OTRAS REFERENTES'!$AI:$AJ,MATCH(R18,'OTRAS REFERENTES'!$AJ:$AJ,0),1))","v":""},null,"","",null,null,null,null,{"$f":"IF(SUMPRODUCT(--EXACT(J18&M18,$AA$2:AA17)),\"\",J18&M18)","v":""},{"$f":"IF(SUMPRODUCT(--EXACT(J18&M18,$AA$2:AA17)),\"\",MAX($AB$3:AB17)+1)","v":""}]
[1,"",17,"","",{"$f":"IF(K19<>\"\",CONCATENATE(DIGITADOR!$B$2,$A$2,DIGITADOR!$M$1,A19),\"\")","v":""},null,null,"",null,{"$f":"IF(J19=\"\",\"\",INDEX('OTRAS REFERENTES'!$AB:$AC,MATCH(J19,'OTRAS REFERENTES'!$AB:$AB,0),2))","v":""},null,null,null,null,{"$f":"IF(Q19=\"\",\"\",INDEX(REFERENTES!$G:$H,MATCH(Q19,REFERENTES!$H:$H,0),1))","v":""},null,null,{"$f":"IF(R19=\"\",\"\",INDEX('OTRAS REFERENTES'!$AI:$AJ,MATCH(R19,'OTRAS REFERENTES'!$AJ:$AJ,0),1))","v":""},null,"","",null,null,null,null,{"$f":"IF(SUMPRODUCT(--EXACT(J19&M19,$AA$2:AA18)),\"\",J19&M19)","v":""},{"$f":"IF(SUMPRODUCT(--EXACT(J19&M19,$AA$2:AA18)),\"\",MAX($AB$3:AB18)+1)","v":""}]
[1,"",18,"","",{"$f":"IF(K20<>\"\",CONCATENATE(DIGITADOR!$B$2,$A$2,DIGITADOR!$M$1,A20),\"\")","v":""},null,null,"",null,{"$f":"IF(J20=\"\",\"\",INDEX('OTRAS REFERENTES'!$AB:$AC,MATCH(J20,'OTRAS REFERENTES'!$AB:$AB,0),2))","v":""},null,null,null,null,{"$f":"IF(Q20=\"\",\"\",INDEX(REFERENTES!$G:$H,MATCH(Q20,REFERENTES!$H:$H,0),1))","v":""},null,null,{"$f":"IF(R20=\"\",\"\",INDEX('OTRAS REFERENTES'!$AI:$AJ,MATCH(R20,'OTRAS REFERENTES'!$AJ:$AJ,0),1))","v":""},null,"","",null,null,null,null,{"$f":"IF(SUMPRODUCT(--EXACT(J20&M20,$AA$2:AA19)),\"\",J20&M20)","v":""},{"$f":"IF(SUMPRODUCT(--EXACT(J20&M20,$AA$2:AA19)),\"\",MAX($AB$3:AB19)+1)","v":""}]
[1,"",19,"","",{"$f":"IF(K21<>\"\",CONCATENATE(DIGITADOR!$B$2,$A$2,DIGITADOR!$M$1,A21),\"\")","v":""},null,null,"",null,{"$f":"IF(J21=\"\",\"\",INDEX('OTRAS REFERENTES'!$AB:$AC,MATCH(J21,'OTRAS REFERENTES'!$AB:$AB,0),2))","v":""},null,null,null,null,{"$f":"IF(Q21=\"\",\"\",INDEX(REFERENTES!$G:$H,MATCH(Q21,REFERENTES!$H:$H,0),1))","v":""},null,null,{"$f":"IF(R21=\"\",\"\",INDEX('OTRAS REFERENTES'!$AI:$AJ,MATCH(R21,'OTRAS REFERENTES'!$AJ:$AJ,0),1))","v":""},null,"","",null,null,null,null,{"$f":"IF(SUMPRODUCT(--EXACT(J21&M21,$AA$2:AA20)),\"\",J21&M21)","v":""},{"$f":"IF(SUMPRODUCT(--EXACT(J21&M21,$AA$2:AA20)),\"\",MAX($AB$3:AB20)+1)","v":""}]
[1,"",20,"","",{"$f":"IF(K22<>\"\",CONCATENATE(DIGITADOR!$B$2,$A$2,DIGITADOR!$M$1,A22),\"\")","v":""},null,null,"",null,{"$f":"IF(J22=\"\",\"\",INDEX('OTRAS REFERENTES'!$AB:$AC,MATCH(J22,'OTRAS REFERENTES'!$AB:$AB,0),2))","v":""},null,null,null,null,{"$f":"IF(Q22=\"\",\"\",INDEX(REFERENTES!$G:$H,MATCH(Q22,REFERENTES!$H:$H,0),1))","v":""},null,null,{"$f":"IF(R22=\"\",\"\",INDEX('OTRAS REFERENTES'!$AI:$AJ,MATCH(R22,'OTRAS REFERENTES'!$AJ:$AJ,0),1))","v":""},null,"","",null,null,null,null,{"$f":"IF(SUMPRODUCT(--EXACT(J22&M22,$AA$2:AA21)),\"\",J22&M22)","v":""},{"$f":"IF(SUMPRODUCT(--EXACT(J22&M22,$AA$2:AA21)),\"\",MAX($AB$3:AB21)+1)","v":""}]
[1,"",21,"","",{"$f":"IF(K23<>\"\",CONCATENATE(DIGITADOR!$B$2,$A$2,DIGITADOR!$M$1,A23),\"\")","v":""},null,null,"",null,{"$f":"IF(J23=\"\",\"\",INDEX('OTRAS REFERENTES'!$AB:$AC,MATCH(J23,'OTRAS REFERENTES'!$AB:$AB,0),2))","v":""},null,null,null,null,{"$f":"IF(Q23=\"\",\"\",INDEX(REFERENTES!$G:$H,MATCH(Q23,REFERENTES!$H:$H,0),1))","v":""},null,null,{"$f":"IF(R23=\"\",\"\",INDEX('OTRAS REFERENTES'!$AI:$AJ,MATCH(R23,'OTRAS REFERENTES'!$AJ:$AJ,0),1))","v":""},null,"","",null,null,null,null,{"$f":"IF(SUMPRODUCT(--EXACT(J23&M23,$AA$2:AA22)),\"\",J23&M23)","v":""},{"$f":"IF(SUMPRODUCT(--EXACT(J23&M23,$AA$2:AA22)),\"\",MAX($AB$3:AB22)+1)","v":""}]
[1,"",22,"","",{"$f":"IF(K24<>\"\",CONCATENATE(DIGITADOR!$B$2,$A$2,DIGITADOR!$M$1,A24),\"\")","v":""},null,null,"",null,{"$f":"IF(J24=\"\",\"\",INDEX('OTRAS REFERENTES'!$AB:$AC,MATCH(J24,'OTRAS REFERENTES'!$AB:$AB,0),2))","v":""},null,null,null,null,{"$f":"IF(Q24=\"\",\"\",INDEX(REFERENTES!$G:$H,MATCH(Q24,REFERENTES!$H:$H,0),1))","v":""},null,null,{"$f":"IF(R24=\"\",\"\",INDEX('OTRAS REFERENTES'!$AI:$AJ,MATCH(R24,'OTRAS REFERENTES'!$AJ:$AJ,0),1))","v":""},null,"","",null,null,null,null,{"$f":"IF(SUMPRODUCT(--EXACT(J24&M24,$AA$2:AA23)),\"\",J24&M24)","v":""},{"$f":"IF(SUMPRODUCT(--EXACT(J24&M24,$AA$2:AA23)),\"\",MAX($AB$3:AB23)+1)","v":""}]
[1,"",23,"","",{"$f":"IF(K25<>\"\",CONCATENATE(DIGITADOR!$B$2,$A$2,DIGITADOR!$M$1,A25),\"\")","v":""},null,null,"",null,{"$f":"IF(J25=\"\",\"\",INDEX('OTRAS REFERENTES'!$AB:$AC,MATCH(J25,'OTRAS REFERENTES'!$AB:$AB,0),2))","v":""},null,null,null,null,{"$f":"IF(Q25=\"\",\"\",INDEX(REFERENTES!$G:$H,MATCH(Q25,REFERENTES!$H:$H,0),1))","v":""},null,null,{"$f":"IF(R25=\"\",\"\",INDEX('OTRAS REFERENTES'!$AI:$AJ,MATCH(R25,'OTRAS REFERENTES'!$AJ:$AJ,0),1))","v":""},null,"","",null,null,null,null,{"$f":"IF(SUMPRODUCT(--EXACT(J25&M25,$AA$2:AA24)),\"\",J25&M25)","v":""},{"$f":"IF(SUMPRODUCT(--EXACT(J25&M25,$AA$2:AA24)),\"\",MAX($AB$3:AB24)+1)","v":""}]
[1,"",24,"","",{"$f":"IF(K26<>\"\",CONCATENATE(DIGITADOR!$B$2,$A$2,DIGITADOR!$M$1,A26),\"\")","v":""},null,null,"",null,{"$f":"IF(J26=\"\",\"\",INDEX('OTRAS REFERENTES'!$AB:$AC,MATCH(J26,'OTRAS REFERENTES'!$AB:$AB,0),2))","v":""},null,null,null,null,{"$f":"IF(Q26=\"\",\"\",INDEX(REFERENTES!$G:$H,MATCH(Q26,REFERENTES!$H:$H,0),1))","v":""},null,null,{"$f":"IF(R26=\"\",\"\",INDEX('OTRAS REFERENTES'!$AI:$AJ,MATCH(R26,'OTRAS REFERENTES'!$AJ:$AJ,0),1))","v":""},null,"","",null,null,null,null,{"$f":"IF(SUMPRODUCT(--EXACT(J26&M26,$AA$2:AA25)),\"\",J26&M26)","v":""},{"$f":"IF(SUMPRODUCT(--EXACT(J26&M26,$AA$2:AA25)),\"\",MAX($AB$3:AB25)+1)","v":""}]
[1,"",25,"","",{"$f":"IF(K27<>\"\",CONCATENATE(DIGITADOR!$B$2,$A$2,DIGITADOR!$M$1,A27),\"\")","v":""},null,null,"",null,{"$f":"IF(J27=\"\",\"\",INDEX('OTRAS REFERENTES'!$AB:$AC,MATCH(J27,'OTRAS REFERENTES'!$AB:$AB,0),2))","v":""},null,null,null,null,{"$f":"IF(Q27=\"\",\"\",INDEX(REFERENTES!$G:$H,MATCH(Q27,REFERENTES!$H:$H,0),1))","v":""},null,null,{"$f":"IF(R27=\"\",\"\",INDEX('OTRAS REFERENTES'!$AI:$AJ,MATCH(R27,'OTRAS REFERENTES'!$AJ:$AJ,0),1))","v":""},null,"","",null,null,null,null,{"$f":"IF(SUMPRODUCT(--EXACT(J27&M27,$AA$2:AA26)),\"\",J27&M27)","v":""},{"$f":"IF(SUMPRODUCT(--EXACT(J27&M27,$AA$2:AA26)),\"\",MAX($AB$3:AB26)+1)","v":""}]
[1,"",26,"","",{"$f":"IF(K28<>\"\",CONCATENATE(DIGITADOR!$B$2,$A$2,DIGITADOR!$M$1,A28),\"\")","v":""},null,null,"",null,{"$f":"IF(J28=\"\",\"\",INDEX('OTRAS REFERENTES'!$AB:$AC,MATCH(J28,'OTRAS REFERENTES'!$AB:$AB,0),2))","v":""},null,null,null,null,{"$f":"IF(Q28=\"\",\"\",INDEX(REFERENTES!$G:$H,MATCH(Q28,REFERENTES!$H:$H,0),1))","v":""},null,null,{"$f":"IF(R28=\"\",\"\",INDEX('OTRAS REFERENTES'!$AI:$AJ,MATCH(R28,'OTRAS REFERENTES'!$AJ:$AJ,0),1))","v":""},null,"","",null,null,null,null,{"$f":"IF(SUMPRODUCT(--EXACT(J28&M28,$AA$2:AA27)),\"\",J28&M28)","v":""},{"$f":"IF(SUMPRODUCT(--EXACT(J28&M28,$AA$2:AA27)),\"\",MAX($AB$3:AB27)+1)","v":""}]
[1,"",27,"","",{"$f":"IF(K29<>\"\",CONCATENATE(DIGITADOR!$B$2,$A$2,DIGITADOR!$M$1,A29),\"\")","v":""},null,null,"",null,{"$f":"IF(J29=\"\",\"\",INDEX('OTRAS REFERENTES'!$AB:$AC,MATCH(J29,'OTRAS REFERENTES'!$AB:$AB,0),2))","v":""},null,null,null,null,{"$f":"IF(Q29=\"\",\"\",INDEX(REFERENTES!$G:$H,MATCH(Q29,REFERENTES!$H:$H,0),1))","v":""},null,null,{"$f":"IF(R29=\"\",\"\",INDEX('OTRAS REFERENTES'!$AI:$AJ,MATCH(R29,'OTRAS REFERENTES'!$AJ:$AJ,0),1))","v":""},null,"","",null,null,null,null,{"$f":"IF(SUMPRODUCT(--EXACT(J29&M29,$AA$2:AA28)),\"\",J29&M29)","v":""},{"$f":"IF(SUMPRODUCT(--EXACT(J29&M29,$AA$2:AA28)),\"\",MAX($AB$3:AB28)+1)","v":""}]
[1,"",28,"","",{"$f":"IF(K30<>\"\",CONCATENATE(DIGITADOR!$B$2,$A$2,DIGITADOR!$M$1,A30),\"\")","v":""},null,null,"",null,{"$f":"IF(J30=\"\",\"\",INDEX('OTRAS REFERENTES'!$AB:$AC,MATCH(J30,'OTRAS REFERENTES'!$AB:$AB,0),2))","v":""},null,null,null,null,{"$f":"IF(Q30=\"\",\"\",INDEX(REFERENTES!$G:$H,MATCH(Q30,REFERENTES!$H:$H,0),1))","v":""},null,null,{"$f":"IF(R30=\"\",\"\",INDEX('OTRAS REFERENTES'!$AI:$AJ,MATCH(R30,'OTRAS REFERENTES'!$AJ:$AJ,0),1))","v":""},null,"","",null,null,null,null,{"$f":"IF(SUMPRODUCT(--EXACT(J30&M30,$AA$2:AA29)),\"\",J30&M30)","v":""},{"$f":"IF(SUMPRODUCT(--EXACT(J30&M30,$AA$2:AA29)),\"\",MAX($AB$3:AB29)+1)","v":""}]
[1,"",29,"","",{"$f":"IF(K31<>\"\",CONCATENATE(DIGITADOR!$B$2,$A$2,DIGITADOR!$M$1,A31),\"\")","v":""},null,null,"",null,{"$f":"IF(J31=\"\",\"\",INDEX('OTRAS REFERENTES'!$AB:$AC,MATCH(J31,'OTRAS REFERENTES'!$AB:$AB,0),2))","v":""},null,null,null,null,{"$f":"IF(Q31=\"\",\"\",INDEX(REFERENTES!$G:$H,MATCH(Q31,REFERENTES!$H:$H,0),1))","v":""},null,null,{"$f":"IF(R31=\"\",\"\",INDEX('OTRAS REFERENTES'!$AI:$AJ,MATCH(R31,'OTRAS REFERENTES'!$AJ:$AJ,0),1))","v":""},null,"","",null,null,null,null,{"$f":"IF(SUMPRODUCT(--EXACT(J31&M31,$AA$2:AA30)),\"\",J31&M31)","v":""},{"$f":"IF(SUMPRODUCT(--EXACT(J31&M31,$AA$2:AA30)),\"\",MAX($AB$3:AB30)+1)","v":""}]
[1,"",30,"","",{"$f":"IF(K32<>\"\",CONCATENATE(DIGITADOR!$B$2,$A$2,DIGITADOR!$M$1,A32),\"\")","v":""},null,null,"",null,{"$f":"IF(J32=\"\",\"\",INDEX('OTRAS REFERENTES'!$AB:$AC,MATCH(J32,'OTRAS REFERENTES'!$AB:$AB,0),2))","v":""},null,null,null,null,{"$f":"IF(Q32=\"\",\"\",INDEX(REFERENTES!$G:$H,MATCH(Q32,REFERENTES!$H:$H,0),1))","v":""},null,null,{"$f":"IF(R32=\"\",\"\",INDEX('OTRAS REFERENTES'!$AI:$AJ,MATCH(R32,'OTRAS REFERENTES'!$AJ:$AJ,0),1))","v":""},null,"","",null,null,null,null,{"$f":"IF(SUMPRODUCT(--EXACT(J32&M32,$AA$2:AA31)),\"\",J32&M32)","v":""},{"$f":"IF(SUMPRODUCT(--EXACT(J32&M32,$AA$2:AA31)),\"\",MAX($AB$3:AB31)+1)","v":""}]
[1,"",31,"","",{"$f":"IF(K33<>\"\",CONCATENATE(DIGITADOR!$B$2,$A$2,DIGITADOR!$M$1,A33),\"\")","v":""},null,null,"",null,{"$f":"IF(J33=\"\",\"\",INDEX('OTRAS REFERENTES'!$AB:$AC,MATCH(J33,'OTRAS REFERENTES'!$AB:$AB,0),2))","v":""},null,null,null,null,{"$f":"IF(Q33=\"\",\"\",INDEX(REFERENTES!$G:$H,MATCH(Q33,REFERENTES!$H:$H,0),1))","v":""},null,null,{"$f":"IF(R33=\"\",\"\",INDEX('OTRAS REFERENTES'!$AI:$AJ,MATCH(R33,'OTRAS REFERENTES'!$AJ:$AJ,0),1))","v":""},null,"","",null,null,null,null,{"$f":"IF(SUMPRODUCT(--EXACT(J33&M33,$AA$2:AA32)),\"\",J33&M33)","v":""},{"$f":"IF(SUMPRODUCT(--EXACT(J33&M33,$AA$2:AA32)),\"\",MAX($AB$3:AB32)+1)","v":""}]
[1,"",32,"","",{"$f":"IF(K34<>\"\",CONCATENATE(DIGITADOR!$B$2,$A$2,DIGITADOR!$M$1,A34),\"\")","v":""},null,null,"",null,{"$f":"IF(J34=\"\",\"\",INDEX('OTRAS REFERENTES'!$AB:$AC,MATCH(J34,'OTRAS REFERENTES'!$AB:$AB,0),2))","v":""},null,null,null,null,{"$f":"IF(Q34=\"\",\"\",INDEX(REFERENTES!$G:$H,MATCH(Q34,REFERENTES!$H:$H,0),1))","v":""},null,null,{"$f":"IF(R34=\"\",\"\",INDEX('OTRAS REFERENTES'!$AI:$AJ,MATCH(R34,'OTRAS REFERENTES'!$AJ:$AJ,0),1))","v":""},null,"","",null,null,null,null,{"$f":"IF(SUMPRODUCT(--EXACT(J34&M34,$AA$2:AA33)),\"\",J34&M34)","v":""},{"$f":"IF(SUMPRODUCT(--EXACT(J34&M34,$AA$2:AA33)),\"\",MAX($AB$3:AB33)+1)","v":""}]
[1,"",33,"","",{"$f":"IF(K35<>\"\",CONCATENATE(DIGITADOR!$B$2,$A$2,DIGITADOR!$M$1,A35),\"\")","v":""},null,null,{"$f":"IF(G35<>\"\",G35+H35,\"\")","v":""},null,{"$f":"IF(J35=\"\",\"\",INDEX('OTRAS REFERENTES'!$AB:$AC,MATCH(J35,'OTRAS REFERENTES'!$AB:$AB,0),2))","v":""},null,null,null,null,{"$f":"IF(Q35=\"\",\"\",INDEX(REFERENTES!$G:$H,MATCH(Q35,REFERENTES!$H:$H,0),1))","v":""},null,null,{"$f":"IF(R35=\"\",\"\",INDEX('OTRAS REFERENTES'!$AI:$AJ,MATCH(R35,'OTRAS REFERENTES'!$AJ:$AJ,0),1))","v":""},null,{"$f":"IF(T35=\"\",\"\",IF(AND(T35>=0,T35<=50),\"De 0 cm a 50 cm\",IF(AND(T35>50,T35<=150),\"De 50 cm a 150 cm\",\"Mayor a 150 cm\")))","v":""},{"$f":"IF(T35=\"\",LEFT(U35,1),IF(T35=\"\",\"\",IF(AND(T35>=0,T35<=50),\"A\",IF(AND(T35>50,T35<=150),\"B\",\"C\"))))","v":""},null,null,null,null,{"$f":"IF(SUMPRODUCT(--EXACT(J35&M35,$AA$2:AA34)),\"\",J35&M35)","v":""},{"$f":"IF(SUMPRODUCT(--EXACT(J35&M35,$AA$2:AA34)),\"\",MAX($AB$3:AB34)+1)","v":""}]
[1,"",34,"","",{"$f":"IF(K36<>\"\",CONCATENATE(DIGITADOR!$B$2,$A$2,DIGITADOR!$M$1,A36),\"\")","v":""},null,null,"",null,{"$f":"IF(J36=\"\",\"\",INDEX('OTRAS REFERENTES'!$AB:$AC,MATCH(J36,'OTRAS REFERENTES'!$AB:$AB,0),2))","v":""},null,null,null,null,{"$f":"IF(Q36=\"\",\"\",INDEX(REFERENTES!$G:$H,MATCH(Q36,REFERENTES!$H:$H,0),1))","v":""},null,null,{"$f":"IF(R36=\"\",\"\",INDEX('OTRAS REFERENTES'!$AI:$AJ,MATCH(R36,'OTRAS REFERENTES'!$AJ:$AJ,0),1))","v":""},null,"","",null,null,null,null,{"$f":"IF(SUMPRODUCT(--EXACT(J36&M36,$AA$2:AA35)),\"\",J36&M36)","v":""},{"$f":"IF(SUMPRODUCT(--EXACT(J36&M36,$AA$2:AA35)),\"\",MAX($AB$3:AB35)+1)","v":""}]
[1,"",35,"","",{"$f":"IF(K37<>\"\",CONCATENATE(DIGITADOR!$B$2,$A$2,DIGITADOR!$M$1,A37),\"\")","v":""},null,null,"",null,{"$f":"IF(J37=\"\",\"\",INDEX('OTRAS REFERENTES'!$AB:$AC,MATCH(J37,'OTRAS REFERENTES'!$AB:$AB,0),2))","v":""},null,null,null,null,{"$f":"IF(Q37=\"\",\"\",INDEX(REFERENTES!$G:$H,MATCH(Q37,REFERENTES!$H:$H,0),1))","v":""},null,null,{"$f":"IF(R37=\"\",\"\",INDEX('OTRAS REFERENTES'!$AI:$AJ,MATCH(R37,'OTRAS REFERENTES'!$AJ:$AJ,0),1))","v":""},null,"","",null,null,null,null,{"$f":"IF(SUMPRODUCT(--EXACT(J37&M37,$AA$2:AA36)),\"\",J37&M37)","v":""},{"$f":"IF(SUMPRODUCT(--EXACT(J37&M37,$AA$2:AA36)),\"\",MAX($AB$3:AB36)+1)","v":""}]
[1,"",36,"","",{"$f":"IF(K38<>\"\",CONCATENATE(DIGITADOR!$B$2,$A$2,DIGITADOR!$M$1,A38),\"\")","v":""},null,null,"",null,{"$f":"IF(J38=\"\",\"\",INDEX('OTRAS REFERENTES'!$AB:$AC,MATCH(J38,'OTRAS REFERENTES'!$AB:$AB,0),2))","v":""},null,null,null,null,{"$f":"IF(Q38=\"\",\"\",INDEX(REFERENTES!$G:$H,MATCH(Q38,REFERENTES!$H:$H,0),1))","v":""},null,null,{"$f":"IF(R38=\"\",\"\",INDEX('OTRAS REFERENTES'!$AI:$AJ,MATCH(R38,'OTRAS REFERENTES'!$AJ:$AJ,0),1))","v":""},null,"","",null,null,null,null,{"$f":"IF(SUMPRODUCT(--EXACT(J38&M38,$AA$2:AA37)),\"\",J38&M38)","v":""},{"$f":"IF(SUMPRODUCT(--EXACT(J38&M38,$AA$2:AA37)),\"\",MAX($AB$3:AB37)+1)","v":""}]
[1,"",37,"","",{"$f":"IF(K39<>\"\",CONCATENATE(DIGITADOR!$B$2,$A$2,DIGITADOR!$M$1,A39),\"\")","v":""},null,null,"",null,{"$f":"IF(J39=\"\",\"\",INDEX('OTRAS REFERENTES'!$AB:$AC,MATCH(J39,'OTRAS REFERENTES'!$AB:$AB,0),2))","v":""},null,null,null,null,{"$f":"IF(Q39=\"\",\"\",INDEX(REFERENTES!$G:$H,MATCH(Q39,REFERENTES!$H:$H,0),1))","v":""},null,null,{"$f":"IF(R39=\"\",\"\",INDEX('OTRAS REFERENTES'!$AI:$AJ,MATCH(R39,'OTRAS REFERENTES'!$AJ:$AJ,0),1))","v":""},null,"","",null,null,null,null,{"$f":"IF(SUMPRODUCT(--EXACT(J39&M39,$AA$2:AA38)),\"\",J39&M39)","v":""},{"$f":"IF(SUMPRODUCT(--EXACT(J39&M39,$AA$2:AA38)),\"\",MAX($AB$3:AB38)+1)","v":""}]
[1,"",38,"","",{"$f":"IF(K40<>\"\",CONCATENATE(DIGITADOR!$B$2,$A$2,DIGITADOR!$M$1,A40),\"\")","v":""},null,null,"",null,{"$f":"IF(J40=\"\",\"\",INDEX('OTRAS REFERENTES'!$AB:$AC,MATCH(J40,'OTRAS REFERENTES'!$AB:$AB,0),2))","v":""},null,null,null,null,{"$f":"IF(Q40=\"\",\"\",INDEX(REFERENTES!$G:$H,MATCH(Q40,REFERENTES!$H:$H,0),1))","v":""},null,null,{"$f":"IF(R40=\"\",\"\",INDEX('OTRAS REFERENTES'!$AI:$AJ,MATCH(R40,'OTRAS REFERENTES'!$AJ:$AJ,0),1))","v":""},null,"","",null,null,null,null,{"$f":"IF(SUMPRODUCT(--EXACT(J40&M40,$AA$2:AA39)),\"\",J40&M40)","v":""},{"$f":"IF(SUMPRODUCT(--EXACT(J40&M40,$AA$2:AA39)),\"\",MAX($AB$3:AB39)+1)","v":""}]
[1,"",39,"","",{"$f":"IF(K41<>\"\",CONCATENATE(DIGITADOR!$B$2,$A$2,DIGITADOR!$M$1,A41),\"\")","v":""},null,null,"",null,{"$f":"IF(J41=\"\",\"\",INDEX('OTRAS REFERENTES'!$AB:$AC,MATCH(J41,'OTRAS REFERENTES'!$AB:$AB,0),2))","v":""},null,null,null,null,{"$f":"IF(Q41=\"\",\"\",INDEX(REFERENTES!$G:$H,MATCH(Q41,REFERENTES!$H:$H,0),1))","v":""},null,null,{"$f":"IF(R41=\"\",\"\",INDEX('OTRAS REFERENTES'!$AI:$AJ,MATCH(R41,'OTRAS REFERENTES'!$AJ:$AJ,0),1))","v":""},null,"","",null,null,null,null,{"$f":"IF(SUMPRODUCT(--EXACT(J41&M41,$AA$2:AA40)),\"\",J41&M41)","v":""},{"$f":"IF(SUMPRODUCT(--EXACT(J41&M41,$AA$2:AA40)),\"\",MAX($AB$3:AB40)+1)","v":""}]
[1,"",40,"","",{"$f":"IF(K42<>\"\",CONCATENATE(DIGITADOR!$B$2,$A$2,DIGITADOR!$M$1,A42),\"\")","v":""},null,null,"",null,{"$f":"IF(J42=\"\",\"\",INDEX('OTRAS REFERENTES'!$AB:$AC,MATCH(J42,'OTRAS REFERENTES'!$AB:$AB,0),2))","v":""},null,null,null,null,{"$f":"IF(Q42=\"\",\"\",INDEX(REFERENTES!$G:$H,MATCH(Q42,REFERENTES!$H:$H,0),1))","v":""},null,null,{"$f":"IF(R42=\"\",\"\",INDEX('OTRAS REFERENTES'!$AI:$AJ,MATCH(R42,'OTRAS REFERENTES'!$AJ:$AJ,0),1))","v":""},null,"","",null,null,null,null,{"$f":"IF(SUMPRODUCT(--EXACT(J42&M42,$AA$2:AA41)),\"\",J42&M42)","v":""},{"$f":"IF(SUMPRODUCT(--EXACT(J42&M42,$AA$2:AA41)),\"\",MAX($AB$3:AB41)+1)","v":""}]
[1,"",41,"","",{"$f":"IF(K43<>\"\",CONCATENATE(DIGITADOR!$B$2,$A$2,DIGITADOR!$M$1,A43),\"\")","v":""},null,null,"",null,{"$f":"IF(J43=\"\",\"\",INDEX('OTRAS REFERENTES'!$AB:$AC,MATCH(J43,'OTRAS REFERENTES'!$AB:$AB,0),2))","v":""},null,null,null,null,{"$f":"IF(Q43=\"\",\"\",INDEX(REFERENTES!$G:$H,MATCH(Q43,REFERENTES!$H:$H,0),1))","v":""},null,null,{"$f":"IF(R43=\"\",\"\",INDEX('OTRAS REFERENTES'!$AI:$AJ,MATCH(R43,'OTRAS REFERENTES'!$AJ:$AJ,0),1))","v":""},null,"","",null,null,null,null,{"$f":"IF(SUMPRODUCT(--EXACT(J43&M43,$AA$2:AA42)),\"\",J43&M43)","v":""},{"$f":"IF(SUMPRODUCT(--EXACT(J43&M43,$AA$2:AA42)),\"\",MAX($AB$3:AB42)+1)","v":""}]
[1,"",42,"","",{"$f":"IF(K44<>\"\",CONCATENATE(DIGITADOR!$B$2,$A$2,DIGITADOR!$M$1,A44),\"\")","v":""},null,null,"",null,{"$f":"IF(J44=\"\",\"\",INDEX('OTRAS REFERENTES'!$AB:$AC,MATCH(J44,'OTRAS REFERENTES'!$AB:$AB,0),2))","v":""},null,null,null,null,{"$f":"IF(Q44=\"\",\"\",INDEX(REFERENTES!$G:$H,MATCH(Q44,REFERENTES!$H:$H,0),1))","v":""},null,null,{"$f":"IF(R44=\"\",\"\",INDEX('OTRAS REFERENTES'!$AI:$AJ,MATCH(R44,'OTRAS REFERENTES'!$AJ:$AJ,0),1))","v":""},null,"","",null,null,null,null,{"$f":"IF(SUMPRODUCT(--EXACT(J44&M44,$AA$2:AA43)),\"\",J44&M44)","v":""},{"$f":"IF(SUMPRODUCT(--EXACT(J44&M44,$AA$2:AA43)),\"\",MAX($AB$3:AB43)+1)","v":""}]
[1,"",43,"","",{"$f":"IF(K45<>\"\",CONCATENATE(DIGITADOR!$B$2,$A$2,DIGITADOR!$M$1,A45),\"\")","v":""},null,null,"",null,{"$f":"IF(J45=\"\",\"\",INDEX('OTRAS REFERENTES'!$AB:$AC,MATCH(J45,'OTRAS REFERENTES'!$AB:$AB,0),2))","v":""},null,null,null,null,{"$f":"IF(Q45=\"\",\"\",INDEX(REFERENTES!$G:$H,MATCH(Q45,REFERENTES!$H:$H,0),1))","v":""},null,null,{"$f":"IF(R45=\"\",\"\",INDEX('OTRAS REFERENTES'!$AI:$AJ,MATCH(R45,'OTRAS REFERENTES'!$AJ:$AJ,0),1))","v":""},null,"","",null,null,null,null,{"$f":"IF(SUMPRODUCT(--EXACT(J45&M45,$AA$2:AA44)),\"\",J45&M45)","v":""},{"$f":"IF(SUMPRODUCT(--EXACT(J45&M45,$AA$2:AA44)),\"\",MAX($AB$3:AB44)+1)","v":""}]
[1,"",44,"","",{"$f":"IF(K46<>\"\",CONCATENATE(DIGITADOR!$B$2,$A$2,DIGITADOR!$M$1,A46),\"\")","v":""},null,null,"",null,{"$f":"IF(J46=\"\",\"\",INDEX('OTRAS REFERENTES'!$AB:$AC,MATCH(J46,'OTRAS REFERENTES'!$AB:$AB,0),2))","v":""},null,null,null,null,{"$f":"IF(Q46=\"\",\"\",INDEX(REFERENTES!$G:$H,MATCH(Q46,REFERENTES!$H:$H,0),1))","v":""},null,null,{"$f":"IF(R46=\"\",\"\",INDEX('OTRAS REFERENTES'!$AI:$AJ,MATCH(R46,'OTRAS REFERENTES'!$AJ:$AJ,0),1))","v":""},null,"","",null,null,null,null,{"$f":"IF(SUMPRODUCT(--EXACT(J46&M46,$AA$2:AA45)),\"\",J46&M46)","v":""},{"$f":"IF(SUMPRODUCT(--EXACT(J46&M46,$AA$2:AA45)),\"\",MAX($AB$3:AB45)+1)","v":""}]
[1,"",45,"","",{"$f":"IF(K47<>\"\",CONCATENATE(DIGITADOR!$B$2,$A$2,DIGITADOR!$M$1,A47),\"\")","v":""},null,null,"",null,{"$f":"IF(J47=\"\",\"\",INDEX('OTRAS REFERENTES'!$AB:$AC,MATCH(J47,'OTRAS REFERENTES'!$AB:$AB,0),2))","v":""},null,null,null,null,{"$f":"IF(Q47=\"\",\"\",INDEX(REFERENTES!$G:$H,MATCH(Q47,REFERENTES!$H:$H,0),1))","v":""},null,null,{"$f":"IF(R47=\"\",\"\",INDEX('OTRAS REFERENTES'!$AI:$AJ,MATCH(R47,'OTRAS REFERENTES'!$AJ:$AJ,0),1))","v":""},null,"","",null,null,null,null,{"$f":"IF(SUMPRODUCT(--EXACT(J47&M47,$AA$2:AA46)),\"\",J47&M47)","v":""},{"$f":"IF(SUMPRODUCT(--EXACT(J47&M47,$AA$2:AA46)),\"\",MAX($AB$3:AB46)+1)","v":""}]
[1,"",46,"","",{"$f":"IF(K48<>\"\",CONCATENATE(DIGITADOR!$B$2,$A$2,DIGITADOR!$M$1,A48),\"\")","v":""},null,null,"",null,{"$f":"IF(J48=\"\",\"\",INDEX('OTRAS REFERENTES'!$AB:$AC,MATCH(J48,'OTRAS REFERENTES'!$AB:$AB,0),2))","v":""},null,null,null,null,{"$f":"IF(Q48=\"\",\"\",INDEX(REFERENTES!$G:$H,MATCH(Q48,REFERENTES!$H:$H,0),1))","v":""},null,null,{"$f":"IF(R48=\"\",\"\",INDEX('OTRAS REFERENTES'!$AI:$AJ,MATCH(R48,'OTRAS REFERENTES'!$AJ:$AJ,0),1))","v":""},null,"","",null,null,null,null,{"$f":"IF(SUMPRODUCT(--EXACT(J48&M48,$AA$2:AA47)),\"\",J48&M48)","v":""},{"$f":"IF(SUMPRODUCT(--EXACT(J48&M48,$AA$2:AA47)),\"\",MAX($AB$3:AB47)+1)","v":""}]
[1,"",47,"","",{"$f":"IF(K49<>\"\",CONCATENATE(DIGITADOR!$B$2,$A$2,DIGITADOR!$M$1,A49),\"\")","v":""},null,null,"",null,{"$f":"IF(J49=\"\",\"\",INDEX('OTRAS REFERENTES'!$AB:$AC,MATCH(J49,'OTRAS REFERENTES'!$AB:$AB,0),2))","v":""},null,null,null,null,{"$f":"IF(Q49=\"\",\"\",INDEX(REFERENTES!$G:$H,MATCH(Q49,REFERENTES!$H:$H,0),1))","v":""},null,null,{"$f":"IF(R49=\"\",\"\",INDEX('OTRAS REFERENTES'!$AI:$AJ,MATCH(R49,'OTRAS REFERENTES'!$AJ:$AJ,0),1))","v":""},null,"","",null,null,null,null,{"$f":"IF(SUMPRODUCT(--EXACT(J49&M49,$AA$2:AA48)),\"\",J49&M49)","v":""},{"$f":"IF(SUMPRODUCT(--EXACT(J49&M49,$AA$2:AA48)),\"\",MAX($AB$3:AB48)+1)","v":""}]
[1,"",48,"","",{"$f":"IF(K50<>\"\",CONCATENATE(DIGITADOR!$B$2,$A$2,DIGITADOR!$M$1,A50),\"\")","v":""},null,null,"",null,{"$f":"IF(J50=\"\",\"\",INDEX('OTRAS REFERENTES'!$AB:$AC,MATCH(J50,'OTRAS REFERENTES'!$AB:$AB,0),2))","v":""},null,null,null,null,{"$f":"IF(Q50=\"\",\"\",INDEX(REFERENTES!$G:$H,MATCH(Q50,REFERENTES!$H:$H,0),1))","v":""},null,null,{"$f":"IF(R50=\"\",\"\",INDEX('OTRAS REFERENTES'!$AI:$AJ,MATCH(R50,'OTRAS REFERENTES'!$AJ:$AJ,0),1))","v":""},null,"","",null,null,null,null,{"$f":"IF(SUMPRODUCT(--EXACT(J50&M50,$AA$2:AA49)),\"\",J50&M50)","v":""},{"$f":"IF(SUMPRODUCT(--EXACT(J50&M50,$AA$2:AA49)),\"\",MAX($AB$3:AB49)+1)","v":""}]
[1,"",49,"","",{"$f":"IF(K51<>\"\",CONCATENATE(DIGITADOR!$B$2,$A$2,DIGITADOR!$M$1,A51),\"\")","v":""},null,null,"",null,{"$f":"IF(J51=\"\",\"\",INDEX('OTRAS REFERENTES'!$AB:$AC,MATCH(J51,'OTRAS REFERENTES'!$AB:$AB,0),2))","v":""},null,null,null,null,{"$f":"IF(Q51=\"\",\"\",INDEX(REFERENTES!$G:$H,MATCH(Q51,REFERENTES!$H:$H,0),1))","v":""},null,null,{"$f":"IF(R51=\"\",\"\",INDEX('OTRAS REFERENTES'!$AI:$AJ,MATCH(R51,'OTRAS REFERENTES'!$AJ:$AJ,0),1))","v":""},null,"","",null,null,null,null,{"$f":"IF(SUMPRODUCT(--EXACT(J51&M51,$AA$2:AA50)),\"\",J51&M51)","v":""},{"$f":"IF(SUMPRODUCT(--EXACT(J51&M51,$AA$2:AA50)),\"\",MAX($AB$3:AB50)+1)","v":""}]
[1,"",50,"","",{"$f":"IF(K52<>\"\",CONCATENATE(DIGITADOR!$B$2,$A$2,DIGITADOR!$M$1,A52),\"\")","v":""},null,null,"",null,{"$f":"IF(J52=\"\",\"\",INDEX('OTRAS REFERENTES'!$AB:$AC,MATCH(J52,'OTRAS REFERENTES'!$AB:$AB,0),2))","v":""},null,null,null,null,{"$f":"IF(Q52=\"\",\"\",INDEX(REFERENTES!$G:$H,MATCH(Q52,REFERENTES!$H:$H,0),1))","v":""},null,null,{"$f":"IF(R52=\"\",\"\",INDEX('OTRAS REFERENTES'!$AI:$AJ,MATCH(R52,'OTRAS REFERENTES'!$AJ:$AJ,0),1))","v":""},null,"","",null,null,null,null,{"$f":"IF(SUMPRODUCT(--EXACT(J52&M52,$AA$2:AA51)),\"\",J52&M52)","v":""},{"$f":"IF(SUMPRODUCT(--EXACT(J52&M52,$AA$2:AA51)),\"\",MAX($AB$3:AB51)+1)","v":""}]
[1,"",51,"","",{"$f":"IF(K53<>\"\",CONCATENATE(DIGITADOR!$B$2,$A$2,DIGITADOR!$M$1,A53),\"\")","v":""},null,null,"",null,{"$f":"IF(J53=\"\",\"\",INDEX('OTRAS REFERENTES'!$AB:$AC,MATCH(J53,'OTRAS REFERENTES'!$AB:$AB,0),2))","v":""},null,null,null,null,{"$f":"IF(Q53=\"\",\"\",INDEX(REFERENTES!$G:$H,MATCH(Q53,REFERENTES!$H:$H,0),1))","v":""},null,null,{"$f":"IF(R53=\"\",\"\",INDEX('OTRAS REFERENTES'!$AI:$AJ,MATCH(R53,'OTRAS REFERENTES'!$AJ:$AJ,0),1))","v":""},null,"","",null,null,null,null,{"$f":"IF(SUMPRODUCT(--EXACT(J53&M53,$AA$2:AA52)),\"\",J53&M53)","v":""},{"$f":"IF(SUMPRODUCT(--EXACT(J53&M53,$AA$2:AA52)),\"\",MAX($AB$3:AB52)+1)","v":""}]
[1,"",52,"","",{"$f":"IF(K54<>\"\",CONCATENATE(DIGITADOR!$B$2,$A$2,DIGITADOR!$M$1,A54),\"\")","v":""},null,null,"",null,{"$f":"IF(J54=\"\",\"\",INDEX('OTRAS REFERENTES'!$AB:$AC,MATCH(J54,'OTRAS REFERENTES'!$AB:$AB,0),2))","v":""},null,null,null,null,{"$f":"IF(Q54=\"\",\"\",INDEX(REFERENTES!$G:$H,MATCH(Q54,REFERENTES!$H:$H,0),1))","v":""},null,null,{"$f":"IF(R54=\"\",\"\",INDEX('OTRAS REFERENTES'!$AI:$AJ,MATCH(R54,'OTRAS REFERENTES'!$AJ:$AJ,0),1))","v":""},null,"","",null,null,null,null,{"$f":"IF(SUMPRODUCT(--EXACT(J54&M54,$AA$2:AA53)),\"\",J54&M54)","v":""},{"$f":"IF(SUMPRODUCT(--EXACT(J54&M54,$AA$2:AA53)),\"\",MAX($AB$3:AB53)+1)","v":""}]
[1,"",53,"","",{"$f":"IF(K55<>\"\",CONCATENATE(DIGITADOR!$B$2,$A$2,DIGITADOR!$M$1,A55),\"\")","v":""},null,null,"",null,{"$f":"IF(J55=\"\",\"\",INDEX('OTRAS REFERENTES'!$AB:$AC,MATCH(J55,'OTRAS REFERENTES'!$AB:$AB,0),2))","v":""},null,null,null,null,{"$f":"IF(Q55=\"\",\"\",INDEX(REFERENTES!$G:$H,MATCH(Q55,REFERENTES!$H:$H,0),1))","v":""},null,null,{"$f":"IF(R55=\"\",\"\",INDEX('OTRAS REFERENTES'!$AI:$AJ,MATCH(R55,'OTRAS REFERENTES'!$AJ:$AJ,0),1))","v":""},null,"","",null,null,null,null,{"$f":"IF(SUMPRODUCT(--EXACT(J55&M55,$AA$2:AA54)),\"\",J55&M55)","v":""},{"$f":"IF(SUMPRODUCT(--EXACT(J55&M55,$AA$2:AA54)),\"\",MAX($AB$3:AB54)+1)","v":""}]
[1,"",54,"","",{"$f":"IF(K56<>\"\",CONCATENATE(DIGITADOR!$B$2,$A$2,DIGITADOR!$M$1,A56),\"\")","v":""},null,null,"",null,{"$f":"IF(J56=\"\",\"\",INDEX('OTRAS REFERENTES'!$AB:$AC,MATCH(J56,'OTRAS REFERENTES'!$AB:$AB,0),2))","v":""},null,null,null,null,{"$f":"IF(Q56=\"\",\"\",INDEX(REFERENTES!$G:$H,MATCH(Q56,REFERENTES!$H:$H,0),1))","v":""},null,null,{"$f":"IF(R56=\"\",\"\",INDEX('OTRAS REFERENTES'!$AI:$AJ,MATCH(R56,'OTRAS REFERENTES'!$AJ:$AJ,0),1))","v":""},null,"","",null,null,null,null,{"$f":"IF(SUMPRODUCT(--EXACT(J56&M56,$AA$2:AA55)),\"\",J56&M56)","v":""},{"$f":"IF(SUMPRODUCT(--EXACT(J56&M56,$AA$2:AA55)),\"\",MAX($AB$3:AB55)+1)","v":""}]
[1,"",55,"","",{"$f":"IF(K57<>\"\",CONCATENATE(DIGITADOR!$B$2,$A$2,DIGITADOR!$M$1,A57),\"\")","v":""},null,null,"",null,{"$f":"IF(J57=\"\",\"\",INDEX('OTRAS REFERENTES'!$AB:$AC,MATCH(J57,'OTRAS REFERENTES'!$AB:$AB,0),2))","v":""},null,null,null,null,{"$f":"IF(Q57=\"\",\"\",INDEX(REFERENTES!$G:$H,MATCH(Q57,REFERENTES!$H:$H,0),1))","v":""},null,null,{"$f":"IF(R57=\"\",\"\",INDEX('OTRAS REFERENTES'!$AI:$AJ,MATCH(R57,'OTRAS REFERENTES'!$AJ:$AJ,0),1))","v":""},null,"","",null,null,null,null,{"$f":"IF(SUMPRODUCT(--EXACT(J57&M57,$AA$2:AA56)),\"\",J57&M57)","v":""},{"$f":"IF(SUMPRODUCT(--EXACT(J57&M57,$AA$2:AA56)),\"\",MAX($AB$3:AB56)+1)","v":""}]
[1,"",56,"","",{"$f":"IF(K58<>\"\",CONCATENATE(DIGITADOR!$B$2,$A$2,DIGITADOR!$M$1,A58),\"\")","v":""},null,null,"",null,{"$f":"IF(J58=\"\",\"\",INDEX('OTRAS REFERENTES'!$AB:$AC,MATCH(J58,'OTRAS REFERENTES'!$AB:$AB,0),2))","v":""},null,null,null,null,{"$f":"IF(Q58=\"\",\"\",INDEX(REFERENTES!$G:$H,MATCH(Q58,REFERENTES!$H:$H,0),1))","v":""},null,null,{"$f":"IF(R58=\"\",\"\",INDEX('OTRAS REFERENTES'!$AI:$AJ,MATCH(R58,'OTRAS REFERENTES'!$AJ:$AJ,0),1))","v":""},null,"","",null,null,null,null,{"$f":"IF(SUMPRODUCT(--EXACT(J58&M58,$AA$2:AA57)),\"\",J58&M58)","v":""},{"$f":"IF(SUMPRODUCT(--EXACT(J58&M58,$AA$2:AA57)),\"\",MAX($AB$3:AB57)+1)","v":""}]
[1,"",57,"","",{"$f":"IF(K59<>\"\",CONCATENATE(DIGITADOR!$B$2,$A$2,DIGITADOR!$M$1,A59),\"\")","v":""},null,null,"",null,{"$f":"IF(J59=\"\",\"\",INDEX('OTRAS REFERENTES'!$AB:$AC,MATCH(J59,'OTRAS REFERENTES'!$AB:$AB,0),2))","v":""},null,null,null,null,{"$f":"IF(Q59=\"\",\"\",INDEX(REFERENTES!$G:$H,MATCH(Q59,REFERENTES!$H:$H,0),1))","v":""},null,null,{"$f":"IF(R59=\"\",\"\",INDEX('OTRAS REFERENTES'!$AI:$AJ,MATCH(R59,'OTRAS REFERENTES'!$AJ:$AJ,0),1))","v":""},null,"","",null,null,null,null,{"$f":"IF(SUMPRODUCT(--EXACT(J59&M59,$AA$2:AA58)),\"\",J59&M59)","v":""},{"$f":"IF(SUMPRODUCT(--EXACT(J59&M59,$AA$2:AA58)),\"\",MAX($AB$3:AB58)+1)","v":""}]
[1,"",58,"","",{"$f":"IF(K60<>\"\",CONCATENATE(DIGITADOR!$B$2,$A$2,DIGITADOR!$M$1,A60),\"\")","v":""},null,null,"",null,{"$f":"IF(J60=\"\",\"\",INDEX('OTRAS REFERENTES'!$AB:$AC,MATCH(J60,'OTRAS REFERENTES'!$AB:$AB,0),2))","v":""},null,null,null,null,{"$f":"IF(Q60=\"\",\"\",INDEX(REFERENTES!$G:$H,MATCH(Q60,REFERENTES!$H:$H,0),1))","v":""},null,null,{"$f":"IF(R60=\"\",\"\",INDEX('OTRAS REFERENTES'!$AI:$AJ,MATCH(R60,'OTRAS REFERENTES'!$AJ:$AJ,0),1))","v":""},null,"","",null,null,null,null,{"$f":"IF(SUMPRODUCT(--EXACT(J60&M60,$AA$2:AA59)),\"\",J60&M60)","v":""},{"$f":"IF(SUMPRODUCT(--EXACT(J60&M60,$AA$2:AA59)),\"\",MAX($AB$3:AB59)+1)","v":""}]
[1,"",59,"","",{"$f":"IF(K61<>\"\",CONCATENATE(DIGITADOR!$B$2,$A$2,DIGITADOR!$M$1,A61),\"\")","v":""},null,null,"",null,{"$f":"IF(J61=\"\",\"\",INDEX('OTRAS REFERENTES'!$AB:$AC,MATCH(J61,'OTRAS REFERENTES'!$AB:$AB,0),2))","v":""},null,null,null,null,{"$f":"IF(Q61=\"\",\"\",INDEX(REFERENTES!$G:$H,MATCH(Q61,REFERENTES!$H:$H,0),1))","v":""},null,null,{"$f":"IF(R61=\"\",\"\",INDEX('OTRAS REFERENTES'!$AI:$AJ,MATCH(R61,'OTRAS REFERENTES'!$AJ:$AJ,0),1))","v":""},null,"","",null,null,null,null,{"$f":"IF(SUMPRODUCT(--EXACT(J61&M61,$AA$2:AA60)),\"\",J61&M61)","v":""},{"$f":"IF(SUMPRODUCT(--EXACT(J61&M61,$AA$2:AA60)),\"\",MAX($AB$3:AB60)+1)","v":""}]
[1,"",60,"","",{"$f":"IF(K62<>\"\",CONCATENATE(DIGITADOR!$B$2,$A$2,DIGITADOR!$M$1,A62),\"\")","v":""},null,null,"",null,{"$f":"IF(J62=\"\",\"\",INDEX('OTRAS REFERENTES'!$AB:$AC,MATCH(J62,'OTRAS REFERENTES'!$AB:$AB,0),2))","v":""},null,null,null,null,{"$f":"IF(Q62=\"\",\"\",INDEX(REFERENTES!$G:$H,MATCH(Q62,REFERENTES!$H:$H,0),1))","v":""},null,null,{"$f":"IF(R62=\"\",\"\",INDEX('OTRAS REFERENTES'!$AI:$AJ,MATCH(R62,'OTRAS REFERENTES'!$AJ:$AJ,0),1))","v":""},null,"","",null,null,null,null,{"$f":"IF(SUMPRODUCT(--EXACT(J62&M62,$AA$2:AA61)),\"\",J62&M62)","v":""},{"$f":"IF(SUMPRODUCT(--EXACT(J62&M62,$AA$2:AA61)),\"\",MAX($AB$3:AB61)+1)","v":""}]
[1,"",61,"","",{"$f":"IF(K63<>\"\",CONCATENATE(DIGITADOR!$B$2,$A$2,DIGITADOR!$M$1,A63),\"\")","v":""},null,null,"",null,{"$f":"IF(J63=\"\",\"\",INDEX('OTRAS REFERENTES'!$AB:$AC,MATCH(J63,'OTRAS REFERENTES'!$AB:$AB,0),2))","v":""},null,null,null,null,{"$f":"IF(Q63=\"\",\"\",INDEX(REFERENTES!$G:$H,MATCH(Q63,REFERENTES!$H:$H,0),1))","v":""},null,null,{"$f":"IF(R63=\"\",\"\",INDEX('OTRAS REFERENTES'!$AI:$AJ,MATCH(R63,'OTRAS REFERENTES'!$AJ:$AJ,0),1))","v":""},null,"","",null,null,null,null,{"$f":"IF(SUMPRODUCT(--EXACT(J63&M63,$AA$2:AA62)),\"\",J63&M63)","v":""},{"$f":"IF(SUMPRODUCT(--EXACT(J63&M63,$AA$2:AA62)),\"\",MAX($AB$3:AB62)+1)","v":""}]
[1,"",62,"","",{"$f":"IF(K64<>\"\",CONCATENATE(DIGITADOR!$B$2,$A$2,DIGITADOR!$M$1,A64),\"\")","v":""},null,null,"",null,{"$f":"IF(J64=\"\",\"\",INDEX('OTRAS REFERENTES'!$AB:$AC,MATCH(J64,'OTRAS REFERENTES'!$AB:$AB,0),2))","v":""},null,null,null,null,{"$f":"IF(Q64=\"\",\"\",INDEX(REFERENTES!$G:$H,MATCH(Q64,REFERENTES!$H:$H,0),1))","v":""},null,null,{"$f":"IF(R64=\"\",\"\",INDEX('OTRAS REFERENTES'!$AI:$AJ,MATCH(R64,'OTRAS REFERENTES'!$AJ:$AJ,0),1))","v":""},null,"","",null,null,null,null,{"$f":"IF(SUMPRODUCT(--EXACT(J64&M64,$AA$2:AA63)),\"\",J64&M64)","v":""},{"$f":"IF(SUMPRODUCT(--EXACT(J64&M64,$AA$2:AA63)),\"\",MAX($AB$3:AB63)+1)","v":""}]
[1,"",63,"","",{"$f":"IF(K65<>\"\",CONCATENATE(DIGITADOR!$B$2,$A$2,DIGITADOR!$M$1,A65),\"\")","v":""},null,null,"",null,{"$f":"IF(J65=\"\",\"\",INDEX('OTRAS REFERENTES'!$AB:$AC,MATCH(J65,'OTRAS REFERENTES'!$AB:$AB,0),2))","v":""},null,null,null,null,{"$f":"IF(Q65=\"\",\"\",INDEX(REFERENTES!$G:$H,MATCH(Q65,REFERENTES!$H:$H,0),1))","v":""},null,null,{"$f":"IF(R65=\"\",\"\",INDEX('OTRAS REFERENTES'!$AI:$AJ,MATCH(R65,'OTRAS REFERENTES'!$AJ:$AJ,0),1))","v":""},null,"","",null,null,null,null,{"$f":"IF(SUMPRODUCT(--EXACT(J65&M65,$AA$2:AA64)),\"\",J65&M65)","v":""},{"$f":"IF(SUMPRODUCT(--EXACT(J65&M65,$AA$2:AA64)),\"\",MAX($AB$3:AB64)+1)","v":""}]
[1,"",64,"","",{"$f":"IF(K66<>\"\",CONCATENATE(DIGITADOR!$B$2,$A$2,DIGITADOR!$M$1,A66),\"\")","v":""},null,null,"",null,{"$f":"IF(J66=\"\",\"\",INDEX('OTRAS REFERENTES'!$AB:$AC,MATCH(J66,'OTRAS REFERENTES'!$AB:$AB,0),2))","v":""},null,null,null,null,{"$f":"IF(Q66=\"\",\"\",INDEX(REFERENTES!$G:$H,MATCH(Q66,REFERENTES!$H:$H,0),1))","v":""},null,null,{"$f":"IF(R66=\"\",\"\",INDEX('OTRAS REFERENTES'!$AI:$AJ,MATCH(R66,'OTRAS REFERENTES'!$AJ:$AJ,0),1))","v":""},null,"","",null,null,null,null,{"$f":"IF(SUMPRODUCT(--EXACT(J66&M66,$AA$2:AA65)),\"\",J66&M66)","v":""},{"$f":"IF(SUMPRODUCT(--EXACT(J66&M66,$AA$2:AA65)),\"\",MAX($AB$3:AB65)+1)","v":""}]
[1,"",65,{"$f":"IF(G67=\"\",\"\",CONCATENATE(C67,F67))","v":""},"",{"$f":"IF(K67<>\"\",CONCATENATE(DIGITADOR!$B$2,$A$2,DIGITADOR!$M$1,A67),\"\")","v":""},null,null,{"$f":"IF(G67<>\"\",G67+H67,\"\")","v":""},null,{"$f":"IF(J67=\"\",\"\",INDEX('OTRAS REFERENTES'!$AB:$AC,MATCH(J67,'OTRAS REFERENTES'!$AB:$AB,0),2))","v":""},null,null,null,null,{"$f":"IF(Q67=\"\",\"\",INDEX(REFERENTES!$G:$H,MATCH(Q67,REFERENTES!$H:$H,0),1))","v":""},null,null,{"$f":"IF(R67=\"\",\"\",INDEX('OTRAS REFERENTES'!$AI:$AJ,MATCH(R67,'OTRAS REFERENTES'!$AJ:$AJ,0),1))","v":""},null,{"$f":"IF(T67=\"\",\"\",IF(AND(T67>=0,T67<=50),\"De 0 cm a 50 cm\",IF(AND(T67>50,T67<=150),\"De 50 cm a 150 cm\",\"Mayor a 150 cm\")))","v":""},{"$f":"IF(T67=\"\",LEFT(U67,1),IF(T67=\"\",\"\",IF(AND(T67>=0,T67<=50),\"A\",IF(AND(T67>50,T67<=150),\"B\",\"C\"))))","v":""},null,null,null,null,{"$f":"IF(SUMPRODUCT(--EXACT(J67&M67,$AA$2:AA66)),\"\",J67&M67)","v":""},{"$f":"IF(SUMPRODUCT(--EXACT(J67&M67,$AA$2:AA66)),\"\",MAX($AB$3:AB66)+1)","v":""}]
[{"$f":"IF(E68=E67,A67,A67+1)","v":1},"",66,"",{"$f":"CONCATENATE(I68,K68)","v":""},{"$f":"IF(K68<>\"\",CONCATENATE(DIGITADOR!$B$2,$A$2,DIGITADOR!$M$1,A68),\"\")","v":""},null,null,"",null,{"$f":"IF(J68=\"\",\"\",INDEX('OTRAS REFERENTES'!$AB:$AC,MATCH(J68,'OTRAS REFERENTES'!$AB:$AB,0),2))","v":""},null,null,null,null,{"$f":"IF(Q68=\"\",\"\",INDEX(REFERENTES!$G:$H,MATCH(Q68,REFERENTES!$H:$H,0),1))","v":""},null,null,{"$f":"IF(R68=\"\",\"\",INDEX('OTRAS REFERENTES'!$AI:$AJ,MATCH(R68,'OTRAS REFERENTES'!$AJ:$AJ,0),1))","v":""},null,"","",null,null,null,null,{"$f":"IF(SUMPRODUCT(--EXACT(J68&M68,$AA$2:AA67)),\"\",J68&M68)","v":""},{"$f":"IF(SUMPRODUCT(--EXACT(J68&M68,$AA$2:AA67)),\"\",MAX($AB$3:AB67)+1)","v":""}]
[1,{"$f":"IF(F69<>F68, F69,\"\")","v":""},67,"","",{"$f":"IF(K69<>\"\",CONCATENATE(DIGITADOR!$B$2,$A$2,DIGITADOR!$M$1,A69),\"\")","v":""},null,null,"",null,{"$f":"IF(J69=\"\",\"\",INDEX('OTRAS REFERENTES'!$AB:$AC,MATCH(J69,'OTRAS REFERENTES'!$AB:$AB,0),2))","v":""},null,null,null,null,{"$f":"IF(Q69=\"\",\"\",INDEX(REFERENTES!$G:$H,MATCH(Q69,REFERENTES!$H:$H,0),1))","v":""},null,null,{"$f":"IF(R69=\"\",\"\",INDEX('OTRAS REFERENTES'!$AI:$AJ,MATCH(R69,'OTRAS REFERENTES'!$AJ:$AJ,0),1))","v":""},null,"","",null,null,null,null,{"$f":"IF(SUMPRODUCT(--EXACT(J69&M69,$AA$2:AA68)),\"\",J69&M69)","v":""},{"$f":"IF(SUMPRODUCT(--EXACT(J69&M69,$AA$2:AA68)),\"\",MAX($AB$3:AB68)+1)","v":""}]
[1,"",68,"","",{"$f":"IF(K70<>\"\",CONCATENATE(DIGITADOR!$B$2,$A$2,DIGITADOR!$M$1,A70),\"\")","v":""},null,null,"",null,{"$f":"IF(J70=\"\",\"\",INDEX('OTRAS REFERENTES'!$AB:$AC,MATCH(J70,'OTRAS REFERENTES'!$AB:$AB,0),2))","v":""},null,null,null,null,{"$f":"IF(Q70=\"\",\"\",INDEX(REFERENTES!$G:$H,MATCH(Q70,REFERENTES!$H:$H,0),1))","v":""},null,null,{"$f":"IF(R70=\"\",\"\",INDEX('OTRAS REFERENTES'!$AI:$AJ,MATCH(R70,'OTRAS REFERENTES'!$AJ:$AJ,0),1))","v":""},null,"","",null,null,null,null,{"$f":"IF(SUMPRODUCT(--EXACT(J70&M70,$AA$2:AA69)),\"\",J70&M70)","v":""},{"$f":"IF(SUMPRODUCT(--EXACT(J70&M70,$AA$2:AA69)),\"\",MAX($AB$3:AB69)+1)","v":""}]
[1,"",69,"","",{"$f":"IF(K71<>\"\",CONCATENATE(DIGITADOR!$B$2,$A$2,DIGITADOR!$M$1,A71),\"\")","v":""},null,null,"",null,{"$f":"IF(J71=\"\",\"\",INDEX('OTRAS REFERENTES'!$AB:$AC,MATCH(J71,'OTRAS REFERENTES'!$AB:$AB,0),2))","v":""},null,null,null,null,{"$f":"IF(Q71=\"\",\"\",INDEX(REFERENTES!$G:$H,MATCH(Q71,REFERENTES!$H:$H,0),1))","v":""},null,null,{"$f":"IF(R71=\"\",\"\",INDEX('OTRAS REFERENTES'!$AI:$AJ,MATCH(R71,'OTRAS REFERENTES'!$AJ:$AJ,0),1))","v":""},null,"","",null,null,null,null,{"$f":"IF(SUMPRODUCT(--EXACT(J71&M71,$AA$2:AA70)),\"\",J71&M71)","v":""},{"$f":"IF(SUMPRODUCT(--EXACT(J71&M71,$AA$2:AA70)),\"\",MAX($AB$3:AB70)+1)","v":""}]
[1,"",70,"","",{"$f":"IF(K72<>\"\",CONCATENATE(DIGITADOR!$B$2,$A$2,DIGITADOR!$M$1,A72),\"\")","v":""},null,null,"",null,{"$f":"IF(J72=\"\",\"\",INDEX('OTRAS REFERENTES'!$AB:$AC,MATCH(J72,'OTRAS REFERENTES'!$AB:$AB,0),2))","v":""},null,null,null,null,{"$f":"IF(Q72=\"\",\"\",INDEX(REFERENTES!$G:$H,MATCH(Q72,REFERENTES!$H:$H,0),1))","v":""},null,null,{"$f":"IF(R72=\"\",\"\",INDEX('OTRAS REFERENTES'!$AI:$AJ,MATCH(R72,'OTRAS REFERENTES'!$AJ:$AJ,0),1))","v":""},null,"","",null,null,null,null,{"$f":"IF(SUMPRODUCT(--EXACT(J72&M72,$AA$2:AA71)),\"\",J72&M72)","v":""},{"$f":"IF(SUMPRODUCT(--EXACT(J72&M72,$AA$2:AA71)),\"\",MAX($AB$3:AB71)+1)","v":""}]
[1,"",71,"","",{"$f":"IF(K73<>\"\",CONCATENATE(DIGITADOR!$B$2,$A$2,DIGITADOR!$M$1,A73),\"\")","v":""},null,null,"",null,{"$f":"IF(J73=\"\",\"\",INDEX('OTRAS REFERENTES'!$AB:$AC,MATCH(J73,'OTRAS REFERENTES'!$AB:$AB,0),2))","v":""},null,null,null,null,{"$f":"IF(Q73=\"\",\"\",INDEX(REFERENTES!$G:$H,MATCH(Q73,REFERENTES!$H:$H,0),1))","v":""},null,null,{"$f":"IF(R73=\"\",\"\",INDEX('OTRAS REFERENTES'!$AI:$AJ,MATCH(R73,'OTRAS REFERENTES'!$AJ:$AJ,0),1))","v":""},null,"","",null,null,null,null,{"$f":"IF(SUMPRODUCT(--EXACT(J73&M73,$AA$2:AA72)),\"\",J73&M73)","v":""},{"$f":"IF(SUMPRODUCT(--EXACT(J73&M73,$AA$2:AA72)),\"\",MAX($AB$3:AB72)+1)","v":""}]
[1,"",72,"","",{"$f":"IF(K74<>\"\",CONCATENATE(DIGITADOR!$B$2,$A$2,DIGITADOR!$M$1,A74),\"\")","v":""},null,null,"",null,{"$f":"IF(J74=\"\",\"\",INDEX('OTRAS REFERENTES'!$AB:$AC,MATCH(J74,'OTRAS REFERENTES'!$AB:$AB,0),2))","v":""},null,null,null,null,{"$f":"IF(Q74=\"\",\"\",INDEX(REFERENTES!$G:$H,MATCH(Q74,REFERENTES!$H:$H,0),1))","v":""},null,null,{"$f":"IF(R74=\"\",\"\",INDEX('OTRAS REFERENTES'!$AI:$AJ,MATCH(R74,'OTRAS REFERENTES'!$AJ:$AJ,0),1))","v":""},null,"","",null,null,null,null,{"$f":"IF(SUMPRODUCT(--EXACT(J74&M74,$AA$2:AA73)),\"\",J74&M74)","v":""},{"$f":"IF(SUMPRODUCT(--EXACT(J74&M74,$AA$2:AA73)),\"\",MAX($AB$3:AB73)+1)","v":""}]
[1,"",73,"","",{"$f":"IF(K75<>\"\",CONCATENATE(DIGITADOR!$B$2,$A$2,DIGITADOR!$M$1,A75),\"\")","v":""},null,null,"",null,{"$f":"IF(J75=\"\",\"\",INDEX('OTRAS REFERENTES'!$AB:$AC,MATCH(J75,'OTRAS REFERENTES'!$AB:$AB,0),2))","v":""},null,null,null,null,{"$f":"IF(Q75=\"\",\"\",INDEX(REFERENTES!$G:$H,MATCH(Q75,REFERENTES!$H:$H,0),1))","v":""},null,null,{"$f":"IF(R75=\"\",\"\",INDEX('OTRAS REFERENTES'!$AI:$AJ,MATCH(R75,'OTRAS REFERENTES'!$AJ:$AJ,0),1))","v":""},null,"","",null,null,null,null,{"$f":"IF(SUMPRODUCT(--EXACT(J75&M75,$AA$2:AA74)),\"\",J75&M75)","v":""},{"$f":"IF(SUMPRODUCT(--EXACT(J75&M75,$AA$2:AA74)),\"\",MAX($AB$3:AB74)+1)","v":""}]
[1,"",74,"","",{"$f":"IF(K76<>\"\",CONCATENATE(DIGITADOR!$B$2,$A$2,DIGITADOR!$M$1,A76),\"\")","v":""},null,null,"",null,{"$f":"IF(J76=\"\",\"\",INDEX('OTRAS REFERENTES'!$AB:$AC,MATCH(J76,'OTRAS REFERENTES'!$AB:$AB,0),2))","v":""},null,null,null,null,{"$f":"IF(Q76=\"\",\"\",INDEX(REFERENTES!$G:$H,MATCH(Q76,REFERENTES!$H:$H,0),1))","v":""},null,null,{"$f":"IF(R76=\"\",\"\",INDEX('OTRAS REFERENTES'!$AI:$AJ,MATCH(R76,'OTRAS REFERENTES'!$AJ:$AJ,0),1))","v":""},null,"","",null,null,null,null,{"$f":"IF(SUMPRODUCT(--EXACT(J76&M76,$AA$2:AA75)),\"\",J76&M76)","v":""},{"$f":"IF(SUMPRODUCT(--EXACT(J76&M76,$AA$2:AA75)),\"\",MAX($AB$3:AB75)+1)","v":""}]
[1,"",75,"","",{"$f":"IF(K77<>\"\",CONCATENATE(DIGITADOR!$B$2,$A$2,DIGITADOR!$M$1,A77),\"\")","v":""},null,null,"",null,{"$f":"IF(J77=\"\",\"\",INDEX('OTRAS REFERENTES'!$AB:$AC,MATCH(J77,'OTRAS REFERENTES'!$AB:$AB,0),2))","v":""},null,null,null,null,{"$f":"IF(Q77=\"\",\"\",INDEX(REFERENTES!$G:$H,MATCH(Q77,REFERENTES!$H:$H,0),1))","v":""},null,null,{"$f":"IF(R77=\"\",\"\",INDEX('OTRAS REFERENTES'!$AI:$AJ,MATCH(R77,'OTRAS REFERENTES'!$AJ:$AJ,0),1))","v":""},null,"","",null,null,null,null,{"$f":"IF(SUMPRODUCT(--EXACT(J77&M77,$AA$2:AA76)),\"\",J77&M77)","v":""},{"$f":"IF(SUMPRODUCT(--EXACT(J77&M77,$AA$2:AA76)),\"\",MAX($AB$3:AB76)+1)","v":""}]
[1,"",76,"","",{"$f":"IF(K78<>\"\",CONCATENATE(DIGITADOR!$B$2,$A$2,DIGITADOR!$M$1,A78),\"\")","v":""},null,null,"",null,{"$f":"IF(J78=\"\",\"\",INDEX('OTRAS REFERENTES'!$AB:$AC,MATCH(J78,'OTRAS REFERENTES'!$AB:$AB,0),2))","v":""},null,null,null,null,{"$f":"IF(Q78=\"\",\"\",INDEX(REFERENTES!$G:$H,MATCH(Q78,REFERENTES!$H:$H,0),1))","v":""},null,null,{"$f":"IF(R78=\"\",\"\",INDEX('OTRAS REFERENTES'!$AI:$AJ,MATCH(R78,'OTRAS REFERENTES'!$AJ:$AJ,0),1))","v":""},null,"","",null,null,null,null,{"$f":"IF(SUMPRODUCT(--EXACT(J78&M78,$AA$2:AA77)),\"\",J78&M78)","v":""},{"$f":"IF(SUMPRODUCT(--EXACT(J78&M78,$AA$2:AA77)),\"\",MAX($AB$3:AB77)+1)","v":""}]
[1,"",77,"","",{"$f":"IF(K79<>\"\",CONCATENATE(DIGITADOR!$B$2,$A$2,DIGITADOR!$M$1,A79),\"\")","v":""},null,null,"",null,{"$f":"IF(J79=\"\",\"\",INDEX('OTRAS REFERENTES'!$AB:$AC,MATCH(J79,'OTRAS REFERENTES'!$AB:$AB,0),2))","v":""},null,null,null,null,{"$f":"IF(Q79=\"\",\"\",INDEX(REFERENTES!$G:$H,MATCH(Q79,REFERENTES!$H:$H,0),1))","v":""},null,null,{"$f":"IF(R79=\"\",\"\",INDEX('OTRAS REFERENTES'!$AI:$AJ,MATCH(R79,'OTRAS REFERENTES'!$AJ:$AJ,0),1))","v":""},null,"","",null,null,null,null,{"$f":"IF(SUMPRODUCT(--EXACT(J79&M79,$AA$2:AA78)),\"\",J79&M79)","v":""},{"$f":"IF(SUMPRODUCT(--EXACT(J79&M79,$AA$2:AA78)),\"\",MAX($AB$3:AB78)+1)","v":""}]
[1,"",78,"","",{"$f":"IF(K80<>\"\",CONCATENATE(DIGITADOR!$B$2,$A$2,DIGITADOR!$M$1,A80),\"\")","v":""},null,null,"",null,{"$f":"IF(J80=\"\",\"\",INDEX('OTRAS REFERENTES'!$AB:$AC,MATCH(J80,'OTRAS REFERENTES'!$AB:$AB,0),2))","v":""},null,null,null,null,{"$f":"IF(Q80=\"\",\"\",INDEX(REFERENTES!$G:$H,MATCH(Q80,REFERENTES!$H:$H,0),1))","v":""},null,null,{"$f":"IF(R80=\"\",\"\",INDEX('OTRAS REFERENTES'!$AI:$AJ,MATCH(R80,'OTRAS REFERENTES'!$AJ:$AJ,0),1))","v":""},null,"","",null,null,null,null,{"$f":"IF(SUMPRODUCT(--EXACT(J80&M80,$AA$2:AA79)),\"\",J80&M80)","v":""},{"$f":"IF(SUMPRODUCT(--EXACT(J80&M80,$AA$2:AA79)),\"\",MAX($AB$3:AB79)+1)","v":""}]
[1,"",79,"","",{"$f":"IF(K81<>\"\",CONCATENATE(DIGITADOR!$B$2,$A$2,DIGITADOR!$M$1,A81),\"\")","v":""},null,null,"",null,{"$f":"IF(J81=\"\",\"\",INDEX('OTRAS REFERENTES'!$AB:$AC,MATCH(J81,'OTRAS REFERENTES'!$AB:$AB,0),2))","v":""},null,null,null,null,{"$f":"IF(Q81=\"\",\"\",INDEX(REFERENTES!$G:$H,MATCH(Q81,REFERENTES!$H:$H,0),1))","v":""},null,null,{"$f":"IF(R81=\"\",\"\",INDEX('OTRAS REFERENTES'!$AI:$AJ,MATCH(R81,'OTRAS REFERENTES'!$AJ:$AJ,0),1))","v":""},null,"","",null,null,null,null,{"$f":"IF(SUMPRODUCT(--EXACT(J81&M81,$AA$2:AA80)),\"\",J81&M81)","v":""},{"$f":"IF(SUMPRODUCT(--EXACT(J81&M81,$AA$2:AA80)),\"\",MAX($AB$3:AB80)+1)","v":""}]
[1,"",80,"","",{"$f":"IF(K82<>\"\",CONCATENATE(DIGITADOR!$B$2,$A$2,DIGITADOR!$M$1,A82),\"\")","v":""},null,null,"",null,{"$f":"IF(J82=\"\",\"\",INDEX('OTRAS REFERENTES'!$AB:$AC,MATCH(J82,'OTRAS REFERENTES'!$AB:$AB,0),2))","v":""},null,null,null,null,{"$f":"IF(Q82=\"\",\"\",INDEX(REFERENTES!$G:$H,MATCH(Q82,REFERENTES!$H:$H,0),1))","v":""},null,null,{"$f":"IF(R82=\"\",\"\",INDEX('OTRAS REFERENTES'!$AI:$AJ,MATCH(R82,'OTRAS REFERENTES'!$AJ:$AJ,0),1))","v":""},null,"","",null,null,null,null,{"$f":"IF(SUMPRODUCT(--EXACT(J82&M82,$AA$2:AA81)),\"\",J82&M82)","v":""},{"$f":"IF(SUMPRODUCT(--EXACT(J82&M82,$AA$2:AA81)),\"\",MAX($AB$3:AB81)+1)","v":""}]
[1,"",81,"","",{"$f":"IF(K83<>\"\",CONCATENATE(DIGITADOR!$B$2,$A$2,DIGITADOR!$M$1,A83),\"\")","v":""},null,null,"",null,{"$f":"IF(J83=\"\",\"\",INDEX('OTRAS REFERENTES'!$AB:$AC,MATCH(J83,'OTRAS REFERENTES'!$AB:$AB,0),2))","v":""},null,null,null,null,{"$f":"IF(Q83=\"\",\"\",INDEX(REFERENTES!$G:$H,MATCH(Q83,REFERENTES!$H:$H,0),1))","v":""},null,null,{"$f":"IF(R83=\"\",\"\",INDEX('OTRAS REFERENTES'!$AI:$AJ,MATCH(R83,'OTRAS REFERENTES'!$AJ:$AJ,0),1))","v":""},null,"","",null,null,null,null,{"$f":"IF(SUMPRODUCT(--EXACT(J83&M83,$AA$2:AA82)),\"\",J83&M83)","v":""},{"$f":"IF(SUMPRODUCT(--EXACT(J83&M83,$AA$2:AA82)),\"\",MAX($AB$3:AB82)+1)","v":""}]
[1,"",82,"","",{"$f":"IF(K84<>\"\",CONCATENATE(DIGITADOR!$B$2,$A$2,DIGITADOR!$M$1,A84),\"\")","v":""},null,null,"",null,{"$f":"IF(J84=\"\",\"\",INDEX('OTRAS REFERENTES'!$AB:$AC,MATCH(J84,'OTRAS REFERENTES'!$AB:$AB,0),2))","v":""},null,null,null,null,{"$f":"IF(Q84=\"\",\"\",INDEX(REFERENTES!$G:$H,MATCH(Q84,REFERENTES!$H:$H,0),1))","v":""},null,null,{"$f":"IF(R84=\"\",\"\",INDEX('OTRAS REFERENTES'!$AI:$AJ,MATCH(R84,'OTRAS REFERENTES'!$AJ:$AJ,0),1))","v":""},null,"","",null,null,null,null,{"$f":"IF(SUMPRODUCT(--EXACT(J84&M84,$AA$2:AA83)),\"\",J84&M84)","v":""},{"$f":"IF(SUMPRODUCT(--EXACT(J84&M84,$AA$2:AA83)),\"\",MAX($AB$3:AB83)+1)","v":""}]
[1,"",83,"","",{"$f":"IF(K85<>\"\",CONCATENATE(DIGITADOR!$B$2,$A$2,DIGITADOR!$M$1,A85),\"\")","v":""},null,null,"",null,{"$f":"IF(J85=\"\",\"\",INDEX('OTRAS REFERENTES'!$AB:$AC,MATCH(J85,'OTRAS REFERENTES'!$AB:$AB,0),2))","v":""},null,null,null,null,{"$f":"IF(Q85=\"\",\"\",INDEX(REFERENTES!$G:$H,MATCH(Q85,REFERENTES!$H:$H,0),1))","v":""},null,null,{"$f":"IF(R85=\"\",\"\",INDEX('OTRAS REFERENTES'!$AI:$AJ,MATCH(R85,'OTRAS REFERENTES'!$AJ:$AJ,0),1))","v":""},null,"","",null,null,null,null,{"$f":"IF(SUMPRODUCT(--EXACT(J85&M85,$AA$2:AA84)),\"\",J85&M85)","v":""},{"$f":"IF(SUMPRODUCT(--EXACT(J85&M85,$AA$2:AA84)),\"\",MAX($AB$3:AB84)+1)","v":""}]
[1,"",84,"","",{"$f":"IF(K86<>\"\",CONCATENATE(DIGITADOR!$B$2,$A$2,DIGITADOR!$M$1,A86),\"\")","v":""},null,null,"",null,{"$f":"IF(J86=\"\",\"\",INDEX('OTRAS REFERENTES'!$AB:$AC,MATCH(J86,'OTRAS REFERENTES'!$AB:$AB,0),2))","v":""},null,null,null,null,{"$f":"IF(Q86=\"\",\"\",INDEX(REFERENTES!$G:$H,MATCH(Q86,REFERENTES!$H:$H,0),1))","v":""},null,null,{"$f":"IF(R86=\"\",\"\",INDEX('OTRAS REFERENTES'!$AI:$AJ,MATCH(R86,'OTRAS REFERENTES'!$AJ:$AJ,0),1))","v":""},null,"","",null,null,null,null,{"$f":"IF(SUMPRODUCT(--EXACT(J86&M86,$AA$2:AA85)),\"\",J86&M86)","v":""},{"$f":"IF(SUMPRODUCT(--EXACT(J86&M86,$AA$2:AA85)),\"\",MAX($AB$3:AB85)+1)","v":""}]
[1,"",85,"","",{"$f":"IF(K87<>\"\",CONCATENATE(DIGITADOR!$B$2,$A$2,DIGITADOR!$M$1,A87),\"\")","v":""},null,null,"",null,{"$f":"IF(J87=\"\",\"\",INDEX('OTRAS REFERENTES'!$AB:$AC,MATCH(J87,'OTRAS REFERENTES'!$AB:$AB,0),2))","v":""},null,null,null,null,{"$f":"IF(Q87=\"\",\"\",INDEX(REFERENTES!$G:$H,MATCH(Q87,REFERENTES!$H:$H,0),1))","v":""},null,null,{"$f":"IF(R87=\"\",\"\",INDEX('OTRAS REFERENTES'!$AI:$AJ,MATCH(R87,'OTRAS REFERENTES'!$AJ:$AJ,0),1))","v":""},null,"","",null,null,null,null,{"$f":"IF(SUMPRODUCT(--EXACT(J87&M87,$AA$2:AA86)),\"\",J87&M87)","v":""},{"$f":"IF(SUMPRODUCT(--EXACT(J87&M87,$AA$2:AA86)),\"\",MAX($AB$3:AB86)+1)","v":""}]
[1,"",86,"","",{"$f":"IF(K88<>\"\",CONCATENATE(DIGITADOR!$B$2,$A$2,DIGITADOR!$M$1,A88),\"\")","v":""},null,null,"",null,{"$f":"IF(J88=\"\",\"\",INDEX('OTRAS REFERENTES'!$AB:$AC,MATCH(J88,'OTRAS REFERENTES'!$AB:$AB,0),2))","v":""},null,null,null,null,{"$f":"IF(Q88=\"\",\"\",INDEX(REFERENTES!$G:$H,MATCH(Q88,REFERENTES!$H:$H,0),1))","v":""},null,null,{"$f":"IF(R88=\"\",\"\",INDEX('OTRAS REFERENTES'!$AI:$AJ,MATCH(R88,'OTRAS REFERENTES'!$AJ:$AJ,0),1))","v":""},null,"","",null,null,null,null,{"$f":"IF(SUMPRODUCT(--EXACT(J88&M88,$AA$2:AA87)),\"\",J88&M88)","v":""},{"$f":"IF(SUMPRODUCT(--EXACT(J88&M88,$AA$2:AA87)),\"\",MAX($AB$3:AB87)+1)","v":""}]
[1,"",87,"","",{"$f":"IF(K89<>\"\",CONCATENATE(DIGITADOR!$B$2,$A$2,DIGITADOR!$M$1,A89),\"\")","v":""},null,null,"",null,{"$f":"IF(J89=\"\",\"\",INDEX('OTRAS REFERENTES'!$AB:$AC,MATCH(J89,'OTRAS REFERENTES'!$AB:$AB,0),2))","v":""},null,null,null,null,{"$f":"IF(Q89=\"\",\"\",INDEX(REFERENTES!$G:$H,MATCH(Q89,REFERENTES!$H:$H,0),1))","v":""},null,null,{"$f":"IF(R89=\"\",\"\",INDEX('OTRAS REFERENTES'!$AI:$AJ,MATCH(R89,'OTRAS REFERENTES'!$AJ:$AJ,0),1))","v":""},null,"","",null,null,null,null,{"$f":"IF(SUMPRODUCT(--EXACT(J89&M89,$AA$2:AA88)),\"\",J89&M89)","v":""},{"$f":"IF(SUMPRODUCT(--EXACT(J89&M89,$AA$2:AA88)),\"\",MAX($AB$3:AB88)+1)","v":""}]
[1,"",88,"","",{"$f":"IF(K90<>\"\",CONCATENATE(DIGITADOR!$B$2,$A$2,DIGITADOR!$M$1,A90),\"\")","v":""},null,null,"",null,{"$f":"IF(J90=\"\",\"\",INDEX('OTRAS REFERENTES'!$AB:$AC,MATCH(J90,'OTRAS REFERENTES'!$AB:$AB,0),2))","v":""},null,null,null,null,{"$f":"IF(Q90=\"\",\"\",INDEX(REFERENTES!$G:$H,MATCH(Q90,REFERENTES!$H:$H,0),1))","v":""},null,null,{"$f":"IF(R90=\"\",\"\",INDEX('OTRAS REFERENTES'!$AI:$AJ,MATCH(R90,'OTRAS REFERENTES'!$AJ:$AJ,0),1))","v":""},null,"","",null,null,null,null,{"$f":"IF(SUMPRODUCT(--EXACT(J90&M90,$AA$2:AA89)),\"\",J90&M90)","v":""},{"$f":"IF(SUMPRODUCT(--EXACT(J90&M90,$AA$2:AA89)),\"\",MAX($AB$3:AB89)+1)","v":""}]
[1,"",89,"","",{"$f":"IF(K91<>\"\",CONCATENATE(DIGITADOR!$B$2,$A$2,DIGITADOR!$M$1,A91),\"\")","v":""},null,null,"",null,{"$f":"IF(J91=\"\",\"\",INDEX('OTRAS REFERENTES'!$AB:$AC,MATCH(J91,'OTRAS REFERENTES'!$AB:$AB,0),2))","v":""},null,null,null,null,{"$f":"IF(Q91=\"\",\"\",INDEX(REFERENTES!$G:$H,MATCH(Q91,REFERENTES!$H:$H,0),1))","v":""},null,null,{"$f":"IF(R91=\"\",\"\",INDEX('OTRAS REFERENTES'!$AI:$AJ,MATCH(R91,'OTRAS REFERENTES'!$AJ:$AJ,0),1))","v":""},null,"","",null,null,null,null,{"$f":"IF(SUMPRODUCT(--EXACT(J91&M91,$AA$2:AA90)),\"\",J91&M91)","v":""},{"$f":"IF(SUMPRODUCT(--EXACT(J91&M91,$AA$2:AA90)),\"\",MAX($AB$3:AB90)+1)","v":""}]
[1,"",90,"","",{"$f":"IF(K92<>\"\",CONCATENATE(DIGITADOR!$B$2,$A$2,DIGITADOR!$M$1,A92),\"\")","v":""},null,null,"",null,{"$f":"IF(J92=\"\",\"\",INDEX('OTRAS REFERENTES'!$AB:$AC,MATCH(J92,'OTRAS REFERENTES'!$AB:$AB,0),2))","v":""},null,null,null,null,{"$f":"IF(Q92=\"\",\"\",INDEX(REFERENTES!$G:$H,MATCH(Q92,REFERENTES!$H:$H,0),1))","v":""},null,null,{"$f":"IF(R92=\"\",\"\",INDEX('OTRAS REFERENTES'!$AI:$AJ,MATCH(R92,'OTRAS REFERENTES'!$AJ:$AJ,0),1))","v":""},null,"","",null,null,null,null,{"$f":"IF(SUMPRODUCT(--EXACT(J92&M92,$AA$2:AA91)),\"\",J92&M92)","v":""},{"$f":"IF(SUMPRODUCT(--EXACT(J92&M92,$AA$2:AA91)),\"\",MAX($AB$3:AB91)+1)","v":""}]
[1,"",91,"","",{"$f":"IF(K93<>\"\",CONCATENATE(DIGITADOR!$B$2,$A$2,DIGITADOR!$M$1,A93),\"\")","v":""},null,null,"",null,{"$f":"IF(J93=\"\",\"\",INDEX('OTRAS REFERENTES'!$AB:$AC,MATCH(J93,'OTRAS REFERENTES'!$AB:$AB,0),2))","v":""},null,null,null,null,{"$f":"IF(Q93=\"\",\"\",INDEX(REFERENTES!$G:$H,MATCH(Q93,REFERENTES!$H:$H,0),1))","v":""},null,null,{"$f":"IF(R93=\"\",\"\",INDEX('OTRAS REFERENTES'!$AI:$AJ,MATCH(R93,'OTRAS REFERENTES'!$AJ:$AJ,0),1))","v":""},null,"","",null,null,null,null,{"$f":"IF(SUMPRODUCT(--EXACT(J93&M93,$AA$2:AA92)),\"\",J93&M93)","v":""},{"$f":"IF(SUMPRODUCT(--EXACT(J93&M93,$AA$2:AA92)),\"\",MAX($AB$3:AB92)+1)","v":""}]
[1,"",92,"","",{"$f":"IF(K94<>\"\",CONCATENATE(DIGITADOR!$B$2,$A$2,DIGITADOR!$M$1,A94),\"\")","v":""},null,null,"",null,{"$f":"IF(J94=\"\",\"\",INDEX('OTRAS REFERENTES'!$AB:$AC,MATCH(J94,'OTRAS REFERENTES'!$AB:$AB,0),2))","v":""},null,null,null,null,{"$f":"IF(Q94=\"\",\"\",INDEX(REFERENTES!$G:$H,MATCH(Q94,REFERENTES!$H:$H,0),1))","v":""},null,null,{"$f":"IF(R94=\"\",\"\",INDEX('OTRAS REFERENTES'!$AI:$AJ,MATCH(R94,'OTRAS REFERENTES'!$AJ:$AJ,0),1))","v":""},null,"","",null,null,null,null,{"$f":"IF(SUMPRODUCT(--EXACT(J94&M94,$AA$2:AA93)),\"\",J94&M94)","v":""},{"$f":"IF(SUMPRODUCT(--EXACT(J94&M94,$AA$2:AA93)),\"\",MAX($AB$3:AB93)+1)","v":""}]
[1,"",93,"","",{"$f":"IF(K95<>\"\",CONCATENATE(DIGITADOR!$B$2,$A$2,DIGITADOR!$M$1,A95),\"\")","v":""},null,null,"",null,{"$f":"IF(J95=\"\",\"\",INDEX('OTRAS REFERENTES'!$AB:$AC,MATCH(J95,'OTRAS REFERENTES'!$AB:$AB,0),2))","v":""},null,null,null,null,{"$f":"IF(Q95=\"\",\"\",INDEX(REFERENTES!$G:$H,MATCH(Q95,REFERENTES!$H:$H,0),1))","v":""},null,null,{"$f":"IF(R95=\"\",\"\",INDEX('OTRAS REFERENTES'!$AI:$AJ,MATCH(R95,'OTRAS REFERENTES'!$AJ:$AJ,0),1))","v":""},null,"","",null,null,null,null,{"$f":"IF(SUMPRODUCT(--EXACT(J95&M95,$AA$2:AA94)),\"\",J95&M95)","v":""},{"$f":"IF(SUMPRODUCT(--EXACT(J95&M95,$AA$2:AA94)),\"\",MAX($AB$3:AB94)+1)","v":""}]
[1,"",94,"","",{"$f":"IF(K96<>\"\",CONCATENATE(DIGITADOR!$B$2,$A$2,DIGITADOR!$M$1,A96),\"\")","v":""},null,null,"",null,{"$f":"IF(J96=\"\",\"\",INDEX('OTRAS REFERENTES'!$AB:$AC,MATCH(J96,'OTRAS REFERENTES'!$AB:$AB,0),2))","v":""},null,null,null,null,{"$f":"IF(Q96=\"\",\"\",INDEX(REFERENTES!$G:$H,MATCH(Q96,REFERENTES!$H:$H,0),1))","v":""},null,null,{"$f":"IF(R96=\"\",\"\",INDEX('OTRAS REFERENTES'!$AI:$AJ,MATCH(R96,'OTRAS REFERENTES'!$AJ:$AJ,0),1))","v":""},null,"","",null,null,null,null,{"$f":"IF(SUMPRODUCT(--EXACT(J96&M96,$AA$2:AA95)),\"\",J96&M96)","v":""},{"$f":"IF(SUMPRODUCT(--EXACT(J96&M96,$AA$2:AA95)),\"\",MAX($AB$3:AB95)+1)","v":""}]
[1,"",95,"","",{"$f":"IF(K97<>\"\",CONCATENATE(DIGITADOR!$B$2,$A$2,DIGITADOR!$M$1,A97),\"\")","v":""},null,null,"",null,{"$f":"IF(J97=\"\",\"\",INDEX('OTRAS REFERENTES'!$AB:$AC,MATCH(J97,'OTRAS REFERENTES'!$AB:$AB,0),2))","v":""},null,null,null,null,{"$f":"IF(Q97=\"\",\"\",INDEX(REFERENTES!$G:$H,MATCH(Q97,REFERENTES!$H:$H,0),1))","v":""},null,null,{"$f":"IF(R97=\"\",\"\",INDEX('OTRAS REFERENTES'!$AI:$AJ,MATCH(R97,'OTRAS REFERENTES'!$AJ:$AJ,0),1))","v":""},null,"","",null,null,null,null,{"$f":"IF(SUMPRODUCT(--EXACT(J97&M97,$AA$2:AA96)),\"\",J97&M97)","v":""},{"$f":"IF(SUMPRODUCT(--EXACT(J97&M97,$AA$2:AA96)),\"\",MAX($AB$3:AB96)+1)","v":""}]
[1,"",96,"","",{"$f":"IF(K98<>\"\",CONCATENATE(DIGITADOR!$B$2,$A$2,DIGITADOR!$M$1,A98),\"\")","v":""},null,null,"",null,{"$f":"IF(J98=\"\",\"\",INDEX('OTRAS REFERENTES'!$AB:$AC,MATCH(J98,'OTRAS REFERENTES'!$AB:$AB,0),2))","v":""},null,null,null,null,{"$f":"IF(Q98=\"\",\"\",INDEX(REFERENTES!$G:$H,MATCH(Q98,REFERENTES!$H:$H,0),1))","v":""},null,null,{"$f":"IF(R98=\"\",\"\",INDEX('OTRAS REFERENTES'!$AI:$AJ,MATCH(R98,'OTRAS REFERENTES'!$AJ:$AJ,0),1))","v":""},null,"","",null,null,null,null,{"$f":"IF(SUMPRODUCT(--EXACT(J98&M98,$AA$2:AA97)),\"\",J98&M98)","v":""},{"$f":"IF(SUMPRODUCT(--EXACT(J98&M98,$AA$2:AA97)),\"\",MAX($AB$3:AB97)+1)","v":""}]
[1,"",97,"","",{"$f":"IF(K99<>\"\",CONCATENATE(DIGITADOR!$B$2,$A$2,DIGITADOR!$M$1,A99),\"\")","v":""},null,null,{"$f":"IF(G99<>\"\",G99+H99,\"\")","v":""},null,{"$f":"IF(J99=\"\",\"\",INDEX('OTRAS REFERENTES'!$AB:$AC,MATCH(J99,'OTRAS REFERENTES'!$AB:$AB,0),2))","v":""},null,null,null,null,{"$f":"IF(Q99=\"\",\"\",INDEX(REFERENTES!$G:$H,MATCH(Q99,REFERENTES!$H:$H,0),1))","v":""},null,null,{"$f":"IF(R99=\"\",\"\",INDEX('OTRAS REFERENTES'!$AI:$AJ,MATCH(R99,'OTRAS REFERENTES'!$AJ:$AJ,0),1))","v":""},null,{"$f":"IF(T99=\"\",\"\",IF(AND(T99>=0,T99<=50),\"De 0 cm a 50 cm\",IF(AND(T99>50,T99<=150),\"De 50 cm a 150 cm\",\"Mayor a 150 cm\")))","v":""},{"$f":"IF(T99=\"\",LEFT(U99,1),IF(T99=\"\",\"\",IF(AND(T99>=0,T99<=50),\"A\",IF(AND(T99>50,T99<=150),\"B\",\"C\"))))","v":""},null,null,null,null,{"$f":"IF(SUMPRODUCT(--EXACT(J99&M99,$AA$2:AA98)),\"\",J99&M99)","v":""},{"$f":"IF(SUMPRODUCT(--EXACT(J99&M99,$AA$2:AA98)),\"\",MAX($AB$3:AB98)+1)","v":""}]
[1,"",98,"","",{"$f":"IF(K100<>\"\",CONCATENATE(DIGITADOR!$B$2,$A$2,DIGITADOR!$M$1,A100),\"\")","v":""},null,null,"",null,{"$f":"IF(J100=\"\",\"\",INDEX('OTRAS REFERENTES'!$AB:$AC,MATCH(J100,'OTRAS REFERENTES'!$AB:$AB,0),2))","v":""},null,null,null,null,{"$f":"IF(Q100=\"\",\"\",INDEX(REFERENTES!$G:$H,MATCH(Q100,REFERENTES!$H:$H,0),1))","v":""},null,null,{"$f":"IF(R100=\"\",\"\",INDEX('OTRAS REFERENTES'!$AI:$AJ,MATCH(R100,'OTRAS REFERENTES'!$AJ:$AJ,0),1))","v":""},null,"","",null,null,null,null,{"$f":"IF(SUMPRODUCT(--EXACT(J100&M100,$AA$2:AA99)),\"\",J100&M100)","v":""},{"$f":"IF(SUMPRODUCT(--EXACT(J100&M100,$AA$2:AA99)),\"\",MAX($AB$3:AB99)+1)","v":""}]
[1,"",99,"","",{"$f":"IF(K101<>\"\",CONCATENATE(DIGITADOR!$B$2,$A$2,DIGITADOR!$M$1,A101),\"\")","v":""},null,null,"",null,{"$f":"IF(J101=\"\",\"\",INDEX('OTRAS REFERENTES'!$AB:$AC,MATCH(J101,'OTRAS REFERENTES'!$AB:$AB,0),2))","v":""},null,null,null,null,{"$f":"IF(Q101=\"\",\"\",INDEX(REFERENTES!$G:$H,MATCH(Q101,REFERENTES!$H:$H,0),1))","v":""},null,null,{"$f":"IF(R101=\"\",\"\",INDEX('OTRAS REFERENTES'!$AI:$AJ,MATCH(R101,'OTRAS REFERENTES'!$AJ:$AJ,0),1))","v":""},null,"","",null,null,null,null,{"$f":"IF(SUMPRODUCT(--EXACT(J101&M101,$AA$2:AA100)),\"\",J101&M101)","v":""},{"$f":"IF(SUMPRODUCT(--EXACT(J101&M101,$AA$2:AA100)),\"\",MAX($AB$3:AB100)+1)","v":""}]
[1,"",100,"","",{"$f":"IF(K102<>\"\",CONCATENATE(DIGITADOR!$B$2,$A$2,DIGITADOR!$M$1,A102),\"\")","v":""},null,null,"",null,{"$f":"IF(J102=\"\",\"\",INDEX('OTRAS REFERENTES'!$AB:$AC,MATCH(J102,'OTRAS REFERENTES'!$AB:$AB,0),2))","v":""},null,null,null,null,{"$f":"IF(Q102=\"\",\"\",INDEX(REFERENTES!$G:$H,MATCH(Q102,REFERENTES!$H:$H,0),1))","v":""},null,null,{"$f":"IF(R102=\"\",\"\",INDEX('OTRAS REFERENTES'!$AI:$AJ,MATCH(R102,'OTRAS REFERENTES'!$AJ:$AJ,0),1))","v":""},null,"","",null,null,null,null,{"$f":"IF(SUMPRODUCT(--EXACT(J102&M102,$AA$2:AA101)),\"\",J102&M102)","v":""},{"$f":"IF(SUMPRODUCT(--EXACT(J102&M102,$AA$2:AA101)),\"\",MAX($AB$3:AB101)+1)","v":""}]
[1,"",101,"","",{"$f":"IF(K103<>\"\",CONCATENATE(DIGITADOR!$B$2,$A$2,DIGITADOR!$M$1,A103),\"\")","v":""},null,null,"",null,{"$f":"IF(J103=\"\",\"\",INDEX('OTRAS REFERENTES'!$AB:$AC,MATCH(J103,'OTRAS REFERENTES'!$AB:$AB,0),2))","v":""},null,null,null,null,{"$f":"IF(Q103=\"\",\"\",INDEX(REFERENTES!$G:$H,MATCH(Q103,REFERENTES!$H:$H,0),1))","v":""},null,null,{"$f":"IF(R103=\"\",\"\",INDEX('OTRAS REFERENTES'!$AI:$AJ,MATCH(R103,'OTRAS REFERENTES'!$AJ:$AJ,0),1))","v":""},null,"","",null,null,null,null,{"$f":"IF(SUMPRODUCT(--EXACT(J103&M103,$AA$2:AA102)),\"\",J103&M103)","v":""},{"$f":"IF(SUMPRODUCT(--EXACT(J103&M103,$AA$2:AA102)),\"\",MAX($AB$3:AB102)+1)","v":""}]
[1,"",102,"","",{"$f":"IF(K104<>\"\",CONCATENATE(DIGITADOR!$B$2,$A$2,DIGITADOR!$M$1,A104),\"\")","v":""},null,null,"",null,{"$f":"IF(J104=\"\",\"\",INDEX('OTRAS REFERENTES'!$AB:$AC,MATCH(J104,'OTRAS REFERENTES'!$AB:$AB,0),2))","v":""},null,null,null,null,{"$f":"IF(Q104=\"\",\"\",INDEX(REFERENTES!$G:$H,MATCH(Q104,REFERENTES!$H:$H,0),1))","v":""},null,null,{"$f":"IF(R104=\"\",\"\",INDEX('OTRAS REFERENTES'!$AI:$AJ,MATCH(R104,'OTRAS REFERENTES'!$AJ:$AJ,0),1))","v":""},null,"","",null,null,null,null,{"$f":"IF(SUMPRODUCT(--EXACT(J104&M104,$AA$2:AA103)),\"\",J104&M104)","v":""},{"$f":"IF(SUMPRODUCT(--EXACT(J104&M104,$AA$2:AA103)),\"\",MAX($AB$3:AB103)+1)","v":""}]
[1,"",103,"","",{"$f":"IF(K105<>\"\",CONCATENATE(DIGITADOR!$B$2,$A$2,DIGITADOR!$M$1,A105),\"\")","v":""},null,null,"",null,{"$f":"IF(J105=\"\",\"\",INDEX('OTRAS REFERENTES'!$AB:$AC,MATCH(J105,'OTRAS REFERENTES'!$AB:$AB,0),2))","v":""},null,null,null,null,{"$f":"IF(Q105=\"\",\"\",INDEX(REFERENTES!$G:$H,MATCH(Q105,REFERENTES!$H:$H,0),1))","v":""},null,null,{"$f":"IF(R105=\"\",\"\",INDEX('OTRAS REFERENTES'!$AI:$AJ,MATCH(R105,'OTRAS REFERENTES'!$AJ:$AJ,0),1))","v":""},null,"","",null,null,null,null,{"$f":"IF(SUMPRODUCT(--EXACT(J105&M105,$AA$2:AA104)),\"\",J105&M105)","v":""},{"$f":"IF(SUMPRODUCT(--EXACT(J105&M105,$AA$2:AA104)),\"\",MAX($AB$3:AB104)+1)","v":""}]
[1,"",104,"","",{"$f":"IF(K106<>\"\",CONCATENATE(DIGITADOR!$B$2,$A$2,DIGITADOR!$M$1,A106),\"\")","v":""},null,null,"",null,{"$f":"IF(J106=\"\",\"\",INDEX('OTRAS REFERENTES'!$AB:$AC,MATCH(J106,'OTRAS REFERENTES'!$AB:$AB,0),2))","v":""},null,null,null,null,{"$f":"IF(Q106=\"\",\"\",INDEX(REFERENTES!$G:$H,MATCH(Q106,REFERENTES!$H:$H,0),1))","v":""},null,null,{"$f":"IF(R106=\"\",\"\",INDEX('OTRAS REFERENTES'!$AI:$AJ,MATCH(R106,'OTRAS REFERENTES'!$AJ:$AJ,0),1))","v":""},null,"","",null,null,null,null,{"$f":"IF(SUMPRODUCT(--EXACT(J106&M106,$AA$2:AA105)),\"\",J106&M106)","v":""},{"$f":"IF(SUMPRODUCT(--EXACT(J106&M106,$AA$2:AA105)),\"\",MAX($AB$3:AB105)+1)","v":""}]
[1,"",105,"","",{"$f":"IF(K107<>\"\",CONCATENATE(DIGITADOR!$B$2,$A$2,DIGITADOR!$M$1,A107),\"\")","v":""},null,null,"",null,{"$f":"IF(J107=\"\",\"\",INDEX('OTRAS REFERENTES'!$AB:$AC,MATCH(J107,'OTRAS REFERENTES'!$AB:$AB,0),2))","v":""},null,null,null,null,{"$f":"IF(Q107=\"\",\"\",INDEX(REFERENTES!$G:$H,MATCH(Q107,REFERENTES!$H:$H,0),1))","v":""},null,null,{"$f":"IF(R107=\"\",\"\",INDEX('OTRAS REFERENTES'!$AI:$AJ,MATCH(R107,'OTRAS REFERENTES'!$AJ:$AJ,0),1))","v":""},null,"","",null,null,null,null,{"$f":"IF(SUMPRODUCT(--EXACT(J107&M107,$AA$2:AA106)),\"\",J107&M107)","v":""},{"$f":"IF(SUMPRODUCT(--EXACT(J107&M107,$AA$2:AA106)),\"\",MAX($AB$3:AB106)+1)","v":""}]
[1,"",106,"","",{"$f":"IF(K108<>\"\",CONCATENATE(DIGITADOR!$B$2,$A$2,DIGITADOR!$M$1,A108),\"\")","v":""},null,null,"",null,{"$f":"IF(J108=\"\",\"\",INDEX('OTRAS REFERENTES'!$AB:$AC,MATCH(J108,'OTRAS REFERENTES'!$AB:$AB,0),2))","v":""},null,null,null,null,{"$f":"IF(Q108=\"\",\"\",INDEX(REFERENTES!$G:$H,MATCH(Q108,REFERENTES!$H:$H,0),1))","v":""},null,null,{"$f":"IF(R108=\"\",\"\",INDEX('OTRAS REFERENTES'!$AI:$AJ,MATCH(R108,'OTRAS REFERENTES'!$AJ:$AJ,0),1))","v":""},null,"","",null,null,null,null,{"$f":"IF(SUMPRODUCT(--EXACT(J108&M108,$AA$2:AA107)),\"\",J108&M108)","v":""},{"$f":"IF(SUMPRODUCT(--EXACT(J108&M108,$AA$2:AA107)),\"\",MAX($AB$3:AB107)+1)","v":""}]
[1,"",107,"","",{"$f":"IF(K109<>\"\",CONCATENATE(DIGITADOR!$B$2,$A$2,DIGITADOR!$M$1,A109),\"\")","v":""},null,null,"",null,{"$f":"IF(J109=\"\",\"\",INDEX('OTRAS REFERENTES'!$AB:$AC,MATCH(J109,'OTRAS REFERENTES'!$AB:$AB,0),2))","v":""},null,null,null,null,{"$f":"IF(Q109=\"\",\"\",INDEX(REFERENTES!$G:$H,MATCH(Q109,REFERENTES!$H:$H,0),1))","v":""},null,null,{"$f":"IF(R109=\"\",\"\",INDEX('OTRAS REFERENTES'!$AI:$AJ,MATCH(R109,'OTRAS REFERENTES'!$AJ:$AJ,0),1))","v":""},null,"","",null,null,null,null,{"$f":"IF(SUMPRODUCT(--EXACT(J109&M109,$AA$2:AA108)),\"\",J109&M109)","v":""},{"$f":"IF(SUMPRODUCT(--EXACT(J109&M109,$AA$2:AA108)),\"\",MAX($AB$3:AB108)+1)","v":""}]
[1,"",108,"","",{"$f":"IF(K110<>\"\",CONCATENATE(DIGITADOR!$B$2,$A$2,DIGITADOR!$M$1,A110),\"\")","v":""},null,null,"",null,{"$f":"IF(J110=\"\",\"\",INDEX('OTRAS REFERENTES'!$AB:$AC,MATCH(J110,'OTRAS REFERENTES'!$AB:$AB,0),2))","v":""},null,null,null,null,{"$f":"IF(Q110=\"\",\"\",INDEX(REFERENTES!$G:$H,MATCH(Q110,REFERENTES!$H:$H,0),1))","v":""},null,null,{"$f":"IF(R110=\"\",\"\",INDEX('OTRAS REFERENTES'!$AI:$AJ,MATCH(R110,'OTRAS REFERENTES'!$AJ:$AJ,0),1))","v":""},null,"","",null,null,null,null,{"$f":"IF(SUMPRODUCT(--EXACT(J110&M110,$AA$2:AA109)),\"\",J110&M110)","v":""},{"$f":"IF(SUMPRODUCT(--EXACT(J110&M110,$AA$2:AA109)),\"\",MAX($AB$3:AB109)+1)","v":""}]
[1,"",109,"","",{"$f":"IF(K111<>\"\",CONCATENATE(DIGITADOR!$B$2,$A$2,DIGITADOR!$M$1,A111),\"\")","v":""},null,null,"",null,{"$f":"IF(J111=\"\",\"\",INDEX('OTRAS REFERENTES'!$AB:$AC,MATCH(J111,'OTRAS REFERENTES'!$AB:$AB,0),2))","v":""},null,null,null,null,{"$f":"IF(Q111=\"\",\"\",INDEX(REFERENTES!$G:$H,MATCH(Q111,REFERENTES!$H:$H,0),1))","v":""},null,null,{"$f":"IF(R111=\"\",\"\",INDEX('OTRAS REFERENTES'!$AI:$AJ,MATCH(R111,'OTRAS REFERENTES'!$AJ:$AJ,0),1))","v":""},null,"","",null,null,null,null,{"$f":"IF(SUMPRODUCT(--EXACT(J111&M111,$AA$2:AA110)),\"\",J111&M111)","v":""},{"$f":"IF(SUMPRODUCT(--EXACT(J111&M111,$AA$2:AA110)),\"\",MAX($AB$3:AB110)+1)","v":""}]
[1,"",110,"","",{"$f":"IF(K112<>\"\",CONCATENATE(DIGITADOR!$B$2,$A$2,DIGITADOR!$M$1,A112),\"\")","v":""},null,null,"",null,{"$f":"IF(J112=\"\",\"\",INDEX('OTRAS REFERENTES'!$AB:$AC,MATCH(J112,'OTRAS REFERENTES'!$AB:$AB,0),2))","v":""},null,null,null,null,{"$f":"IF(Q112=\"\",\"\",INDEX(REFERENTES!$G:$H,MATCH(Q112,REFERENTES!$H:$H,0),1))","v":""},null,null,{"$f":"IF(R112=\"\",\"\",INDEX('OTRAS REFERENTES'!$AI:$AJ,MATCH(R112,'OTRAS REFERENTES'!$AJ:$AJ,0),1))","v":""},null,"","",null,null,null,null,{"$f":"IF(SUMPRODUCT(--EXACT(J112&M112,$AA$2:AA111)),\"\",J112&M112)","v":""},{"$f":"IF(SUMPRODUCT(--EXACT(J112&M112,$AA$2:AA111)),\"\",MAX($AB$3:AB111)+1)","v":""}]
[1,"",111,"","",{"$f":"IF(K113<>\"\",CONCATENATE(DIGITADOR!$B$2,$A$2,DIGITADOR!$M$1,A113),\"\")","v":""},null,null,"",null,{"$f":"IF(J113=\"\",\"\",INDEX('OTRAS REFERENTES'!$AB:$AC,MATCH(J113,'OTRAS REFERENTES'!$AB:$AB,0),2))","v":""},null,null,null,null,{"$f":"IF(Q113=\"\",\"\",INDEX(REFERENTES!$G:$H,MATCH(Q113,REFERENTES!$H:$H,0),1))","v":""},null,null,{"$f":"IF(R113=\"\",\"\",INDEX('OTRAS REFERENTES'!$AI:$AJ,MATCH(R113,'OTRAS REFERENTES'!$AJ:$AJ,0),1))","v":""},null,"","",null,null,null,null,{"$f":"IF(SUMPRODUCT(--EXACT(J113&M113,$AA$2:AA112)),\"\",J113&M113)","v":""},{"$f":"IF(SUMPRODUCT(--EXACT(J113&M113,$AA$2:AA112)),\"\",MAX($AB$3:AB112)+1)","v":""}]
[1,"",112,"","",{"$f":"IF(K114<>\"\",CONCATENATE(DIGITADOR!$B$2,$A$2,DIGITADOR!$M$1,A114),\"\")","v":""},null,null,"",null,{"$f":"IF(J114=\"\",\"\",INDEX('OTRAS REFERENTES'!$AB:$AC,MATCH(J114,'OTRAS REFERENTES'!$AB:$AB,0),2))","v":""},null,null,null,null,{"$f":"IF(Q114=\"\",\"\",INDEX(REFERENTES!$G:$H,MATCH(Q114,REFERENTES!$H:$H,0),1))","v":""},null,null,{"$f":"IF(R114=\"\",\"\",INDEX('OTRAS REFERENTES'!$AI:$AJ,MATCH(R114,'OTRAS REFERENTES'!$AJ:$AJ,0),1))","v":""},null,"","",null,null,null,null,{"$f":"IF(SUMPRODUCT(--EXACT(J114&M114,$AA$2:AA113)),\"\",J114&M114)","v":""},{"$f":"IF(SUMPRODUCT(--EXACT(J114&M114,$AA$2:AA113)),\"\",MAX($AB$3:AB113)+1)","v":""}]
[1,"",113,"","",{"$f":"IF(K115<>\"\",CONCATENATE(DIGITADOR!$B$2,$A$2,DIGITADOR!$M$1,A115),\"\")","v":""},null,null,"",null,{"$f":"IF(J115=\"\",\"\",INDEX('OTRAS REFERENTES'!$AB:$AC,MATCH(J115,'OTRAS REFERENTES'!$AB:$AB,0),2))","v":""},null,null,null,null,{"$f":"IF(Q115=\"\",\"\",INDEX(REFERENTES!$G:$H,MATCH(Q115,REFERENTES!$H:$H,0),1))","v":""},null,null,{"$f":"IF(R115=\"\",\"\",INDEX('OTRAS REFERENTES'!$AI:$AJ,MATCH(R115,'OTRAS REFERENTES'!$AJ:$AJ,0),1))","v":""},null,"","",null,null,null,null,{"$f":"IF(SUMPRODUCT(--EXACT(J115&M115,$AA$2:AA114)),\"\",J115&M115)","v":""},{"$f":"IF(SUMPRODUCT(--EXACT(J115&M115,$AA$2:AA114)),\"\",MAX($AB$3:AB114)+1)","v":""}]
[1,"",114,"","",{"$f":"IF(K116<>\"\",CONCATENATE(DIGITADOR!$B$2,$A$2,DIGITADOR!$M$1,A116),\"\")","v":""},null,null,"",null,{"$f":"IF(J116=\"\",\"\",INDEX('OTRAS REFERENTES'!$AB:$AC,MATCH(J116,'OTRAS REFERENTES'!$AB:$AB,0),2))","v":""},null,null,null,null,{"$f":"IF(Q116=\"\",\"\",INDEX(REFERENTES!$G:$H,MATCH(Q116,REFERENTES!$H:$H,0),1))","v":""},null,null,{"$f":"IF(R116=\"\",\"\",INDEX('OTRAS REFERENTES'!$AI:$AJ,MATCH(R116,'OTRAS REFERENTES'!$AJ:$AJ,0),1))","v":""},null,"","",null,null,null,null,{"$f":"IF(SUMPRODUCT(--EXACT(J116&M116,$AA$2:AA115)),\"\",J116&M116)","v":""},{"$f":"IF(SUMPRODUCT(--EXACT(J116&M116,$AA$2:AA115)),\"\",MAX($AB$3:AB115)+1)","v":""}]
[1,"",115,"","",{"$f":"IF(K117<>\"\",CONCATENATE(DIGITADOR!$B$2,$A$2,DIGITADOR!$M$1,A117),\"\")","v":""},null,null,"",null,{"$f":"IF(J117=\"\",\"\",INDEX('OTRAS REFERENTES'!$AB:$AC,MATCH(J117,'OTRAS REFERENTES'!$AB:$AB,0),2))","v":""},null,null,null,null,{"$f":"IF(Q117=\"\",\"\",INDEX(REFERENTES!$G:$H,MATCH(Q117,REFERENTES!$H:$H,0),1))","v":""},null,null,{"$f":"IF(R117=\"\",\"\",INDEX('OTRAS REFERENTES'!$AI:$AJ,MATCH(R117,'OTRAS REFERENTES'!$AJ:$AJ,0),1))","v":""},null,"","",null,null,null,null,{"$f":"IF(SUMPRODUCT(--EXACT(J117&M117,$AA$2:AA116)),\"\",J117&M117)","v":""},{"$f":"IF(SUMPRODUCT(--EXACT(J117&M117,$AA$2:AA116)),\"\",MAX($AB$3:AB116)+1)","v":""}]
[1,"",116,"","",{"$f":"IF(K118<>\"\",CONCATENATE(DIGITADOR!$B$2,$A$2,DIGITADOR!$M$1,A118),\"\")","v":""},null,null,"",null,{"$f":"IF(J118=\"\",\"\",INDEX('OTRAS REFERENTES'!$AB:$AC,MATCH(J118,'OTRAS REFERENTES'!$AB:$AB,0),2))","v":""},null,null,null,null,{"$f":"IF(Q118=\"\",\"\",INDEX(REFERENTES!$G:$H,MATCH(Q118,REFERENTES!$H:$H,0),1))","v":""},null,null,{"$f":"IF(R118=\"\",\"\",INDEX('OTRAS REFERENTES'!$AI:$AJ,MATCH(R118,'OTRAS REFERENTES'!$AJ:$AJ,0),1))","v":""},null,"","",null,null,null,null,{"$f":"IF(SUMPRODUCT(--EXACT(J118&M118,$AA$2:AA117)),\"\",J118&M118)","v":""},{"$f":"IF(SUMPRODUCT(--EXACT(J118&M118,$AA$2:AA117)),\"\",MAX($AB$3:AB117)+1)","v":""}]
[1,"",117,"","",{"$f":"IF(K119<>\"\",CONCATENATE(DIGITADOR!$B$2,$A$2,DIGITADOR!$M$1,A119),\"\")","v":""},null,null,"",null,{"$f":"IF(J119=\"\",\"\",INDEX('OTRAS REFERENTES'!$AB:$AC,MATCH(J119,'OTRAS REFERENTES'!$AB:$AB,0),2))","v":""},null,null,null,null,{"$f":"IF(Q119=\"\",\"\",INDEX(REFERENTES!$G:$H,MATCH(Q119,REFERENTES!$H:$H,0),1))","v":""},null,null,{"$f":"IF(R119=\"\",\"\",INDEX('OTRAS REFERENTES'!$AI:$AJ,MATCH(R119,'OTRAS REFERENTES'!$AJ:$AJ,0),1))","v":""},null,"","",null,null,null,null,{"$f":"IF(SUMPRODUCT(--EXACT(J119&M119,$AA$2:AA118)),\"\",J119&M119)","v":""},{"$f":"IF(SUMPRODUCT(--EXACT(J119&M119,$AA$2:AA118)),\"\",MAX($AB$3:AB118)+1)","v":""}]
[1,"",118,"","",{"$f":"IF(K120<>\"\",CONCATENATE(DIGITADOR!$B$2,$A$2,DIGITADOR!$M$1,A120),\"\")","v":""},null,null,"",null,{"$f":"IF(J120=\"\",\"\",INDEX('OTRAS REFERENTES'!$AB:$AC,MATCH(J120,'OTRAS REFERENTES'!$AB:$AB,0),2))","v":""},null,null,null,null,{"$f":"IF(Q120=\"\",\"\",INDEX(REFERENTES!$G:$H,MATCH(Q120,REFERENTES!$H:$H,0),1))","v":""},null,null,{"$f":"IF(R120=\"\",\"\",INDEX('OTRAS REFERENTES'!$AI:$AJ,MATCH(R120,'OTRAS REFERENTES'!$AJ:$AJ,0),1))","v":""},null,"","",null,null,null,null,{"$f":"IF(SUMPRODUCT(--EXACT(J120&M120,$AA$2:AA119)),\"\",J120&M120)","v":""},{"$f":"IF(SUMPRODUCT(--EXACT(J120&M120,$AA$2:AA119)),\"\",MAX($AB$3:AB119)+1)","v":""}]
[1,"",119,"","",{"$f":"IF(K121<>\"\",CONCATENATE(DIGITADOR!$B$2,$A$2,DIGITADOR!$M$1,A121),\"\")","v":""},null,null,"",null,{"$f":"IF(J121=\"\",\"\",INDEX('OTRAS REFERENTES'!$AB:$AC,MATCH(J121,'OTRAS REFERENTES'!$AB:$AB,0),2))","v":""},null,null,null,null,{"$f":"IF(Q121=\"\",\"\",INDEX(REFERENTES!$G:$H,MATCH(Q121,REFERENTES!$H:$H,0),1))","v":""},null,null,{"$f":"IF(R121=\"\",\"\",INDEX('OTRAS REFERENTES'!$AI:$AJ,MATCH(R121,'OTRAS REFERENTES'!$AJ:$AJ,0),1))","v":""},null,"","",null,null,null,null,{"$f":"IF(SUMPRODUCT(--EXACT(J121&M121,$AA$2:AA120)),\"\",J121&M121)","v":""},{"$f":"IF(SUMPRODUCT(--EXACT(J121&M121,$AA$2:AA120)),\"\",MAX($AB$3:AB120)+1)","v":""}]
[1,"",120,"","",{"$f":"IF(K122<>\"\",CONCATENATE(DIGITADOR!$B$2,$A$2,DIGITADOR!$M$1,A122),\"\")","v":""},null,null,"",null,{"$f":"IF(J122=\"\",\"\",INDEX('OTRAS REFERENTES'!$AB:$AC,MATCH(J122,'OTRAS REFERENTES'!$AB:$AB,0),2))","v":""},null,null,null,null,{"$f":"IF(Q122=\"\",\"\",INDEX(REFERENTES!$G:$H,MATCH(Q122,REFERENTES!$H:$H,0),1))","v":""},null,null,{"$f":"IF(R122=\"\",\"\",INDEX('OTRAS REFERENTES'!$AI:$AJ,MATCH(R122,'OTRAS REFERENTES'!$AJ:$AJ,0),1))","v":""},null,"","",null,null,null,null,{"$f":"IF(SUMPRODUCT(--EXACT(J122&M122,$AA$2:AA121)),\"\",J122&M122)","v":""},{"$f":"IF(SUMPRODUCT(--EXACT(J122&M122,$AA$2:AA121)),\"\",MAX($AB$3:AB121)+1)","v":""}]
[1,"",121,"","",{"$f":"IF(K123<>\"\",CONCATENATE(DIGITADOR!$B$2,$A$2,DIGITADOR!$M$1,A123),\"\")","v":""},null,null,"",null,{"$f":"IF(J123=\"\",\"\",INDEX('OTRAS REFERENTES'!$AB:$AC,MATCH(J123,'OTRAS REFERENTES'!$AB:$AB,0),2))","v":""},null,null,null,null,{"$f":"IF(Q123=\"\",\"\",INDEX(REFERENTES!$G:$H,MATCH(Q123,REFERENTES!$H:$H,0),1))","v":""},null,null,{"$f":"IF(R123=\"\",\"\",INDEX('OTRAS REFERENTES'!$AI:$AJ,MATCH(R123,'OTRAS REFERENTES'!$AJ:$AJ,0),1))","v":""},null,"","",null,null,null,null,{"$f":"IF(SUMPRODUCT(--EXACT(J123&M123,$AA$2:AA122)),\"\",J123&M123)","v":""},{"$f":"IF(SUMPRODUCT(--EXACT(J123&M123,$AA$2:AA122)),\"\",MAX($AB$3:AB122)+1)","v":""}]
[1,"",122,"","",{"$f":"IF(K124<>\"\",CONCATENATE(DIGITADOR!$B$2,$A$2,DIGITADOR!$M$1,A124),\"\")","v":""},null,null,"",null,{"$f":"IF(J124=\"\",\"\",INDEX('OTRAS REFERENTES'!$AB:$AC,MATCH(J124,'OTRAS REFERENTES'!$AB:$AB,0),2))","v":""},null,null,null,null,{"$f":"IF(Q124=\"\",\"\",INDEX(REFERENTES!$G:$H,MATCH(Q124,REFERENTES!$H:$H,0),1))","v":""},null,null,{"$f":"IF(R124=\"\",\"\",INDEX('OTRAS REFERENTES'!$AI:$AJ,MATCH(R124,'OTRAS REFERENTES'!$AJ:$AJ,0),1))","v":""},null,"","",null,null,null,null,{"$f":"IF(SUMPRODUCT(--EXACT(J124&M124,$AA$2:AA123)),\"\",J124&M124)","v":""},{"$f":"IF(SUMPRODUCT(--EXACT(J124&M124,$AA$2:AA123)),\"\",MAX($AB$3:AB123)+1)","v":""}]
[1,"",123,"","",{"$f":"IF(K125<>\"\",CONCATENATE(DIGITADOR!$B$2,$A$2,DIGITADOR!$M$1,A125),\"\")","v":""},null,null,"",null,{"$f":"IF(J125=\"\",\"\",INDEX('OTRAS REFERENTES'!$AB:$AC,MATCH(J125,'OTRAS REFERENTES'!$AB:$AB,0),2))","v":""},null,null,null,null,{"$f":"IF(Q125=\"\",\"\",INDEX(REFERENTES!$G:$H,MATCH(Q125,REFERENTES!$H:$H,0),1))","v":""},null,null,{"$f":"IF(R125=\"\",\"\",INDEX('OTRAS REFERENTES'!$AI:$AJ,MATCH(R125,'OTRAS REFERENTES'!$AJ:$AJ,0),1))","v":""},null,"","",null,null,null,null,{"$f":"IF(SUMPRODUCT(--EXACT(J125&M125,$AA$2:AA124)),\"\",J125&M125)","v":""},{"$f":"IF(SUMPRODUCT(--EXACT(J125&M125,$AA$2:AA124)),\"\",MAX($AB$3:AB124)+1)","v":""}]
[1,"",124,"","",{"$f":"IF(K126<>\"\",CONCATENATE(DIGITADOR!$B$2,$A$2,DIGITADOR!$M$1,A126),\"\")","v":""},null,null,"",null,{"$f":"IF(J126=\"\",\"\",INDEX('OTRAS REFERENTES'!$AB:$AC,MATCH(J126,'OTRAS REFERENTES'!$AB:$AB,0),2))","v":""},null,null,null,null,{"$f":"IF(Q126=\"\",\"\",INDEX(REFERENTES!$G:$H,MATCH(Q126,REFERENTES!$H:$H,0),1))","v":""},null,null,{"$f":"IF(R126=\"\",\"\",INDEX('OTRAS REFERENTES'!$AI:$AJ,MATCH(R126,'OTRAS REFERENTES'!$AJ:$AJ,0),1))","v":""},null,"","",null,null,null,null,{"$f":"IF(SUMPRODUCT(--EXACT(J126&M126,$AA$2:AA125)),\"\",J126&M126)","v":""},{"$f":"IF(SUMPRODUCT(--EXACT(J126&M126,$AA$2:AA125)),\"\",MAX($AB$3:AB125)+1)","v":""}]
[1,"",125,"","",{"$f":"IF(K127<>\"\",CONCATENATE(DIGITADOR!$B$2,$A$2,DIGITADOR!$M$1,A127),\"\")","v":""},null,null,"",null,{"$f":"IF(J127=\"\",\"\",INDEX('OTRAS REFERENTES'!$AB:$AC,MATCH(J127,'OTRAS REFERENTES'!$AB:$AB,0),2))","v":""},null,null,null,null,{"$f":"IF(Q127=\"\",\"\",INDEX(REFERENTES!$G:$H,MATCH(Q127,REFERENTES!$H:$H,0),1))","v":""},null,null,{"$f":"IF(R127=\"\",\"\",INDEX('OTRAS REFERENTES'!$AI:$AJ,MATCH(R127,'OTRAS REFERENTES'!$AJ:$AJ,0),1))","v":""},null,"","",null,null,null,null,{"$f":"IF(SUMPRODUCT(--EXACT(J127&M127,$AA$2:AA126)),\"\",J127&M127)","v":""},{"$f":"IF(SUMPRODUCT(--EXACT(J127&M127,$AA$2:AA126)),\"\",MAX($AB$3:AB126)+1)","v":""}]
[1,"",126,"","",{"$f":"IF(K128<>\"\",CONCATENATE(DIGITADOR!$B$2,$A$2,DIGITADOR!$M$1,A128),\"\")","v":""},null,null,"",null,{"$f":"IF(J128=\"\",\"\",INDEX('OTRAS REFERENTES'!$AB:$AC,MATCH(J128,'OTRAS REFERENTES'!$AB:$AB,0),2))","v":""},null,null,null,null,{"$f":"IF(Q128=\"\",\"\",INDEX(REFERENTES!$G:$H,MATCH(Q128,REFERENTES!$H:$H,0),1))","v":""},null,null,{"$f":"IF(R128=\"\",\"\",INDEX('OTRAS REFERENTES'!$AI:$AJ,MATCH(R128,'OTRAS REFERENTES'!$AJ:$AJ,0),1))","v":""},null,"","",null,null,null,null,{"$f":"IF(SUMPRODUCT(--EXACT(J128&M128,$AA$2:AA127)),\"\",J128&M128)","v":""},{"$f":"IF(SUMPRODUCT(--EXACT(J128&M128,$AA$2:AA127)),\"\",MAX($AB$3:AB127)+1)","v":""}]
[1,"",127,"","",{"$f":"IF(K129<>\"\",CONCATENATE(DIGITADOR!$B$2,$A$2,DIGITADOR!$M$1,A129),\"\")","v":""},null,null,"",null,{"$f":"IF(J129=\"\",\"\",INDEX('OTRAS REFERENTES'!$AB:$AC,MATCH(J129,'OTRAS REFERENTES'!$AB:$AB,0),2))","v":""},null,null,null,null,{"$f":"IF(Q129=\"\",\"\",INDEX(REFERENTES!$G:$H,MATCH(Q129,REFERENTES!$H:$H,0),1))","v":""},null,null,{"$f":"IF(R129=\"\",\"\",INDEX('OTRAS REFERENTES'!$AI:$AJ,MATCH(R129,'OTRAS REFERENTES'!$AJ:$AJ,0),1))","v":""},null,"","",null,null,null,null,{"$f":"IF(SUMPRODUCT(--EXACT(J129&M129,$AA$2:AA128)),\"\",J129&M129)","v":""},{"$f":"IF(SUMPRODUCT(--EXACT(J129&M129,$AA$2:AA128)),\"\",MAX($AB$3:AB128)+1)","v":""}]
[1,"",128,"","",{"$f":"IF(K130<>\"\",CONCATENATE(DIGITADOR!$B$2,$A$2,DIGITADOR!$M$1,A130),\"\")","v":""},null,null,"",null,{"$f":"IF(J130=\"\",\"\",INDEX('OTRAS REFERENTES'!$AB:$AC,MATCH(J130,'OTRAS REFERENTES'!$AB:$AB,0),2))","v":""},null,null,null,null,{"$f":"IF(Q130=\"\",\"\",INDEX(REFERENTES!$G:$H,MATCH(Q130,REFERENTES!$H:$H,0),1))","v":""},null,null,{"$f":"IF(R130=\"\",\"\",INDEX('OTRAS REFERENTES'!$AI:$AJ,MATCH(R130,'OTRAS REFERENTES'!$AJ:$AJ,0),1))","v":""},null,"","",null,null,null,null,{"$f":"IF(SUMPRODUCT(--EXACT(J130&M130,$AA$2:AA129)),\"\",J130&M130)","v":""},{"$f":"IF(SUMPRODUCT(--EXACT(J130&M130,$AA$2:AA129)),\"\",MAX($AB$3:AB129)+1)","v":""}]
[1,"",129,{"$f":"IF(G131=\"\",\"\",CONCATENATE(C131,F131))","v":""},"",{"$f":"IF(K131<>\"\",CONCATENATE(DIGITADOR!$B$2,$A$2,DIGITADOR!$M$1,A131),\"\")","v":""},null,null,{"$f":"IF(G131<>\"\",G131+H131,\"\")","v":""},null,{"$f":"IF(J131=\"\",\"\",INDEX('OTRAS REFERENTES'!$AB:$AC,MATCH(J131,'OTRAS REFERENTES'!$AB:$AB,0),2))","v":""},null,null,null,null,{"$f":"IF(Q131=\"\",\"\",INDEX(REFERENTES!$G:$H,MATCH(Q131,REFERENTES!$H:$H,0),1))","v":""},null,null,{"$f":"IF(R131=\"\",\"\",INDEX('OTRAS REFERENTES'!$AI:$AJ,MATCH(R131,'OTRAS REFERENTES'!$AJ:$AJ,0),1))","v":""},null,{"$f":"IF(T131=\"\",\"\",IF(AND(T131>=0,T131<=50),\"De 0 cm a 50 cm\",IF(AND(T131>50,T131<=150),\"De 50 cm a 150 cm\",\"Mayor a 150 cm\")))","v":""},{"$f":"IF(T131=\"\",LEFT(U131,1),IF(T131=\"\",\"\",IF(AND(T131>=0,T131<=50),\"A\",IF(AND(T131>50,T131<=150),\"B\",\"C\"))))","v":""},null,null,null,null,{"$f":"IF(SUMPRODUCT(--EXACT(J131&M131,$AA$2:AA130)),\"\",J131&M131)","v":""},{"$f":"IF(SUMPRODUCT(--EXACT(J131&M131,$AA$2:AA130)),\"\",MAX($AB$3:AB130)+1)","v":""}]
[{"$f":"IF(E132=E131,A131,A131+1)","v":1},"",130,"",{"$f":"CONCATENATE(I132,K132)","v":""},{"$f":"IF(K132<>\"\",CONCATENATE(DIGITADOR!$B$2,$A$2,DIGITADOR!$M$1,A132),\"\")","v":""},null,null,"",null,{"$f":"IF(J132=\"\",\"\",INDEX('OTRAS REFERENTES'!$AB:$AC,MATCH(J132,'OTRAS REFERENTES'!$AB:$AB,0),2))","v":""},null,null,null,null,{"$f":"IF(Q132=\"\",\"\",INDEX(REFERENTES!$G:$H,MATCH(Q132,REFERENTES!$H:$H,0),1))","v":""},null,null,{"$f":"IF(R132=\"\",\"\",INDEX('OTRAS REFERENTES'!$AI:$AJ,MATCH(R132,'OTRAS REFERENTES'!$AJ:$AJ,0),1))","v":""},null,"","",null,null,null,null,{"$f":"IF(SUMPRODUCT(--EXACT(J132&M132,$AA$2:AA131)),\"\",J132&M132)","v":""},{"$f":"IF(SUMPRODUCT(--EXACT(J132&M132,$AA$2:AA131)),\"\",MAX($AB$3:AB131)+1)","v":""}]
[1,{"$f":"IF(F133<>F132, F133,\"\")","v":""},131,"","",{"$f":"IF(K133<>\"\",CONCATENATE(DIGITADOR!$B$2,$A$2,DIGITADOR!$M$1,A133),\"\")","v":""},null,null,"",null,{"$f":"IF(J133=\"\",\"\",INDEX('OTRAS REFERENTES'!$AB:$AC,MATCH(J133,'OTRAS REFERENTES'!$AB:$AB,0),2))","v":""},null,null,null,null,{"$f":"IF(Q133=\"\",\"\",INDEX(REFERENTES!$G:$H,MATCH(Q133,REFERENTES!$H:$H,0),1))","v":""},null,null,{"$f":"IF(R133=\"\",\"\",INDEX('OTRAS REFERENTES'!$AI:$AJ,MATCH(R133,'OTRAS REFERENTES'!$AJ:$AJ,0),1))","v":""},null,"","",null,null,null,null,{"$f":"IF(SUMPRODUCT(--EXACT(J133&M133,$AA$2:AA132)),\"\",J133&M133)","v":""},{"$f":"IF(SUMPRODUCT(--EXACT(J133&M133,$AA$2:AA132)),\"\",MAX($AB$3:AB132)+1)","v":""}]
[1,"",132,"","",{"$f":"IF(K134<>\"\",CONCATENATE(DIGITADOR!$B$2,$A$2,DIGITADOR!$M$1,A134),\"\")","v":""},null,null,"",null,{"$f":"IF(J134=\"\",\"\",INDEX('OTRAS REFERENTES'!$AB:$AC,MATCH(J134,'OTRAS REFERENTES'!$AB:$AB,0),2))","v":""},null,null,null,null,{"$f":"IF(Q134=\"\",\"\",INDEX(REFERENTES!$G:$H,MATCH(Q134,REFERENTES!$H:$H,0),1))","v":""},null,null,{"$f":"IF(R134=\"\",\"\",INDEX('OTRAS REFERENTES'!$AI:$AJ,MATCH(R134,'OTRAS REFERENTES'!$AJ:$AJ,0),1))","v":""},null,"","",null,null,null,null,{"$f":"IF(SUMPRODUCT(--EXACT(J134&M134,$AA$2:AA133)),\"\",J134&M134)","v":""},{"$f":"IF(SUMPRODUCT(--EXACT(J134&M134,$AA$2:AA133)),\"\",MAX($AB$3:AB133)+1)","v":""}]
[1,"",133,"","",{"$f":"IF(K135<>\"\",CONCATENATE(DIGITADOR!$B$2,$A$2,DIGITADOR!$M$1,A135),\"\")","v":""},null,null,"",null,{"$f":"IF(J135=\"\",\"\",INDEX('OTRAS REFERENTES'!$AB:$AC,MATCH(J135,'OTRAS REFERENTES'!$AB:$AB,0),2))","v":""},null,null,null,null,{"$f":"IF(Q135=\"\",\"\",INDEX(REFERENTES!$G:$H,MATCH(Q135,REFERENTES!$H:$H,0),1))","v":""},null,null,{"$f":"IF(R135=\"\",\"\",INDEX('OTRAS REFERENTES'!$AI:$AJ,MATCH(R135,'OTRAS REFERENTES'!$AJ:$AJ,0),1))","v":""},null,"","",null,null,null,null,{"$f":"IF(SUMPRODUCT(--EXACT(J135&M135,$AA$2:AA134)),\"\",J135&M135)","v":""},{"$f":"IF(SUMPRODUCT(--EXACT(J135&M135,$AA$2:AA134)),\"\",MAX($AB$3:AB134)+1)","v":""}]
[1,"",134,"","",{"$f":"IF(K136<>\"\",CONCATENATE(DIGITADOR!$B$2,$A$2,DIGITADOR!$M$1,A136),\"\")","v":""},null,null,"",null,{"$f":"IF(J136=\"\",\"\",INDEX('OTRAS REFERENTES'!$AB:$AC,MATCH(J136,'OTRAS REFERENTES'!$AB:$AB,0),2))","v":""},null,null,null,null,{"$f":"IF(Q136=\"\",\"\",INDEX(REFERENTES!$G:$H,MATCH(Q136,REFERENTES!$H:$H,0),1))","v":""},null,null,{"$f":"IF(R136=\"\",\"\",INDEX('OTRAS REFERENTES'!$AI:$AJ,MATCH(R136,'OTRAS REFERENTES'!$AJ:$AJ,0),1))","v":""},null,"","",null,null,null,null,{"$f":"IF(SUMPRODUCT(--EXACT(J136&M136,$AA$2:AA135)),\"\",J136&M136)","v":""},{"$f":"IF(SUMPRODUCT(--EXACT(J136&M136,$AA$2:AA135)),\"\",MAX($AB$3:AB135)+1)","v":""}]
[1,"",135,"","",{"$f":"IF(K137<>\"\",CONCATENATE(DIGITADOR!$B$2,$A$2,DIGITADOR!$M$1,A137),\"\")","v":""},null,null,"",null,{"$f":"IF(J137=\"\",\"\",INDEX('OTRAS REFERENTES'!$AB:$AC,MATCH(J137,'OTRAS REFERENTES'!$AB:$AB,0),2))","v":""},null,null,null,null,{"$f":"IF(Q137=\"\",\"\",INDEX(REFERENTES!$G:$H,MATCH(Q137,REFERENTES!$H:$H,0),1))","v":""},null,null,{"$f":"IF(R137=\"\",\"\",INDEX('OTRAS REFERENTES'!$AI:$AJ,MATCH(R137,'OTRAS REFERENTES'!$AJ:$AJ,0),1))","v":""},null,"","",null,null,null,null,{"$f":"IF(SUMPRODUCT(--EXACT(J137&M137,$AA$2:AA136)),\"\",J137&M137)","v":""},{"$f":"IF(SUMPRODUCT(--EXACT(J137&M137,$AA$2:AA136)),\"\",MAX($AB$3:AB136)+1)","v":""}]
[1,"",136,"","",{"$f":"IF(K138<>\"\",CONCATENATE(DIGITADOR!$B$2,$A$2,DIGITADOR!$M$1,A138),\"\")","v":""},null,null,"",null,{"$f":"IF(J138=\"\",\"\",INDEX('OTRAS REFERENTES'!$AB:$AC,MATCH(J138,'OTRAS REFERENTES'!$AB:$AB,0),2))","v":""},null,null,null,null,{"$f":"IF(Q138=\"\",\"\",INDEX(REFERENTES!$G:$H,MATCH(Q138,REFERENTES!$H:$H,0),1))","v":""},null,null,{"$f":"IF(R138=\"\",\"\",INDEX('OTRAS REFERENTES'!$AI:$AJ,MATCH(R138,'OTRAS REFERENTES'!$AJ:$AJ,0),1))","v":""},null,"","",null,null,null,null,{"$f":"IF(SUMPRODUCT(--EXACT(J138&M138,$AA$2:AA137)),\"\",J138&M138)","v":""},{"$f":"IF(SUMPRODUCT(--EXACT(J138&M138,$AA$2:AA137)),\"\",MAX($AB$3:AB137)+1)","v":""}]
[1,"",137,"","",{"$f":"IF(K139<>\"\",CONCATENATE(DIGITADOR!$B$2,$A$2,DIGITADOR!$M$1,A139),\"\")","v":""},null,null,"",null,{"$f":"IF(J139=\"\",\"\",INDEX('OTRAS REFERENTES'!$AB:$AC,MATCH(J139,'OTRAS REFERENTES'!$AB:$AB,0),2))","v":""},null,null,null,null,{"$f":"IF(Q139=\"\",\"\",INDEX(REFERENTES!$G:$H,MATCH(Q139,REFERENTES!$H:$H,0),1))","v":""},null,null,{"$f":"IF(R139=\"\",\"\",INDEX('OTRAS REFERENTES'!$AI:$AJ,MATCH(R139,'OTRAS REFERENTES'!$AJ:$AJ,0),1))","v":""},null,"","",null,null,null,null,{"$f":"IF(SUMPRODUCT(--EXACT(J139&M139,$AA$2:AA138)),\"\",J139&M139)","v":""},{"$f":"IF(SUMPRODUCT(--EXACT(J139&M139,$AA$2:AA138)),\"\",MAX($AB$3:AB138)+1)","v":""}]
[1,"",138,"","",{"$f":"IF(K140<>\"\",CONCATENATE(DIGITADOR!$B$2,$A$2,DIGITADOR!$M$1,A140),\"\")","v":""},null,null,"",null,{"$f":"IF(J140=\"\",\"\",INDEX('OTRAS REFERENTES'!$AB:$AC,MATCH(J140,'OTRAS REFERENTES'!$AB:$AB,0),2))","v":""},null,null,null,null,{"$f":"IF(Q140=\"\",\"\",INDEX(REFERENTES!$G:$H,MATCH(Q140,REFERENTES!$H:$H,0),1))","v":""},null,null,{"$f":"IF(R140=\"\",\"\",INDEX('OTRAS REFERENTES'!$AI:$AJ,MATCH(R140,'OTRAS REFERENTES'!$AJ:$AJ,0),1))","v":""},null,"","",null,null,null,null,{"$f":"IF(SUMPRODUCT(--EXACT(J140&M140,$AA$2:AA139)),\"\",J140&M140)","v":""},{"$f":"IF(SUMPRODUCT(--EXACT(J140&M140,$AA$2:AA139)),\"\",MAX($AB$3:AB139)+1)","v":""}]
[1,"",139,"","",{"$f":"IF(K141<>\"\",CONCATENATE(DIGITADOR!$B$2,$A$2,DIGITADOR!$M$1,A141),\"\")","v":""},null,null,"",null,{"$f":"IF(J141=\"\",\"\",INDEX('OTRAS REFERENTES'!$AB:$AC,MATCH(J141,'OTRAS REFERENTES'!$AB:$AB,0),2))","v":""},null,null,null,null,{"$f":"IF(Q141=\"\",\"\",INDEX(REFERENTES!$G:$H,MATCH(Q141,REFERENTES!$H:$H,0),1))","v":""},null,null,{"$f":"IF(R141=\"\",\"\",INDEX('OTRAS REFERENTES'!$AI:$AJ,MATCH(R141,'OTRAS REFERENTES'!$AJ:$AJ,0),1))","v":""},null,"","",null,null,null,null,{"$f":"IF(SUMPRODUCT(--EXACT(J141&M141,$AA$2:AA140)),\"\",J141&M141)","v":""},{"$f":"IF(SUMPRODUCT(--EXACT(J141&M141,$AA$2:AA140)),\"\",MAX($AB$3:AB140)+1)","v":""}]
[1,"",140,"","",{"$f":"IF(K142<>\"\",CONCATENATE(DIGITADOR!$B$2,$A$2,DIGITADOR!$M$1,A142),\"\")","v":""},null,null,"",null,{"$f":"IF(J142=\"\",\"\",INDEX('OTRAS REFERENTES'!$AB:$AC,MATCH(J142,'OTRAS REFERENTES'!$AB:$AB,0),2))","v":""},null,null,null,null,{"$f":"IF(Q142=\"\",\"\",INDEX(REFERENTES!$G:$H,MATCH(Q142,REFERENTES!$H:$H,0),1))","v":""},null,null,{"$f":"IF(R142=\"\",\"\",INDEX('OTRAS REFERENTES'!$AI:$AJ,MATCH(R142,'OTRAS REFERENTES'!$AJ:$AJ,0),1))","v":""},null,"","",null,null,null,null,{"$f":"IF(SUMPRODUCT(--EXACT(J142&M142,$AA$2:AA141)),\"\",J142&M142)","v":""},{"$f":"IF(SUMPRODUCT(--EXACT(J142&M142,$AA$2:AA141)),\"\",MAX($AB$3:AB141)+1)","v":""}]
[1,"",141,"","",{"$f":"IF(K143<>\"\",CONCATENATE(DIGITADOR!$B$2,$A$2,DIGITADOR!$M$1,A143),\"\")","v":""},null,null,"",null,{"$f":"IF(J143=\"\",\"\",INDEX('OTRAS REFERENTES'!$AB:$AC,MATCH(J143,'OTRAS REFERENTES'!$AB:$AB,0),2))","v":""},null,null,null,null,{"$f":"IF(Q143=\"\",\"\",INDEX(REFERENTES!$G:$H,MATCH(Q143,REFERENTES!$H:$H,0),1))","v":""},null,null,{"$f":"IF(R143=\"\",\"\",INDEX('OTRAS REFERENTES'!$AI:$AJ,MATCH(R143,'OTRAS REFERENTES'!$AJ:$AJ,0),1))","v":""},null,"","",null,null,null,null,{"$f":"IF(SUMPRODUCT(--EXACT(J143&M143,$AA$2:AA142)),\"\",J143&M143)","v":""},{"$f":"IF(SUMPRODUCT(--EXACT(J143&M143,$AA$2:AA142)),\"\",MAX($AB$3:AB142)+1)","v":""}]
[1,"",142,"","",{"$f":"IF(K144<>\"\",CONCATENATE(DIGITADOR!$B$2,$A$2,DIGITADOR!$M$1,A144),\"\")","v":""},null,null,"",null,{"$f":"IF(J144=\"\",\"\",INDEX('OTRAS REFERENTES'!$AB:$AC,MATCH(J144,'OTRAS REFERENTES'!$AB:$AB,0),2))","v":""},null,null,null,null,{"$f":"IF(Q144=\"\",\"\",INDEX(REFERENTES!$G:$H,MATCH(Q144,REFERENTES!$H:$H,0),1))","v":""},null,null,{"$f":"IF(R144=\"\",\"\",INDEX('OTRAS REFERENTES'!$AI:$AJ,MATCH(R144,'OTRAS REFERENTES'!$AJ:$AJ,0),1))","v":""},null,"","",null,null,null,null,{"$f":"IF(SUMPRODUCT(--EXACT(J144&M144,$AA$2:AA143)),\"\",J144&M144)","v":""},{"$f":"IF(SUMPRODUCT(--EXACT(J144&M144,$AA$2:AA143)),\"\",MAX($AB$3:AB143)+1)","v":""}]
[1,"",143,"","",{"$f":"IF(K145<>\"\",CONCATENATE(DIGITADOR!$B$2,$A$2,DIGITADOR!$M$1,A145),\"\")","v":""},null,null,"",null,{"$f":"IF(J145=\"\",\"\",INDEX('OTRAS REFERENTES'!$AB:$AC,MATCH(J145,'OTRAS REFERENTES'!$AB:$AB,0),2))","v":""},null,null,null,null,{"$f":"IF(Q145=\"\",\"\",INDEX(REFERENTES!$G:$H,MATCH(Q145,REFERENTES!$H:$H,0),1))","v":""},null,null,{"$f":"IF(R145=\"\",\"\",INDEX('OTRAS REFERENTES'!$AI:$AJ,MATCH(R145,'OTRAS REFERENTES'!$AJ:$AJ,0),1))","v":""},null,"","",null,null,null,null,{"$f":"IF(SUMPRODUCT(--EXACT(J145&M145,$AA$2:AA144)),\"\",J145&M145)","v":""},{"$f":"IF(SUMPRODUCT(--EXACT(J145&M145,$AA$2:AA144)),\"\",MAX($AB$3:AB144)+1)","v":""}]
[1,"",144,"","",{"$f":"IF(K146<>\"\",CONCATENATE(DIGITADOR!$B$2,$A$2,DIGITADOR!$M$1,A146),\"\")","v":""},null,null,"",null,{"$f":"IF(J146=\"\",\"\",INDEX('OTRAS REFERENTES'!$AB:$AC,MATCH(J146,'OTRAS REFERENTES'!$AB:$AB,0),2))","v":""},null,null,null,null,{"$f":"IF(Q146=\"\",\"\",INDEX(REFERENTES!$G:$H,MATCH(Q146,REFERENTES!$H:$H,0),1))","v":""},null,null,{"$f":"IF(R146=\"\",\"\",INDEX('OTRAS REFERENTES'!$AI:$AJ,MATCH(R146,'OTRAS REFERENTES'!$AJ:$AJ,0),1))","v":""},null,"","",null,null,null,null,{"$f":"IF(SUMPRODUCT(--EXACT(J146&M146,$AA$2:AA145)),\"\",J146&M146)","v":""},{"$f":"IF(SUMPRODUCT(--EXACT(J146&M146,$AA$2:AA145)),\"\",MAX($AB$3:AB145)+1)","v":""}]
[1,"",145,"","",{"$f":"IF(K147<>\"\",CONCATENATE(DIGITADOR!$B$2,$A$2,DIGITADOR!$M$1,A147),\"\")","v":""},null,null,"",null,{"$f":"IF(J147=\"\",\"\",INDEX('OTRAS REFERENTES'!$AB:$AC,MATCH(J147,'OTRAS REFERENTES'!$AB:$AB,0),2))","v":""},null,null,null,null,{"$f":"IF(Q147=\"\",\"\",INDEX(REFERENTES!$G:$H,MATCH(Q147,REFERENTES!$H:$H,0),1))","v":""},null,null,{"$f":"IF(R147=\"\",\"\",INDEX('OTRAS REFERENTES'!$AI:$AJ,MATCH(R147,'OTRAS REFERENTES'!$AJ:$AJ,0),1))","v":""},null,"","",null,null,null,null,{"$f":"IF(SUMPRODUCT(--EXACT(J147&M147,$AA$2:AA146)),\"\",J147&M147)","v":""},{"$f":"IF(SUMPRODUCT(--EXACT(J147&M147,$AA$2:AA146)),\"\",MAX($AB$3:AB146)+1)","v":""}]
[1,"",146,"","",{"$f":"IF(K148<>\"\",CONCATENATE(DIGITADOR!$B$2,$A$2,DIGITADOR!$M$1,A148),\"\")","v":""},null,null,"",null,{"$f":"IF(J148=\"\",\"\",INDEX('OTRAS REFERENTES'!$AB:$AC,MATCH(J148,'OTRAS REFERENTES'!$AB:$AB,0),2))","v":""},null,null,null,null,{"$f":"IF(Q148=\"\",\"\",INDEX(REFERENTES!$G:$H,MATCH(Q148,REFERENTES!$H:$H,0),1))","v":""},null,null,{"$f":"IF(R148=\"\",\"\",INDEX('OTRAS REFERENTES'!$AI:$AJ,MATCH(R148,'OTRAS REFERENTES'!$AJ:$AJ,0),1))","v":""},null,"","",null,null,null,null,{"$f":"IF(SUMPRODUCT(--EXACT(J148&M148,$AA$2:AA147)),\"\",J148&M148)","v":""},{"$f":"IF(SUMPRODUCT(--EXACT(J148&M148,$AA$2:AA147)),\"\",MAX($AB$3:AB147)+1)","v":""}]
[1,"",147,"","",{"$f":"IF(K149<>\"\",CONCATENATE(DIGITADOR!$B$2,$A$2,DIGITADOR!$M$1,A149),\"\")","v":""},null,null,"",null,{"$f":"IF(J149=\"\",\"\",INDEX('OTRAS REFERENTES'!$AB:$AC,MATCH(J149,'OTRAS REFERENTES'!$AB:$AB,0),2))","v":""},null,null,null,null,{"$f":"IF(Q149=\"\",\"\",INDEX(REFERENTES!$G:$H,MATCH(Q149,REFERENTES!$H:$H,0),1))","v":""},null,null,{"$f":"IF(R149=\"\",\"\",INDEX('OTRAS REFERENTES'!$AI:$AJ,MATCH(R149,'OTRAS REFERENTES'!$AJ:$AJ,0),1))","v":""},null,"","",null,null,null,null,{"$f":"IF(SUMPRODUCT(--EXACT(J149&M149,$AA$2:AA148)),\"\",J149&M149)","v":""},{"$f":"IF(SUMPRODUCT(--EXACT(J149&M149,$AA$2:AA148)),\"\",MAX($AB$3:AB148)+1)","v":""}]
[1,"",148,"","",{"$f":"IF(K150<>\"\",CONCATENATE(DIGITADOR!$B$2,$A$2,DIGITADOR!$M$1,A150),\"\")","v":""},null,null,"",null,{"$f":"IF(J150=\"\",\"\",INDEX('OTRAS REFERENTES'!$AB:$AC,MATCH(J150,'OTRAS REFERENTES'!$AB:$AB,0),2))","v":""},null,null,null,null,{"$f":"IF(Q150=\"\",\"\",INDEX(REFERENTES!$G:$H,MATCH(Q150,REFERENTES!$H:$H,0),1))","v":""},null,null,{"$f":"IF(R150=\"\",\"\",INDEX('OTRAS REFERENTES'!$AI:$AJ,MATCH(R150,'OTRAS REFERENTES'!$AJ:$AJ,0),1))","v":""},null,"","",null,null,null,null,{"$f":"IF(SUMPRODUCT(--EXACT(J150&M150,$AA$2:AA149)),\"\",J150&M150)","v":""},{"$f":"IF(SUMPRODUCT(--EXACT(J150&M150,$AA$2:AA149)),\"\",MAX($AB$3:AB149)+1)","v":""}]
[1,"",149,"","",{"$f":"IF(K151<>\"\",CONCATENATE(DIGITADOR!$B$2,$A$2,DIGITADOR!$M$1,A151),\"\")","v":""},null,null,"",null,{"$f":"IF(J151=\"\",\"\",INDEX('OTRAS REFERENTES'!$AB:$AC,MATCH(J151,'OTRAS REFERENTES'!$AB:$AB,0),2))","v":""},null,null,null,null,{"$f":"IF(Q151=\"\",\"\",INDEX(REFERENTES!$G:$H,MATCH(Q151,REFERENTES!$H:$H,0),1))","v":""},null,null,{"$f":"IF(R151=\"\",\"\",INDEX('OTRAS REFERENTES'!$AI:$AJ,MATCH(R151,'OTRAS REFERENTES'!$AJ:$AJ,0),1))","v":""},null,"","",null,null,null,null,{"$f":"IF(SUMPRODUCT(--EXACT(J151&M151,$AA$2:AA150)),\"\",J151&M151)","v":""},{"$f":"IF(SUMPRODUCT(--EXACT(J151&M151,$AA$2:AA150)),\"\",MAX($AB$3:AB150)+1)","v":""}]
[1,"",150,"","",{"$f":"IF(K152<>\"\",CONCATENATE(DIGITADOR!$B$2,$A$2,DIGITADOR!$M$1,A152),\"\")","v":""},null,null,"",null,{"$f":"IF(J152=\"\",\"\",INDEX('OTRAS REFERENTES'!$AB:$AC,MATCH(J152,'OTRAS REFERENTES'!$AB:$AB,0),2))","v":""},null,null,null,null,{"$f":"IF(Q152=\"\",\"\",INDEX(REFERENTES!$G:$H,MATCH(Q152,REFERENTES!$H:$H,0),1))","v":""},null,null,{"$f":"IF(R152=\"\",\"\",INDEX('OTRAS REFERENTES'!$AI:$AJ,MATCH(R152,'OTRAS REFERENTES'!$AJ:$AJ,0),1))","v":""},null,"","",null,null,null,null,{"$f":"IF(SUMPRODUCT(--EXACT(J152&M152,$AA$2:AA151)),\"\",J152&M152)","v":""},{"$f":"IF(SUMPRODUCT(--EXACT(K4&M4,$AJ$2:AJ3)),\"\",MAX($AK$3:AK3)+1)","v":""}]

{"sheet":"REFERENTES","index":4,"n_rows":299,"n_cols":30,"rows_kept":299,"cut":false,"hidden":false,"merged":[]}
["AG_ESPECIES",null,null,"AG_LOV",null,null,"descripcion","cod_letras"]
["AB","Avicennia bicolor",null,1,"Propágulo",null,"Avicennia bicolor","AB","2040.55.687",null,null,null,"VERBENACEAE",null,null,null,"Agrosoledad","CSISPIE-ZR1-Agrosole-1",48733,2414,null,3546,"Administrador SIGMA"]
["CE","Conocarpus erectus",null,2,"Plántula",null,"Avicennia germinans","AG","2040.55.685",null,null,null,"VERBENACEAE",null,null,null,"Aguas Negras -1","SFFOCC-SZ1-ANE-1",45924,2154,"Parcela 1 monitoreada por el INVEMAR en el marco del ¨Monitoreo de las condiciones ambientales y los cambios estructurales y funcionales de las comunidades vegetales y de los recursos pesqueros durante la rehabilitación de la Ciénaga Grande de Santa Marta¨",8902,"Alejandra Robles Sanchez",null,null,null,null,null,"AD Pto. Moin C.R.","Administración Desarrollo Complejo Portuario  Limón Moin Costa Rica"]
["LR","Laguncularia racemosa",null,null,null,null,"Conocarpus erectus","CE","2040.55.293",null,null,null,"VERBENACEAE",null,null,null,"Aguas Negras -2","SFFOCC-SZ1-ANE-2",45926,2155,"Parcela 2 monitoreada por el INVEMAR en el marco del ¨Monitoreo de las condiciones ambientales y los cambios estructurales y funcionales de las comunidades vegetales y de los recursos pesqueros durante la rehabilitación de la Ciénaga Grande de Santa Marta¨",7381,"Alejandro Paz",null,null,null,null,null,"ANADARKO","Anadarko Colombia Company"]
["MM","Mora oleifera ",null,null,null,null,"Eugenia Acapulcensis","EA","2040.55.1534",null,"ROSOPSIDA","MYRTALES","MYRTACEAE","EUGENIA",null,null,"Aguas Negras -3","SFFOCC-SZ1-ANE-3",45928,2156,"Parcela 3 monitoreada por el INVEMAR en el marco del ¨Monitoreo de las condiciones ambientales y los cambios estructurales y funcionales de las comunidades vegetales y de los recursos pesqueros durante la rehabilitación de la Ciénaga Grande de Santa Marta¨",3444,"Alexandra Rodríguez",null,null,null,null,null,"AQUABIOSFERA","Aquabiosfera SAS"]
["PR","Pelliciera rhizophorae",null,null,null,null,"Ficus","FS","2040.46.20406",null,"ROSOPSIDA","ROSALES","MORACEAE","FICUS",null,null,"Angostura","BCISEST-ZUS1-angostura-1",45589,2124,"esta parcela se encuentra ubicada en el sector de caño grande en la zona de uso sostenible, en el subsector de aprovechamiento, con predominancia de la especie Rhizophora mangle, esta parcela tiene gran cantidad de arboles muertos, y otros con condiciones de raquitismo, baja densidad de arboles en la parcela.",5658,"Amanda Selene Rojas Aguirre",null,null,null,null,null,"CALIDRIS","Asociación Calidris"]
["RM","Rhizophora mangle",null,null,null,null,"Ficus Tonduzii   ","FT","2040.55.1536",null,"ROSOPSIDA","ROSALES","MORACEAE","FICUS",null,null,"Ararca-1","BARU-ZR1-Ararca-1",44509,1764,"Parcela que coincide con punto de muestreo de PNN, se encontraron dos mojones instalados por ellos.  Bosque en sus primeros 25 m con abundante presencia de R. mangle con numerosas raíces fúlcreas, inundación de 5 cm en promedio, Bosque en buen estado no se evidencia tala",4415,"Ana Sánchez",null,null,null,null,null,"ASOCARS","Asociación de Corporaciones Autónomas Regionales"]
["RR","Rhizophora racemosa",null,null,null,null,"Laguncularia racemosa","LR","2040.55.290",null,null,null,"COMBRETACEAE",null,null,null,"Arroyo Plata-1","BARB-ZR1-Ay-Plata-1",44493,1759,"Parcela dominada por P. rhizophorae, inundación promedio de 15 cm. presencia abundante de propágulos de R. mangle.  Bosque en buen estado no se evidencia tala.",8660,"Angie Daniela Enriquez Fernandez",null,null,null,null,null,"ANLA","Autoridad Nacional de Licencias Ambientales"]
["SE","Sp. manglar",null,null,null,null,"Mora oleifera ","MM","2040.55.507",null,null,null,"Caesalpiniaceae",null,null,null,"BLACK SAND BAY","BSAND_BAY1",58105,2851,null,8258,"Daniel Fernando Jiménez Rincón",null,null,null,null,null,"ARAP","Autoridad de Recursos Acuáticos de Panamá"]
["FS","Ficus",null,null,null,null,"Pelliciera rhizophorae","PR","2040.55.532",null,null,null,"Rhizophoraceae",null,null,null,"BOCAS DEL ATRATO P1","BCATRATO_P1",56791,2810,null,7664,"Danny Santana Rosero",null,null,null,null,null,"CWOP","Caribbean-Wide Orca Project"]
["FT","Ficus Tonduzii   ",null,null,null,null,"Rhizophora harrisonii ","RH","2040.55.1509",null,null,null,"Rhizophoraceae",null,null,null,"BOQUILLA-1","JPVI-ZR1-BOQ-1",42007,1078,null,7298,"David Alejandro Sanchez Nuñez",null,null,null,null,null,"CEAC","Centro de Estudios Ambientales de Cienfuegos"]
["EA","Eugenia Acapulcensis",null,null,null,null,"Rhizophora mangle","RM","2040.55.325",null,null,null,"RIZOPHORACEAE",null,null,null,"Bahia Barbacoas-1","BARB-ZR1-Barba-1",42000,1076,null,3570,"Docente unal",null,null,null,null,null,"CECIMAR","Centro de Estudios en Ciencias del Mar - Universidad Nacional"]
["AG","Avicennia germinans",null,null,null,null,"Rhizophora racemosa","RR","2040.55.326",null,null,null,"Rhizophoraceae",null,null,null,"Bahia Barbacoas-1-1","BARB-ZR1-BARB01-1",44490,1758,"Estación con sustrato duro, los primeros 20 m dominados por L. racemosa, abundante regeneración natural de R. mangle hasta los 45 m.  Nivel de inundación promedio de 10 cm.",4814,"EPA Buenaventura",null,null,null,null,null,"CIEMAT","Centro de Investigaciones Energéticas, Medioambientales y Tecnológicas"]
["RH","Rhizophora harrisonii ",null,null,null,null,"Rhizophora sp.","RS","2040.46.710",null,"Rosopsida","Rhizophorales","Rhizophoraceae",null,null,null,"Bahia Honda -1","OPOI-ZP1-BahíaHonda-1",49005,2506,"Parcela aleatoria #2 2016",7840,"Fair Fernando Dager Osorio",null,null,null,null,null,"CIOH","Centro de Investigaciones Oceanográficas e Hidrográficas"]
["TC","Terminalia catappa",null,null,null,null,"Otras Especies asociadas","SA",null,null,null,null,null,null,null,null,"Bahía Burrera-1","DRATR-ZUS1-Bburr-1",48492,2381,"Bosque ralo con mayor presencia de R. mangle, no se observa vegetación baja diferente del manglar.  Presión antrópica relacionada por Corta de Varas.  Presencia de agallas en todas las estructuras del manglar, especialmente en el R. mangle.",4422,"Fernando López",null,null,null,null,null,"C.C.C.P.","Centro de Investigaciones Oceanográficas e Hidrográficas del Pacífico"]
["SA","Otras Especies asociadas",null,null,null,null,"Sp. manglar","SE","2040.5.2040",null,null,null,"Sin especificiar",null,null,null,"Bahía Coco Grande-1","DRATR-ZR1-Bcog-1",48520,2385,"Bosque Ralo. Con un manglar entrelazado con mayor presencia de R. mangle seguido de L. racemosa..  Presión antrópica relacionada por Corta de Varas y presencia de agallas en todas las estructuras del manglar, especialmente en el R. mangle.",3550,"Funcionario CARDIQUE",null,null,null,null,null,"CEINER","Centro de Investigación Educación y Recreación Islas del Rosario"]
["RS","Rhizophora sp.",null,null,null,null,"Terminalia catappa","TC",null,null,"Equisetopsida","MYRTALES","COMBRETACEAE","Terminalia",null,null,"Bahía El Roto","DRATR-ZR1-Brot-1",48526,2387,"Bosque de porte alto.Presencia de R. mangle, L. racemosa y A. germinans.  Se observó corta de mangle.",3554,"Funcionario CORALINA",null,null,null,null,null,"CIRA","Centro de Investigación de los Recursos Acuáticos de Nicaragua (CIRA)"]
[null,null,null,null,null,null,null,null,null,null,null,null,null,null,null,null,"Bahía Honda parcela circular-2","BahíaHondaPPC-2",55547,null,"Estación Manglar Bahía Honda (formada por 3 parcelas circulares): Manglar que hace parte del Parque Regional Old Point Regional Mangrove Park, localizado al nororiente de la isla de San Andrés, con una extensión de manglar de 60,62 ha (INVEMAR-CORALINA, 2016). Es un manglar de borde, con árboles con una altura promedio de 7,2 m, influenciado por las mareas y el continuo lavado de sus suelos. Conformado por Rhizophora mangle (especie dominante), Avicennia germinans, Laguncularia racemosa y Conocarpus erectus. Evidencia de residuos sólidos (botellas, latas, plásticos) traídos por el mar durante las mareas altas y árboles talados en el interior del manglar. Actualmente, bajo la figura de Parque Regional se ha logrado su recuperación y es un enclave ambiental que sirve de hábitat a numerosas especies faunísticas residentes y migratorias.",3553,"Funcionario CORPOURABA",null,null,null,null,null,"CICA","Centro de Investigación en Contaminación Ambiental"]
[null,null,null,null,null,null,null,null,null,null,null,null,null,null,null,null,"Bahía Honda parcela circular-3","BahíaHondaPPC-3",55548,null,"Estación Manglar Bahía Honda (formada por 3 parcelas circulares): Manglar que hace parte del Parque Regional Old Point Regional Mangrove Park, localizado al nororiente de la isla de San Andrés, con una extensión de manglar de 60,62 ha (INVEMAR-CORALINA, 2016). Es un manglar de borde, con árboles con una altura promedio de 7,2 m, influenciado por las mareas y el continuo lavado de sus suelos. Conformado por Rhizophora mangle (especie dominante), Avicennia germinans, Laguncularia racemosa y Conocarpus erectus. Evidencia de residuos sólidos (botellas, latas, plásticos) traídos por el mar durante las mareas altas y árboles talados en el interior del manglar. Actualmente, bajo la figura de Parque Regional se ha logrado su recuperación y es un enclave ambiental que sirve de hábitat a numerosas especies faunísticas residentes y migratorias.",3549,"Funcionario CRA",null,null,null,null,null,"CRBMUV","Colección de Referencia Biología Marina Universidad del Valle"]
[null,null,null,null,null,null,null,null,null,null,null,null,null,null,null,null,"Bahía Hooker parcela circular-2","BahíaHookerPPC-2",55549,null,"Estación Manglar Bahía Hooker (formada por 3 parcelas circulares): Manglar que hace parte del Parque Regional Old Point Regional Mangrove Park, localizado al nororiente de la isla de San Andrés, con una extensión de manglar de 60,62 ha (INVEMAR-CORALINA, 2016). Es un manglar de borde con árboles de 5,4 m de altura promedio, conformado por Rhizophora mangle, Avicennia germinans, Laguncularia racemosa y Conocarpus erectus. Evidencia de afectación por lodos aceitosos presentes en el sustrato y presencia de residuos sólidos (botellas, latas, plásticos). Actualmente, bajo la figura de Parque Regional se ha logrado su recuperación y es un enclave ambiental que sirve de hábitat a numerosas especies faunísticas residentes y migratorias.",3558,"Funcionario CRC",null,null,null,null,null,"Coleccion_Personal","Colección personal"]
[null,null,null,null,null,null,null,null,null,null,null,null,null,null,null,null,"Bahía Hooker parcela circular-3","BahíaHookerPPC-3",55550,null,"Estación Manglar Bahía Hooker (formada por 3 parcelas circulares): Manglar que hace parte del Parque Regional Old Point Regional Mangrove Park, localizado al nororiente de la isla de San Andrés, con una extensión de manglar de 60,62 ha (INVEMAR-CORALINA, 2016). Es un manglar de borde con árboles de 5,4 m de altura promedio, conformado por Rhizophora mangle, Avicennia germinans, Laguncularia racemosa y Conocarpus erectus. Evidencia de afectación por lodos aceitosos presentes en el sustrato y presencia de residuos sólidos (botellas, latas, plásticos). Actualmente, bajo la figura de Parque Regional se ha logrado su recuperación y es un enclave ambiental que sirve de hábitat a numerosas especies faunísticas residentes y migratorias.",3556,"Funcionario CVC",null,null,null,null,null,"CPPS","Comisión Permanente del Pacífico Sur"]
[null,null,null,null,null,null,null,null,null,null,null,null,null,null,null,null,"Bahía Hooker parcela circular-4","BahíaHookerPPC-4",55551,null,"Estación Manglar Bahía Hooker (formada por 3 parcelas circulares): Manglar que hace parte del Parque Regional Old Point Regional Mangrove Park, localizado al nororiente de la isla de San Andrés, con una extensión de manglar de 60,62 ha (INVEMAR-CORALINA, 2016). Es un manglar de borde con árboles de 5,4 m de altura promedio, conformado por Rhizophora mangle, Avicennia germinans, Laguncularia racemosa y Conocarpus erectus. Evidencia de afectación por lodos aceitosos presentes en el sustrato y presencia de residuos sólidos (botellas, latas, plásticos). Actualmente, bajo la figura de Parque Regional se ha logrado su recuperación y es un enclave ambiental que sirve de hábitat a numerosas especies faunísticas residentes y migratorias.",3552,"Funcionario CVS",null,null,null,null,null,"CI","Conservación Internacional Colombia "]
[null,null,null,null,null,null,null,null,null,null,null,null,null,null,null,null,"Bahía Hooker-1","OPOI-ZP1-BahíaHooker-1",49002,2505,"Estación Manglar Bahía Hooker (formada por 3 parcelas circulares): Manglar que hace parte del Parque Regional Old Point Regional Mangrove Park, localizado al nororiente de la isla de San Andrés, con una extensión de manglar de 60,62 ha (INVEMAR-CORALINA, 2016). Es un manglar de borde con árboles de 5,4 m de altura promedio, conformado por Rhizophora mangle, Avicennia germinans, Laguncularia racemosa y Conocarpus erectus. Evidencia de afectación por lodos aceitosos presentes en el sustrato y presencia de residuos sólidos (botellas, latas, plásticos). Actualmente, bajo la figura de Parque Regional se ha logrado su recuperación y es un enclave ambiental que sirve de hábitat a numerosas especies faunísticas residentes y migratorias.",3555,"Funcionario Codechoco",null,null,null,null,null,"CONSULTOR","Consultor independiente "]
[null,null,null,null,null,null,null,null,null,null,null,null,null,null,null,null,"Bahía La Paila-1","DRATR-ZUS1-Bpai-1",48497,2383,"Costado sur de la bahía, en el cual se observa una franja externa con árboles de porte alto precedida, por una pequeña franja de arracacho y abundante sedimentación que dificulta el acceso. Al interior _x000D_\r\r\n se encontró un bosque medianamente denso con presencia de R. mangle, L. racemosa y Nectandra sp ( sp asociada al ecosistema panganal).",3548,"Funcionario Corpamag",null,null,null,null,null,"CMS","Consultoria y Monitoreo Ambiental"]
[null,null,null,null,null,null,null,null,null,null,null,null,null,null,null,null,"Bahía Marirrio","DRATR-ZP1-Bmari-2",48489,2380,"Bosque ralo al interior.  Se evidenciaron árboles cortados inclusive de los incluidos en la parcela, quitaron números de árboles marcados, por lo tanto se debió remarcar. Presencia de R. mangle y, L. racemosa.  Presión antrópica relacionada por Corta de Varas.",3547,"Funcionario Corpoguajira",null,null,null,null,null,"CVC","Corporacion  Autonoma Regional del Valle del Cauca"]
[null,null,null,null,null,null,null,null,null,null,null,null,null,null,null,null,"Bahía Marirrio","DRATR-ZP1-Bmari-3",48539,2393,"Bosque denso hacia afuera pero ralo al interior.Presencia de R. mangle, L. racemosa y P. rhizophorae.Presencia de orquídeas y helecho A. aureum.  Presión antrópica relacionada por Corta de Varas.",3557,"Funcionario corponarino",null,null,null,null,null,"CORPONARIÑO","Corporacion Autonoma Regional de Nariño"]
[null,null,null,null,null,null,null,null,null,null,null,null,null,null,null,null,"Balboa-1","CNGBAL-ZP3-Balboa-1",45097,2003,"La parcela se localiza tierra adentro de la ciénaga a 170 m  de la línea de agua y a 215 m de la carretera. El bosque de mangle es denso en el área de la parcela,  en los últimos metros se observa B. marítima  y se encuentra un arroyo, otro arroyo a  5 metros antes del inicio de la parcela.",8559,"Geraldine Salcedo",null,null,null,null,null,"CARSUCRE","Corporacion Autonoma Regional de Sucre"]
[null,null,null,null,null,null,null,null,null,null,null,null,null,null,null,null,"Baru1","BARU-ZR1-Barú-1",44580,1785,"Estación con presencia de R. mangle, A. germinans y L. racemosa, abundante regeneración, neumatóforos con tamaños superiores a 15 cm.  Nivel de inundación promedio de 10 cm, bosque con árboles secos. Ubicada en la costa de la ciénaga de los cansados.",7380,"INGRID CATALINA CORTES ZAMBRANO",null,null,null,null,null,"CRA","Corporacion Autonoma Regional del Atlàntico"]
[null,null,null,null,null,null,null,null,null,null,null,null,null,null,null,null,"Bazo Matuntugo -1","DRATR-ZR1-Bmat-1",48517,2384,"Bosque medianamente denso, presencia de R. mangle, L. racemosa y Nectandra sp ( sp asociada al ecosistema panganal).  Presión antrópica relacionada por Corta de Varas así mismo se observan agallas en todas las estructuras del manglar. Arboles mal formados.",4127,"Investigador INVEMAR",null,null,null,null,null,"CARDIQUE","Corporacion Autonoma Regional del Canal del Dique"]
[null,null,null,null,null,null,null,null,null,null,null,null,null,null,null,null,"Berrugas","BERR-ZR1-BERR-1",42202,1139,null,7141,"Juan Camilo Rodríguez Atara",null,null,null,null,null,"CRC","Corporacion Autonoma Regional del Cauca"]
[null,null,null,null,null,null,null,null,null,null,null,null,null,null,null,null,"Boca Cerrada","BCER-ZUS1-BCER-1",44387,1723,"Esta parcela ubica da cerca de la población de boca cerrada, presenta abundancia de Rhizophora mangle",8217,"Juan Lazarus",null,null,null,null,null,"CODECHOCO","Corporacion para el Desarrollo Sostenible del Choco"]
[null,null,null,null,null,null,null,null,null,null,null,null,null,null,null,null,"Boca ISCUANDE","ISCUANDE-ZR1-GUABA-1",45918,2151,"BOSQUE NATAL MIXTO CON ESPECIES DE NATO, PALMA NAIDI, SUELA, SAPOTOLONGO. EL SUELO PRESENTA CONSISTENCIA DURA . PRESENCIA DE REGENERACIÓN NATURAL DE PIÑUELO EN ALGUNOS CLAROS. NATO POCO INTERVENIDO.",7337,"Julian David Beltran Pedraza",null,null,null,null,null,"CORPOGUAJIRA","Corporación Autónoma Regional de la Guajira"]
[null,null,null,null,null,null,null,null,null,null,null,null,null,null,null,null,"Boca Vieja","Coquí-ZUS1-Bovi-1",45418,2068,"Parcela 0.1 ha, ubicada de manera perpendicular al borde del Estero Saturio, a 1,45 km aproximadamente de la comunidad de Coquí. Su bosque está compuesto por: Rhizophora mangle, Pelliciera rhizophorae y Mora oleifera.",8265,"Kevin Samuel Moreno",null,null,null,null,null,"CORALINA","Corporación Autónoma Regional de las Islas de San Andrés, Providencia y Santa Catalina"]
[null,null,null,null,null,null,null,null,null,null,null,null,null,null,null,null,"Bocana","AST-ZP1-BOCA-1",41967,1065,"Dificil acceso por cercas de alambres puas, Suelo anegadocon vegetacion brinzal",3281,"Leonardo José Arias Alemán (2022)",null,null,null,null,null,"CORPAMAG","Corporación Autónoma Regional del Magdalena"]
[null,null,null,null,null,null,null,null,null,null,null,null,null,null,null,null,"Bocana Asocars","BVENT-ZR3-BA-1",45883,2139,"Es importante destacar que estos bosques reciben una fuerte descarga de residuos sólidos provenientes de la ciudad de Bueventura que tiene una población de aproximadamente 400.000 habitantes.   En este sector predomina el Rhizophora mangle y en algunas parcelas la regeneración natural es nula.",8617,"Lina Gabriela Melo Flórez",null,null,null,null,null,"CORPOURABA","Corporación Autónoma Regional del Uraba"]
[null,null,null,null,null,null,null,null,null,null,null,null,null,null,null,null,"Bocana CVC","BVENT-ZR3-BCVC-1",45862,2136,"En términos generales este bosque a pesar de presentar un distribución diamétrica en forma de J invertida, es característico de un bosque altamente intervenido en concordancia con la zonificación de 2007 y se aprecia claramente en el valor del área basal de 10 m2 Ha, diámetro promedio de 10 cms con alturas que no superan los 24 metros y una baja densidad de árboles en las clases diamétricas superiores.",8658,"Lina Marcela Escobar Vergara",null,null,null,null,null,"CVC-UNPA","Corporación Autónoma Regional del Valle del Cauca-Universidad del Pacifico"]
[null,null,null,null,null,null,null,null,null,null,null,null,null,null,null,null,"Bocas TAPAGE -1","TAPAGE-ZR2-BOTAPAJE-1",45900,2144,"BOSQUE DE MANGLE ROJO BIEN DESARROLLADO CON ALTA DENSIDAD DE RAÍCES AÉREAS, SE OBSERVA PRESENCIA DE TALAS DE INDIVIDUOS DE MAYOR PORTE.",3562,"Lucia V Licero Villanueva",null,null,null,null,null,"CORALINA OMACHA","Corporación Coralina - Fundación Omacha"]
[null,null,null,null,null,null,null,null,null,null,null,null,null,null,null,null,"Bocas de SEQUIHONDA -1","TAPAGE-ZR1-SEQUIHONDA-1",45896,2143,"BOSQUE DE MANGLE MIXTO. SU COMPOSICIÓN FLORISTICA DE MANGLE PIÑUELO, NATO E IGUANERO. ALTA REGENERACIÓN NATURAL. CONSISTENCIA DEL SUELO ALTAMENTE BLANDA",6302,"Luisa Francisca Cardona Acuña",null,null,null,null,null,"CORPOURABA - OMACHA","Corporación Corpouraba - Fundación Omacha"]
[null,null,null,null,null,null,null,null,null,null,null,null,null,null,null,null,"Bodegas","ANCHI-ZR1-AB-1",45891,2142,"Bosque medianamente intervenido con dominancia de mangle rojo.  Suelos más estables que en las otras parcelas donde predomina el mangle rojo.",7377,"MARGARITA ROSA DUSSAN ARQUEZ",null,null,null,null,null,"CVS","Corporación Regional de Valle del Sinu y San Jorge"]
[null,null,null,null,null,null,null,null,null,null,null,null,null,null,null,null,"Buno-1","CORI-ZUS1-Buno-1",48444,2372,"Desde fuera se observa una franja rala del ecosistema con árboles de porte bajo.  Mayor presencia de R, mangle y menor de A. germinans y L. racemosa. Al inferior se reportan las mismas especies. El sotobosque dominado por  helecho matatigre (A, aureum),  Se observan tocones por la corta de varas.  Presencia de comején, bolsas plásticas, tarros y basuras en general.",8340,"María Alejandra Camargo Vargas",null,null,null,null,null,"DADSA","DEPARTAMENT0 ADMiNISTRATIVO DISTRITAL DE SOSTENIBILIDAD AMBIENTAL"]
[null,null,null,null,null,null,null,null,null,null,null,null,null,null,null,null,"Buritaca 2","BUR-ZR1-Buritac2-1",45320,2046,"La parcela está ubicada a una distancia de 700 m al oriente de la desembocadura del Río Buritaca, 50 m del borde de la cobertura vegetal. Es un relicto de mangle constituido por L. racemos, en los últimos metros de la Parcela se observa una ligera depresión en la que se acumula agua, y es alimentada por las crecidas del rio. También se observa mangle inclinados y volcados además de zonas taladas.",8880,"Natalia Del Pilar Peña Gonzalez",null,null,null,null,null,"DAMARENA","Departamento Administrativo del Medio Ambiente de Cartagena -  EPA Cartagena"]
[null,null,null,null,null,null,null,null,null,null,null,null,null,null,null,null,"Buritaca 2-1","BUR-ZP1-Buritac2-1",45308,2043,"Se localiza en el costado oriental del río Buritaca a 1 km de la desembocadura, a  60 m del borde de la cobertura vegetal y a pocos metros del final del manglar. En las inmediaciones hay palmas de coco, matorrales y pastos. Dentro de la parcela entre 15 a 20 m el suelo esta encharcado con presencia de ranconcha y arboles inclinados.",4521,"Sebastian Herrera Fajardo",null,null,null,null,null,"DAMAB","Departamento Técnico Administrativo del Medio Ambiente Barranquilla"]
[null,null,null,null,null,null,null,null,null,null,null,null,null,null,null,null,"Buritaca ZP 1-1","BUR-ZP1-Buritac1-1",45305,2042,"Se ubica a 400 m de la desembocadura del río Buritaca,  y  a una distancia de 17 m  del borde de la cobertura vegetal que da a la playa turística que da a una madre vieja y esta a su vez está protegida del mar por una barra de arena. En esta área la franja de manglar es más ancha.",7382,"Valentina Piñeros",null,null,null,null,null,"DIMAR","Dirección General Maritima"]
[null,null,null,null,null,null,null,null,null,null,null,null,null,null,null,null,"Buritaca ZR 1","BUR-ZR1-Buritc1-1",45315,2044,"Se localiza a 800 m de la desembocadura del río Buritaca, en el extremo más al occidental del manglar, limita con zonas de potrero,  a una distancia de 18 m  del borde de la línea de cobertura vegetal. La parcela está constituida por mangla  L. racemosa y vegetación de playa. La franja de cobertura de mangla es reducida.",8266,"Zulay Saudith González Herrera",null,null,null,null,null,"ECOREEF","ECOREEF Colombia LTDA"]
[null,null,null,null,null,null,null,null,null,null,null,null,null,null,null,null,"CENTRO ","CENTRO_JON",58102,2849,null,null,null,null,null,null,null,null,"ETH Zurich","EIDGENÖSSISCHE TECHNISCHE HOCHSCHULE ZÜRICH (Politécnico)\r\r\nEIDGENÖSSISCHE TECHNISCHE HOCHSCHULE ZÜRICH"]
[null,null,null,null,null,null,null,null,null,null,null,null,null,null,null,null,"CENTRO ","CENTRO_SAN",58126,2846,null,null,null,null,null,null,null,null,"ECOMAR","Ecomar Consultoría  Ambiental S.A.S."]
[null,null,null,null,null,null,null,null,null,null,null,null,null,null,null,null,"Caimanero","VIRU-SZ1-CAIM-1",42117,1106,null,null,null,null,null,null,null,null,"EPA BARRANQUILLA","Establecimiento Publico Ambiental Barranquilla"]
[null,null,null,null,null,null,null,null,null,null,null,null,null,null,null,null,"Camino Real","CAMREAL-ZUS1-CAMREAL-1",45387,2060,"VEGETACIÓN DE MANGLE ROJO ADULTO  BIEN DESARROLLADO CON INTERVENCIONES ESPORADICAS",null,null,null,null,null,null,null,"EPA BUENAVENTURA","Establecimiento Publico Ambiental Buenaventura"]
[null,null,null,null,null,null,null,null,null,null,null,null,null,null,null,null,"Cangrejo","MAYO-ZUS1-Can-1",46010,2215,null,null,null,null,null,null,null,null,"EPA CARTAGENA","Establecimiento Publico Ambiental Cartagena"]
[null,null,null,null,null,null,null,null,null,null,null,null,null,null,null,null,"Caño Arteaga","BCISEST-ZUS1-CñArteaga-1",48750,2435,null,null,null,null,null,null,null,null,"ZOOCALI","FUNDACIÓN ZOOLÓGICA DE CALI"]
[null,null,null,null,null,null,null,null,null,null,null,null,null,null,null,null,"Caño Camaronera-1","BARC-ZUS1-CCAM-1",44380,1721,"La parcela se encuentra  paralela al caño la Camaronera, presenta intervención por parte del hombre",null,null,null,null,null,null,null,"Fundabas","Fundacion Para El Desarrollo De La Biologia Aplicada"]
[null,null,null,null,null,null,null,null,null,null,null,null,null,null,null,null,"Caño Corea -1","TIN-ZR1-EC-1",42093,1099,"ESTACION COREA",null,null,null,null,null,null,null,"F. Bucea Colombia","Fundación Bucea Colombia"]
[null,null,null,null,null,null,null,null,null,null,null,null,null,null,null,null,"Caño Dulce-1","CÑDULC-SZ1-CÑDULC-1",45264,2027,"Se ubica a 55 m al sur de la vía a la playa de Caño Dulce y a 16 m de la línea de vegetación, entre dos casas.  El crecimiento del mangle es ramificado, se observa intervención de la parcela para evitar el crecimiento de brinzales, para el fácil tránsito. Presenta suelos firmes y arcillosos. Se encontraron residuos sólidos.",null,null,null,null,null,null,null,"F.CORALES","Fundación Corales de Paz"]
[null,null,null,null,null,null,null,null,null,null,null,null,null,null,null,null,"Caño Grande E-1","CGSM-SZ1-CGE-1",45930,2157,"Parcela 1 monitoreada por el INVEMAR en el marco del ¨Monitoreo de las condiciones ambientales y los cambios estructurales y funcionales de las comunidades vegetales y de los recursos pesqueros durante la rehabilitación de la Ciénaga Grande de Santa Marta¨",null,null,null,null,null,null,null,"F. Malpelo","Fundación Malpelo / Marviva"]
[null,null,null,null,null,null,null,null,null,null,null,null,null,null,null,null,"Caño Grande E-2","CGSM-SZ1-CGE-2",45932,2158,"Parcela 2 monitoreada por el INVEMAR en el marco del ¨Monitoreo de las condiciones ambientales y los cambios estructurales y funcionales de las comunidades vegetales y de los recursos pesqueros durante la rehabilitación de la Ciénaga Grande de Santa Marta¨",null,null,null,null,null,null,null,"OMACHA","Fundación Omacha"]
[null,null,null,null,null,null,null,null,null,null,null,null,null,null,null,null,"Caño Grande E-3","CGSM-SZ1-CGE-3",45934,2159,"Parcela 3 monitoreada por el INVEMAR en el marco del ¨Monitoreo de las condiciones ambientales y los cambios estructurales y funcionales de las comunidades vegetales y de los recursos pesqueros durante la rehabilitación de la Ciénaga Grande de Santa Marta¨",null,null,null,null,null,null,null,"OMACHA - OFM","Fundación Omacha - Observadores Fauna Marina"]
[null,null,null,null,null,null,null,null,null,null,null,null,null,null,null,null,"Caño Grande-1","BCISEST-ZUS2-cañogrande-1",45072,1997,"la paralela se encuentra ubicada en la zona de uso sostenible de caño grande en la ciénaga mangoneas, con bajos niveles de inundación y con predominancia de la especia Rhizophora mangle, se observaba intervención de por actividades antro picas",null,null,null,null,null,null,null,"OMACHA - OFM - AQUAB","Fundación Omacha - Observadores Fauna Marina - Aquabiosfera"]
[null,null,null,null,null,null,null,null,null,null,null,null,null,null,null,null,"Caño Guacamayas-1","GUAC-ZP1-CGUA-1",44410,1729,"la parcela se encuentra paralela al caño de Guacamayas",null,null,null,null,null,null,null,"Sila Kangama","Fundación Sila Kangama"]
[null,null,null,null,null,null,null,null,null,null,null,null,null,null,null,null,"Caño La Balsa","LBAL-ZUS1-clb-1",42074,1094,"parcela caño la balsa",null,null,null,null,null,null,null,"CIAA-UJTL","Fundación Universidad Jorge Tadeo Lozano - Centro de Investigaciones y Asesorías Agroindustriales,"]
[null,null,null,null,null,null,null,null,null,null,null,null,null,null,null,null,"Caño Lequerica","BARB-ZR1-Lequerica-1",44504,1762,"Parcela con árboles de R, mangle de gran altura, en algunos casos 30 metros, inundación en toda la parcela y   abundante regeneración natural de R. mangle.  árboles secos y caídos.",null,null,null,null,null,null,null,"UJTL","Fundación Universidad de Bogotá Jorge Tadeo Lozano"]
[null,null,null,null,null,null,null,null,null,null,null,null,null,null,null,null,"Caño Matuna-1","BARC-ZUS1-CMAT-1",44378,1720,"la parcela se encuentra a 30 metros de la boca del caño Matuna",null,null,null,null,null,null,null,"CERG","Geochemical & Environmental Research Group"]
[null,null,null,null,null,null,null,null,null,null,null,null,null,null,null,null,"Caño Palermo-1","BCISEST-ZUS4-palermo-1",45100,2004,"la parcela esta ubicada en la zona de uso sostenible del sector caño palermo , con predominancia de la especie Rhizopohora mangle",null,null,null,null,null,null,null,"IED_San José","INSTITUCIÓN EDUCATIVA DEPARTAMENTAL SAN JOSÉ"]
[null,null,null,null,null,null,null,null,null,null,null,null,null,null,null,null,"Caño Salado","BCISEST-ZP1-CñSalado-1",48758,2438,null,null,null,null,null,null,null,null,"IRD","Institut de Recherche pour le Developpement"]
[null,null,null,null,null,null,null,null,null,null,null,null,null,null,null,null,"Caño Salado -2","BCISEST-ZP1-cañosalado2-1",45351,2053,"parcela ubicada en el sector de caño salado, con predominancia de las especies Rhizophora mangle,Pelliciera rhizophorae,Avicennia germinans, los arboles presenta condición de raquitismo, los niveles de inundación son bajos, por el sedimentos debido al material de arastre que trae el rio",null,null,null,null,null,null,null,"COLCIENCIAS","Instituto Colombiano para el Desarrollo de la Ciencia y la Tecnología"]
[null,null,null,null,null,null,null,null,null,null,null,null,null,null,null,null,"Caño Salado-11","BCISESTSAL-ZP1-CS-1",42083,1096,null,null,null,null,null,null,null,null,"ICAL","Instituto Colombo Alemán de Investigaciones Científicas de Punta de Betín"]
[null,null,null,null,null,null,null,null,null,null,null,null,null,null,null,null,"Caño Tijo-1","CSISPIE-ZUS1-CñTijo-1",48755,2437,null,null,null,null,null,null,null,null,"INVEMAR - OMACHA","Instituto INVEMAR - Fundación Omacha"]
[null,null,null,null,null,null,null,null,null,null,null,null,null,null,null,null,"Caño Tijo-2","BCISEST-ZR1-eltijo2-1",45095,2002,"la parcela esta ubicada en en la zona de recuperación del DMI,con predominancia de la especie Avicennia germinans",null,null,null,null,null,null,null,"INDERENA","Instituto Nacional de los Recursos Naturales Renovables y del Ambiente"]
[null,null,null,null,null,null,null,null,null,null,null,null,null,null,null,null,"Caño Tijo-2","BCISLIT-ZUS1-TIJO-1",45008,1993,"La PPC se ubica en la ZUS de la Bahía de Cispatá, con influencia directa del Caño Tijó y con alta inundación. Presenta dominancia de A. germinans, con alta regeneración natural. Se presentan en menor proporción R. mangle.",null,null,null,null,null,null,null,"ICML","Instituto de Ciencias del Mar y Limnología (ICML)"]
[null,null,null,null,null,null,null,null,null,null,null,null,null,null,null,null,"Caño Urabalito -1","CORI-ZR1-Cura-1",48429,2367,"Pequeño relicto monoespecífico de R. mangle, sin evidencias de presión antrópica.",null,null,null,null,null,null,null,"IIAP","Instituto de Investigaciones Ambientales del Pacifico"]
[null,null,null,null,null,null,null,null,null,null,null,null,null,null,null,null,"Caño el Frances-1","FRAN-ZR1-BCFRA-1",44414,1730,"La parcela se encuentra paralela al coño el Frances",null,null,null,null,null,null,null,"INVEMAR","Instituto de Investigaciones Marinas y Costeras"]
[null,null,null,null,null,null,null,null,null,null,null,null,null,null,null,null,"Caño el Nene -1","CCISinu-ZUS1-elnene-1",45040,1995,"la parcela ubicada en el sector caño el nene, con predominancia de la especie Rhizophora mangle, la cual esta sometida a una constante presión, por aprovechamiento forestal en el sector.",null,null,null,null,null,null,null,"INVEMAR-AGR","Instituto de Investigaciones Marinas y Costeras - AGR"]
[null,null,null,null,null,null,null,null,null,null,null,null,null,null,null,null,"CañoTubo","CNGMLLQ-ZP1-CATO-1",41954,1062,"Parcela dominada por A. germinans",null,null,null,null,null,null,null,"INVEMAR-BVT","Instituto de Investigaciones Marinas y Costeras - BVT"]
[null,null,null,null,null,null,null,null,null,null,null,null,null,null,null,null,"Chamuscado","BNAY-ZUS3-NC-1",45821,2128,"El manglar de la estación naya presenta una condiciones regulares de conservación con una  área basal  y una cantidad de árboles aceptables  que permiten su recuperación si se garantizan estrategias de conservación como el aislamiento del bosque articuladas a un fuerte trabajo de empoderamiento por parte de las comunidades de base.",null,null,null,null,null,null,null,"INVEMAR-CPT","Instituto de Investigaciones Marinas y Costeras - CPT"]
[null,null,null,null,null,null,null,null,null,null,null,null,null,null,null,null,"Chichiman -1","PCOM-ZR1-Chichi-1",42181,1132,"franja que se encuentra en un estado de intervención alterado bajo, con sitios de anidacion de la tortuga Carey",null,null,null,null,null,null,null,"IAvH","Instituto de Investigación Recursos Biológicos Alexander von Humboldt"]
[null,null,null,null,null,null,null,null,null,null,null,null,null,null,null,null,"Cholon-1","BARU-ZR1-Cholón-1",44585,1787,"Dominada por R. mangle con numerosas raíces fúlcreas, sustrato duro.  Al final de la estación comienza vegetación de bosque seco.",null,null,null,null,null,null,null,"IDO_Cuba","Instituto de Oceanologia Cuba"]
[null,null,null,null,null,null,null,null,null,null,null,null,null,null,null,null,"Cienaga El Picon-1","TBOM-ZP1-Picón-1",44598,1791,"Sitio con mucha basura al ingreso de la estación, don dominancia de R. mangle, se observaron pequeños parches de tala",null,null,null,null,null,null,null,"IATTC","Inter-American Tropical Tuna Commission"]
[null,null,null,null,null,null,null,null,null,null,null,null,null,null,null,null,"Ciénaga Ana Gomez-2","CANG-ZR1-CANG-2",44407,1728,"La parcela esta ubicada al costado derecho de la Boca de la Ciénaga, presenta abundante arbolado de Mangle Negro de pequeño tamaño.",null,null,null,null,null,null,null,"LABORMAR","Laboratorio Microbiológico Ortiz Martinez "]
[null,null,null,null,null,null,null,null,null,null,null,null,null,null,null,null,"Ciénaga Benitez-1","CBEN-ZR1-CBEN-1",44369,1718,"La parcela se ubica  entre caño Rico y Ciénaga Ana Gómez,  a 30 metros del cuerpo de agua",null,null,null,null,null,null,null,"Literature report","Literature report"]
[null,null,null,null,null,null,null,null,null,null,null,null,null,null,null,null,"Ciénaga Caimanera-1","CCAIM-ZUS1-CCAIM-1",44422,1732,null,null,null,null,null,null,null,null,"MCS Consultoría","MCS Consultoría y Monitoreo ambiental S.A.S"]
[null,null,null,null,null,null,null,null,null,null,null,null,null,null,null,null,"Ciénaga El Garzal -2","BCISEST-ZR1-elgarzal-2",45078,1998,"la parcela se encuentra ubicada en el sector caño el grazal en la zona de uso sostenible de la bahía de cispata, con predominancia de la especie Avicenia gerninans, con arboles de gran tamaño y sanos.",null,null,null,null,null,null,null,"MAKARELA","Makarela S.A.S"]
[null,null,null,null,null,null,null,null,null,null,null,null,null,null,null,null,"Ciénaga El Garzal-1","BCISEST-ZR1-elgarzal-1",45054,1996,"la parcela esta ubicada en el sector de aprovechamiento de la ciénaga el garzal, con predominancia de la especie Rhizophora mangle, en una zona de bajos novales de inundación.",null,null,null,null,null,null,null,"MHNMC","Makuriwa - Museo de Historia Natural Marina de Colombia"]
[null,null,null,null,null,null,null,null,null,null,null,null,null,null,null,null,"Ciénaga El Garzal-3","BCISEST-ZUS1-elgarzal3-1",45145,2016,"parcela ubicada en la zona de uso sostenible del sub sector de aprovechamiento de la ciénaga el garzal, con predominancia de especie Rhizophora mangle, en esta parcela se observan gran cantidad de arboles muertos, huellas de aprovechamiento forestal de la especie,",null,null,null,null,null,null,null,"MMU","Manchester Metropolitan University"]
[null,null,null,null,null,null,null,null,null,null,null,null,null,null,null,null,"Ciénaga Galo","BCISEST-ZR1-golo-1",45118,2008,"ubicada en el sector de la ciénaga galo en la zona de uso sostenible de la bahía de cispata, con predominancia de la especie Rhizophora mangle, con arboles de gran tamaño, sanos y con bajos niveles de inundación.",null,null,null,null,null,null,null,"M_P","Marine & Port Consultants"]
[null,null,null,null,null,null,null,null,null,null,null,null,null,null,null,null,"Ciénaga Galo","BCISEST-ZUS1-CgGalo-1",48753,2436,null,null,null,null,null,null,null,null,"IAEA-MEL","Marine Environment Laboratories"]
[null,null,null,null,null,null,null,null,null,null,null,null,null,null,null,null,"Ciénaga Manzanillo-1","MABA-ZP1-Manzanillo-1",49325,1,"parcela fija (2 subparcelas). Estación Manglar Manzanillo (formada por 2 parcelas circulares): Manglar localizado al sur de la isla, constituido principalmente por Rhizophora mangle, como especie dominante y por Laguncularia racemosa. Se encuentra detrás de una barra arenosa y en su interior tiene un pequeño canal central en el que se acumulan aguas derivadas de la escorrentía y de un arroyo que se forma en época de lluvias, proveniente de Murray Hills. Tiene una cobertura de manglar de 1,59 ha (INVEMAR-CORALINA, 2016).",null,null,null,null,null,null,null,"MINCIENCIAS","Ministerio de Ciencia, Tecnología e Innovación"]
[null,null,null,null,null,null,null,null,null,null,null,null,null,null,null,null,"Ciénaga Mestizos-1","BCISLIT-ZP1-CgMestizo-1",48766,2440,null,null,null,null,null,null,null,null,"MA","Ministerio del Ambiente Haiti"]
[null,null,null,null,null,null,null,null,null,null,null,null,null,null,null,null,"Ciénaga Ostional-1","BCISEST-ZUS2-ostional-1",45121,2009,"la parcela cuenta con un gran numero de arboles de la especie Rhizophora mangle, de gran tamaño, y con un gran porcentaje de regeneración natural en un estado sano.",null,null,null,null,null,null,null,"MADS","Ministerio del Ambiente y Desarrollo Sostenible"]
[null,null,null,null,null,null,null,null,null,null,null,null,null,null,null,null,"Ciénaga Remedia Pobre-1","BCISEST-ZUS1-remediapobre-1",45136,2013,"la parcela esta ubicada en la ciénaga remedia pobre que esta situada en el subsector de aprovechamiento del DMI con una baja densidad de arboles por parcela y con predominancia de la especia Rhiphora mangle",null,null,null,null,null,null,null,"MINAMBIENTE","Ministerio del Ambiente y Desarrollo Sostenible"]
[null,null,null,null,null,null,null,null,null,null,null,null,null,null,null,null,"Ciénaga Rincon Grillo-1","BCISEST-ZUS4-elgrillo-1",45125,2010,"la parcela esta ubicada en el sector el rincón del grillo en la zona de uso sostenible de la bahía de cispata, con predominancia de la especie Rhizopora mangle, con arboles de gran tamaño, se encuentran algunas lianas y elechales",null,null,null,null,null,null,null,"MHN-UC","Museo Historia Natural Universidad del Cauca"]
[null,null,null,null,null,null,null,null,null,null,null,null,null,null,null,null,"Ciénaga Soledad","BCISEST-ZR1-soledad-1",45142,2015,"esta parcela esta predominada por la especie Rhizopora mangle, se presenta muerte descendente en algunos arboles y muchos presentan una condición de raquitismo, también  existen algunas lianas",null,null,null,null,null,null,null,"MZUSP","Museu de Zoologia da Universidade de São Paulo"]
[null,null,null,null,null,null,null,null,null,null,null,null,null,null,null,null,"Ciénaga la Balsa-1","BCISLIT-ZUS1-CñBalsa-1",48769,2441,null,null,null,null,null,null,null,null,"NOAA FISHERIES","NOAA Southwest Fisheries Science Center"]
[null,null,null,null,null,null,null,null,null,null,null,null,null,null,null,null,"Cocoplum B-1","COCO-ZP1-CO-1",41479,919,null,null,null,null,null,null,null,null,"NEPA","National Environment and Planning Agency"]
[null,null,null,null,null,null,null,null,null,null,null,null,null,null,null,null,"Cocoplum parcela circular-2","CocoplumPPC-2",55552,null,"Estación Manglar Cocoplum (formada por 3 parcelas circulares):Manglar de cuenca o interior, localizado en el costado oriental de la Isla, en la zona media. Se encuentra separado del mar por la carretera y se desarrolla detrás de formaciones vegetales distintas al manglar, en las que algunas de ellas son de tipo xerófila que crecen sobre arenas formando matorrales. Este manglar está conformado por Rhizophora mangle, Laguncularia racemosa, Avicennia germinans y baja frecuencia de Conocarpus erectus. Altura promedio de los árboles de 8,1 m. Presenta contaminación proveniente del asentamiento vecino conocido como Nueva Guinea, causante del vertimiento de aguas residuales y mala disposición de residuos sólidos, así como de una porqueriza localizada muy cerca del manglar. Hay evidencia de actividades de tala en su interior y de rellenos. Tiene una extensión de manglar de 38,53 ha (INVEMAR-CORALINA, 2016).",null,null,null,null,null,null,null,"NOAA","National Oceanic and Atmospheric Administration"]
[null,null,null,null,null,null,null,null,null,null,null,null,null,null,null,null,"Cocoplum parcela circular-3","CocoplumPPC-3",55553,null,"Estación Manglar Cocoplum (formada por 3 parcelas circulares):Manglar de cuenca o interior, localizado en el costado oriental de la Isla, en la zona media. Se encuentra separado del mar por la carretera y se desarrolla detrás de formaciones vegetales distintas al manglar, en las que algunas de ellas son de tipo xerófila que crecen sobre arenas formando matorrales. Este manglar está conformado por Rhizophora mangle, Laguncularia racemosa, Avicennia germinans y baja frecuencia de Conocarpus erectus. Altura promedio de los árboles de 8,1 m. Presenta contaminación proveniente del asentamiento vecino conocido como Nueva Guinea, causante del vertimiento de aguas residuales y mala disposición de residuos sólidos, así como de una porqueriza localizada muy cerca del manglar. Hay evidencia de actividades de tala en su interior y de rellenos. Tiene una extensión de manglar de 38,53 ha (INVEMAR-CORALINA, 2016).",null,null,null,null,null,null,null,"OBIMAR","OBIMAR. Empresa Portuaria Quetzal"]
[null,null,null,null,null,null,null,null,null,null,null,null,null,null,null,null,"Concho","Curch-ZUS1-Concho-1",45429,2071,"Ubicada a 5.2 km aproximadamente de la localidad de Juradó, en la cabecera de un pequeño Estero que se comunica con el Estero que comunica a Juradó con Curiche; su composición forestal está dada por la presencia de cuatro (4) especies a saber: Mora oleifera, Pelliciera rhizophorae, Rhizophora mangle y Rhizophora recamosa. La parcela está limitada en su parte Este por un  Catival.",null,null,null,null,null,null,null,"OBIS-SEAMAP","OBIS-SEAMAP"]
[null,null,null,null,null,null,null,null,null,null,null,null,null,null,null,null,"Concho","JURA-ZUS1-Concho-1",45575,2120,"Ubicada a 5.2 km aproximadamente de la localidad de Juradó, en la cabecera de un pequeño Estero que se comunica con el Estero que comunica a Juradó con Curiche; su composición forestal está dada por la presencia de cuatro (4) especies a saber: Mora oleifera, Pelliciera rhizophorae, Rhizophora mangle y Rhizophora recamosa. La parcela está limitada en su parte Este por una asociación  Catival.",null,null,null,null,null,null,null,"OBIS","Ocean Biogeographic Information System"]
[null,null,null,null,null,null,null,null,null,null,null,null,null,null,null,null,"Costa Verde P1","COR-ZP1-CtaVerde-1",45301,2041,"La parcela se encuentra en el sur del parche de manglar de mayor extensión ubicado al sur del sector. Se localiza 40 m al norte del espolón, a 14 m de la playa, el inicio de la parcela da a pocos metros un camino y la parte final a una pequeña cuneta de agua. Constituida por las 4 especies de mangle reportadas para el Dpto. con predominio de A. germinans.",null,null,null,null,null,null,null,"OIR","Oceanario de las Islas del Rosario - CEINER"]
[null,null,null,null,null,null,null,null,null,null,null,null,null,null,null,null,"Costa Verde R1","COR-ZR1-CtaVerde-1",45297,2040,"La parcela se encuentra en el norte del parche de manglar de mayor extensión ubicado al sur del sector. Se localiza a  600 m al sur de la desembocadura del rio Córdoba, a 20 m la playa. Dentro de la parcela predomina L. racemosa, R. mangle y presencia de C. erectus,  los suelos que dan a la playa son arenosos y firmes.",null,null,null,null,null,null,null,"OIEA","Orgánismo Internacional de Energía Atómica"]
[null,null,null,null,null,null,null,null,null,null,null,null,null,null,null,null,"Cuerval","CUER-ZP2-CUERVAL-1",45489,2085,"Parcela sencilla de 20 m de ancho x 50 m de largo",null,null,null,null,null,null,null,"PNN_GORGONA","Parque Nacional Natural Gorgona"]
[null,null,null,null,null,null,null,null,null,null,null,null,null,null,null,null,"DCI CLARIN PARCELA1","DCI_P1",58076,2828,null,null,null,null,null,null,null,null,"UAESPNN","Parques Nacionales Naturales de Colombia"]
[null,null,null,null,null,null,null,null,null,null,null,null,null,null,null,null,"DCI CLARIN PARCELA2","DCI_P2",58077,2829,null,null,null,null,null,null,null,null,"PNN","Parques Nacionales Naturales de Colombia "]
[null,null,null,null,null,null,null,null,null,null,null,null,null,null,null,null,"DCI CLARIN PARCELA3","DCI_P3",58078,2830,null,null,null,null,null,null,null,null,"PARTICULAR","Particular"]
[null,null,null,null,null,null,null,null,null,null,null,null,null,null,null,null,"DCI PARCELA1","DCI_P1",58060,2817,null,null,null,null,null,null,null,null,"PUJ","Pontificia Universidad Javeriana"]
[null,null,null,null,null,null,null,null,null,null,null,null,null,null,null,null,"DCI PARCELA2","DCI_P2",58061,2818,null,null,null,null,null,null,null,null,"RAC-CIMAB","RAC-CIMAB"]
[null,null,null,null,null,null,null,null,null,null,null,null,null,null,null,null,"DCI PARCELA3","DCI_P3",58062,2819,null,null,null,null,null,null,null,null,"REPSOL","Repsol Exploración Colombia S.A."]
[null,null,null,null,null,null,null,null,null,null,null,null,null,null,null,null,"DSI CLARIN PARCELA1","DSI_P1",58072,2825,null,null,null,null,null,null,null,null,"SERNA","Secretaría de Recursos Naturales y Ambiente (SERNA)/Centro de Estudios y Control de Contaminantes (CESCCO)"]
[null,null,null,null,null,null,null,null,null,null,null,null,null,null,null,null,"DSI CLARIN PARCELA2","DSI_P2",58073,2826,null,null,null,null,null,null,null,null,"SERAMBIENTE","Servicios de Ingeniería Ambiental"]
[null,null,null,null,null,null,null,null,null,null,null,null,null,null,null,null,"DSI CLARIN PARCELA3","DSI_P3",58074,2827,null,null,null,null,null,null,null,null,"SEPC","Shell Exploration & Production Colombia GMBH"]
[null,null,null,null,null,null,null,null,null,null,null,null,null,null,null,null,"DSI PARCELA1","DSI_P1",58064,2820,null,null,null,null,null,null,null,null,"NMHN Smithsonian","Smithsonian Institution"]
[null,null,null,null,null,null,null,null,null,null,null,null,null,null,null,null,"DSI PARCELA2","DSI_P2",58065,2821,null,null,null,null,null,null,null,null,"SPRC - CNR","Sociedad Portuaria Rio Cordoba - Colombian Natural Resources S.A.S."]
[null,null,null,null,null,null,null,null,null,null,null,null,null,null,null,null,"DSI PARCELA3","DSI_P3",58066,2822,null,null,null,null,null,null,null,null,"SPSM","Sociedad Portuaria de Santa Marta"]
[null,null,null,null,null,null,null,null,null,null,null,null,null,null,null,null,"Don Diego","DDGO-ZR1-DnDieg-1",45330,2048,"Ubicadas a 150 m al Oriente de la cabaña de pescador, en el orilla Norte de la madre vieja. Es una parcela compuesta constituida con 2 parcelas distanciadas 16 m una de la otra, cada una con área de 100 m², ubicadas una al lado de la otra, paralelas a la línea de agua.",null,null,null,null,null,null,null,"UPR Humacao","UNIVERSIDAD DE PUERTO RICO EN HUMACAO"]
[null,null,null,null,null,null,null,null,null,null,null,null,null,null,null,null,"Don Diego-1","DDGO-ZP2-DnDieg-1",45326,2047,"En la costa queda un pequeño relicto denso mejor conservado localizado a lo largo de un canal de aguas, y que desemboca en una cuneta donde se acumula el agua. Se encuentra la especie de mangle L. racemosa,  Este relicto se encuentra rodeado de vegetación secundaria por el borde costero.",null,null,null,null,null,null,null,"UR Camelia, IRD","UR Camelia, IRD"]
[null,null,null,null,null,null,null,null,null,null,null,null,null,null,null,null,"Don Diego-2","DDGO-ZR1-DnDieg-2",45332,2049,"Ubicada a 120 m al Oriente de la cabaña de pescador, sobre la orilla sur de la madre vieja  a pocos metros del lindero. Suelos pantanosos y encharcados.",null,null,null,null,null,null,null,"UNEP CAR/RCU","United Nations Environment Programme - Caribbean Regional Coordinating Unit"]
[null,null,null,null,null,null,null,null,null,null,null,null,null,null,null,null,"E La Virgen","JPVI-ZR1-VirgenOriente-1",44635,1804,"A lo largo de toda la parcela se encuentran islotes de R. mangle con raíces de más de dos metros de alto y A. germinans en el sector final.., inundación a lo largo de toda la estación.  poca regeneración natural, se evidencia tala.",null,null,null,null,null,null,null,"UASD","Universidad Autónoma de Santo Domingo"]
[null,null,null,null,null,null,null,null,null,null,null,null,null,null,null,null,"El Claval","CCISinu-ZUS1-CLAVAL-1",45012,1994,"Ubicada en la antigua Camaronera, con fuerte influencia antrópica, principalmente por aprovechamiento forestal de mangle con evidencia de huellas de aprovechamiento. La especie predominante es A. germinans. Bajos niveles de inundación.",null,null,null,null,null,null,null,"UFB","Universidad Federal de Bahía"]
[null,null,null,null,null,null,null,null,null,null,null,null,null,null,null,null,"El Cove -1","ElCove-ZP1-Elcove-1",48990,2501,"Parcela Caricomp (2 circulares): 2016",null,null,null,null,null,null,null,"UJTL-MM","Universidad Jorje Tadeo Lozano-Museo del Mar"]
[null,null,null,null,null,null,null,null,null,null,null,null,null,null,null,null,"El Cove parcela circular-2","ElCovePPC-2",55556,null,"Estación Manglar El Cove (formada por 2 parcelas circulares): Es un manglar de borde, ubicado en el costado oriental en la parte media de la Isla, que presenta una cobertura de 2,20 ha (INVEMAR-CORALINA, 2016).",null,null,null,null,null,null,null,"UNMSM","Universidad Nacional Mayor de San Marcos"]
[null,null,null,null,null,null,null,null,null,null,null,null,null,null,null,null,"El Mohan-1","BARU-ZR1-Mohán-1",44592,1789,"Franja delgada de mangle distribuidos en una franja conformada hacia el extremo derecho por árboles adultos, y el extremo izquierdo solo plántulas con tamaños entre 1,60 y 2 metros de altura.",null,null,null,null,null,null,null,"UNal","Universidad Nacional de Colombia"]
[null,null,null,null,null,null,null,null,null,null,null,null,null,null,null,null,"El Muerto","ISCUANDE-ZR1-ELMUERTO-1",45905,2145,"SE PUEDE CONSIDERAR UNO DE LOS MANGLARES MAS DESARROLLADOS EN DIÁMETRO Y ALTURA DE NARIÑO. CON DOMINANCIA DEL MANGLE ROJO. ALTA DENSIDAD DE RAÍCES Y PRESENCIA DEL HELECHO RANCONCHA. AFECTADO POR TALAS.",null,null,null,null,null,null,null,"USB","Universidad Simón Bolivar"]
[null,null,null,null,null,null,null,null,null,null,null,null,null,null,null,null,"Ensenada Miquitos","ENSENADA-ZP2-MIQUITOS-1MIQUITOSCURAY",45404,2064,"BOSQUE DE MANGLE ROJO BIEN DESARROLLADO CON SU ESTRUCTURA VERTICAL Y HORIZONTAL INTERVENIDAS. POCA REGENERACIÓN NATURAL",null,null,null,null,null,null,null,"UDEA","Universidad de Antioquia"]
[null,null,null,null,null,null,null,null,null,null,null,null,null,null,null,null,"Ensenada Tribuga -1","Tribugá-ZP1-Enstrib-1",45318,2045,"Parcela rectangular de 0.1 ha, ubicada a 730 m aproximadamente al Norte de Tribugá, en la margen izquierda del Estero Puerquera. Su cobertura forestal corresponde a un bosque monoespecífico de Rhizophora mangle.",null,null,null,null,null,null,null,"UJTL-FCM","Universidad de Bogotá Jorge Tadeo Lozano, Fac. de Ciencias Naturales e Ingenieria"]
[null,null,null,null,null,null,null,null,null,null,null,null,null,null,null,null,"Ensenada Tribuga -2","Tribugá-ZP1-Enstrib-2",45406,2065,"Parcela rectangular de 0.1 ha, ubicada a 730 m aproximadamente al Norte de Tribugá, en la margen izquierda del Estero Puerquera. Su cobertura forestal corresponde a un bosque monoespecífico de Rhizophora mangle.",null,null,null,null,null,null,null,"UCartagena","Universidad de Cartagena"]
[null,null,null,null,null,null,null,null,null,null,null,null,null,null,null,null,"Ensenada de Rionegro -4","ERIO-ZP8-Errio-4",48578,2412,"Costado oriental de la ensenada con bosque denso y presencia de R.mangle, L. racemosa  y algunos E. germinans.  Se muestreo como especie predominante el R. mangle acompañada de L. racemosa.  Bosque denso con buena altura en algunos árboles se observó ataque de Teredo al igual que la presencia de agallas.",null,null,null,null,null,null,null,"UCO","Universidad de Córdoba"]
[null,null,null,null,null,null,null,null,null,null,null,null,null,null,null,null,"Ensenada de Rionegro -5","ERIO-ZP8-Errio-5",50305,2680,"Parcela de prueba perdidas Antioquia 2015",null,null,null,null,null,null,null,"UF","Universidad de Florida"]
[null,null,null,null,null,null,null,null,null,null,null,null,null,null,null,null,"Estero Aguacate-1","BB-ZR2-EAg-1",47534,2285,"Manglar altamente intervenido con predominio de mangle.Ubicada en el estero aguacate frente TC buen",null,null,null,null,null,null,null,"UniGie","Universidad de Giessen"]
[null,null,null,null,null,null,null,null,null,null,null,null,null,null,null,null,"Estero Pasadero","YURU-ZP2-YEP-1",45832,2130,"En síntesis se esperaba que este sector se encontrara en mejores condiciones,  pero por la gran cantidad de árboles pequeños a pesar de tener el mayor área basal, se puede considerar que este es un bosque altamente intervenido en contraposición con la zonificación 2007 que lo cataloga como poco intervenido.",null,null,null,null,null,null,null,"UNIBAGUE","Universidad de Ibague"]
[null,null,null,null,null,null,null,null,null,null,null,null,null,null,null,null,"Estero Piñal","BB-ZR2-EAg-2",47536,2286,"Manglar altamente intervenido con predominio de mangle.Ubicada en el estero piñal frente al muelle de Sociedad portuaria",null,null,null,null,null,null,null,"UDES","Universidad de La Sabana"]
[null,null,null,null,null,null,null,null,null,null,null,null,null,null,null,null,"Estero San Antonio -1","Piñtcb-ZR1-EA-1",47510,2273,"Manglar altamente intervenido, con presencia de residuos solidos en descomposición. Ubicada en el estero san antonio frente al puente al sena",null,null,null,null,null,null,null,"UDO - NS","Universidad de Oriente - Núcleo de Sucre"]
[null,null,null,null,null,null,null,null,null,null,null,null,null,null,null,null,"Estero San Antonio -2","Piñtcb-ZR1-EA-2",47512,2274,"Manglar altamente intervenido, con presencia de residuos sólidos en descomposición. Ubicada en el estero san antonio frente al puente del piñal",null,null,null,null,null,null,null,"UNIGUAJIRA","Universidad de la Guajira"]
[null,null,null,null,null,null,null,null,null,null,null,null,null,null,null,null,"Estero San Miguel","RAPO-ZR1-ESaM-1",46022,2219,"manglar altamente intervenido con buena asociacion de especies de manglar",null,null,null,null,null,null,null,"UniMagdalena","Universidad del Magdalena"]
[null,null,null,null,null,null,null,null,null,null,null,null,null,null,null,null,"Firme Bonito","ANCHI-ZR1-AFB-1",45888,2141,null,null,null,null,null,null,null,null,"UNINORTE","Universidad del Norte"]
[null,null,null,null,null,null,null,null,null,null,null,null,null,null,null,null,"Guacamayas","GUAC-ZP1-GUACA-1",42211,1141,null,null,null,null,null,null,null,null,"UPacifico","Universidad del Pacífico"]
[null,null,null,null,null,null,null,null,null,null,null,null,null,null,null,null,"Guachaca-1","GUA-ZP4-Guachc-1",45339,2050,"Se localiza en el costado Oriental  a 500 m de la desembocadura del río Guachaca, la parcela  va desde la playa, atraviesa un cuerpo de agua llegando a un potrero en el patio de una vivienda. Con suelos firmes a encharcados.",null,null,null,null,null,null,null,"UT","Universidad del Tolima"]
[null,null,null,null,null,null,null,null,null,null,null,null,null,null,null,null,"Guadualito","DGUA-ZR3-DG-1",45858,2135,"El bosque de manglar de Dagua presenta características muy especiales.  Por un lado tiene una distribución diamétrica del número de árboles en forma de J invertida que permite garantizar la dinámica sucesional bosque. Por otro lado el análisis de la estructura vertical del bosque permite visualizar la fragmentación del bosque que concuerda con la zonificación de bosque altamente intervenido.",null,null,null,null,null,null,null,"UNIVALLE","Universidad del Valle"]
[null,null,null,null,null,null,null,null,null,null,null,null,null,null,null,null,"Hojas Blancas","esza-ZUS1-Hoblan-1",44561,1771,null,null,null,null,null,null,null,null,"UC","Universidae do Cerá, Estaçao de Biologia Marinha"]
[null,null,null,null,null,null,null,null,null,null,null,null,null,null,null,null,"Humanes Mar","ANCHI-ZR1-AHM-1",45852,2134,"En términos generales se puede considerar que por el área basal,  el número de árboles, la estructura vertical y la cobertura de copas, este bosque corresponde a un manglar Medianamente Intervenido,  lo que hace evidente la importancia de actualizar la zonificación ya que este sitio se encuentra clasificado actualmente  en la categoría de altamente intervenido.",null,null,null,null,null,null,null,"UNH","University of New Hampshire"]
[null,null,null,null,null,null,null,null,null,null,null,null,null,null,null,null,"INICIO","INICIO_JON",58101,2848,null,null,null,null,null,null,null,null,"UM Francia","Université de Montpellier"]
[null,null,null,null,null,null,null,null,null,null,null,null,null,null,null,null,"INICIO","INICIO_SAN",58125,2845,null,null,null,null,null,null,null,null,"VIMS-SI","Virginia Institute of Marine Science / Smithsonian Institution"]
[null,null,null,null,null,null,null,null,null,null,null,null,null,null,null,null,"Ingesa","BCAR-ZP1-Ingesa-1",44609,1795,"Ubicado en un islote, con el sustrato del borde de material calcáreo, R. mangle como especie dominante con raíces fulcreas abundantes.  Bosque en buen estado, algunos troncos secos y muertos.",null,null,null,null,null,null,null,"WCS","Wildlife Conservation Society"]
[null,null,null,null,null,null,null,null,null,null,null,null,null,null,null,null,"Isla Boqueron -1","CGSM-SZ1-IBoqrn-1",45281,2034,"Localizada  en el extremo Noroccidental de la isla al frente al islote Boquerón pequeño.  Es una parcela compuesta por 5 parcelas y cada una tiene un área de 100 m². Es un bosque joven y en buen estado constituido por las especie R. mangle y A. germinans,"]
[null,null,null,null,null,null,null,null,null,null,null,null,null,null,null,null,"Isla Boqueron -2","CGSM-SZ1-IBoqrn-2",45283,2035,"Se ubica al centro norte del Islote. Es una parcela compuesta por 5 parcelas y cada una tiene un área de 100 m²."]
[null,null,null,null,null,null,null,null,null,null,null,null,null,null,null,null,"Isla Boqueron -3","CGSM-SZ1-IBoqrn-3",45285,2036,"Se localiza en el costado nororiental del islote, la parcela presenta una densidad que se incrementa a medida que se introduce a tierra firme, conformada por A. germinanas y R. mangle. Es una parcela compuesta, constituida con 5 parcelas y cada una tiene un área de 100 m²."]
[null,null,null,null,null,null,null,null,null,null,null,null,null,null,null,null,"Jesus Primera","BCISEST-ZUS1-Jesúsprimera-1",45151,2018,"esta esta ubicada en la sector de aprovechamiento ciénaga el vertel, con predominancia de la especie Avicenia gerninans, este es uno de los sitios que se mantienen sus condiciones naturales casi intactas,"]
[null,null,null,null,null,null,null,null,null,null,null,null,null,null,null,null,"Jhon Mangrove parcela circular-3","JhonMangrovePPC-1",55572,null,"Estación Manglar Jhon Mangrove (formada por 1 parcela circular): Es un manglar de cuenca, ubicado en el costado noroeste de la Isla, que presenta una cobertura de 3,7 ha (INVEMAR-CORALINA, 2016)."]
[null,null,null,null,null,null,null,null,null,null,null,null,null,null,null,null,"Kilómetro 22 -1","VIPIS-SZ1-KM22-1",45907,2146,"Parcela 1 monitoreada por el INVEMAR en el marco del ¨Monitoreo de las condiciones ambientales y los cambios estructurales y funcionales de las comunidades vegetales y de los recursos pesqueros durante la rehabilitación de la Ciénaga Grande de Santa Marta¨"]
[null,null,null,null,null,null,null,null,null,null,null,null,null,null,null,null,"Kilómetro 22 -2","VIPIS-SZ1-KM22-2",45910,2147,"Parcela 2 monitoreada por el INVEMAR en el marco del ¨Monitoreo de las condiciones ambientales y los cambios estructurales y funcionales de las comunidades vegetales y de los recursos pesqueros durante la rehabilitación de la Ciénaga Grande de Santa Marta¨"]
[null,null,null,null,null,null,null,null,null,null,null,null,null,null,null,null,"Kilómetro 22 -3","VIPIS-SZ1-KM22-3",45912,2148,"Parcela 3 monitoreada por el INVEMAR en el marco del ¨Monitoreo de las condiciones ambientales y los cambios estructurales y funcionales de las comunidades vegetales y de los recursos pesqueros durante la rehabilitación de la Ciénaga Grande de Santa Marta¨"]
[null,null,null,null,null,null,null,null,null,null,null,null,null,null,null,null,"LAGO","OBRE;CHA-SZ1-LAGO-1",49587,2640,"Parcela de Manglar CRC"]
[null,null,null,null,null,null,null,null,null,null,null,null,null,null,null,null,"La Alberca","BCISEST-ZUS1-laalberca-1",45139,2014,"esta parcela permanente de crecimiento, con predominancia de especie Avicenia germinans"]
[null,null,null,null,null,null,null,null,null,null,null,null,null,null,null,null,"La Boquilla","CBOQ-ZR1-BOQU-1",42198,1138]
[null,null,null,null,null,null,null,null,null,null,null,null,null,null,null,null,"La Calle","Curch-ZP1-Lacalle-1",45433,2072,"Se ubica a 1.1 km aproximadamente al Noreste de la comunidad de Curiche, en la margen derecha del Estero La Calle; su bosque está compuesto por Rhizophora mangle y Avicennia germinans."]
[null,null,null,null,null,null,null,null,null,null,null,null,null,null,null,null,"La Calle","JURA-ZP1-Laca-1",45579,2121,"Se ubica a 1.1 km aproximadamente al Noreste de la comunidad de Curiche, en la margen derecha del Estero La Calle; su bosque está compuesto por Rhizophora mangle y Avicennia germinans."]
[null,null,null,null,null,null,null,null,null,null,null,null,null,null,null,null,"La Camaronera","BCISEST-ZR1-camaronera-1",45133,2012,"parcela ubicada en la zona de recuperación del la bahía de cispata, con predominancia de la especie Avicenia  germinans, con bajos niveles de inundación, con gran cantidad de arboles de gran tamaño y en buen estado."]
[null,null,null,null,null,null,null,null,null,null,null,null,null,null,null,null,"La Cuenca","BCISEST-ZUS6-lacuenca-1",45347,2052,"esta ubicada en el sub sector de aprovechamiento, remedia pobre, en la zona de uso sostenible del DMI, esta parcela tiene predominancia de la especie Avicemia gerninans, Rhizophora mangle entre otras, los arboles presentan unas condiciones de raquitismo y se encuentran gran cantidad de arboles y ramas muertas, hay huellas de aprovechamiento forestal en esta parcela."]
[null,null,null,null,null,null,null,null,null,null,null,null,null,null,null,null,"La Flotante","BCISEST-ZUS1-laflotante-1",45586,2123,"la parcela esta ubicada en la zona de uso sostenible del DMI en el sector la flotante en caño nisperal, con predominancia de la especie Rhizophora mangle, con arboles de gran tamaño, las condiciones del bosque son muy buenas existe abundante fauna silvestre benéfica para el sistema manglarico"]
[null,null,null,null,null,null,null,null,null,null,null,null,null,null,null,null,"La Raya","LRAY-ZR1-LRA-1",41384,886,"La parcela se ubica perpendicular a la línea de costa, aproximadamente a un Kilómetro de la comunidad indigena Wayuú asentada en el lugar. En sus aproximaciones se encuentra La Laguna de Buena Vista, que es alimetada por el Río Ranchería y tiene conexión con el mar que permanece abierta prácticamente todo el año (Gil-Torres et al., 2009). Dentro del bosque de manglar, se encuentran suelos fangososo sin compactar altamente inundados; en las zonas exteriores y circundantes al mismo se observan suelos que corresponden a depósitos de materiales calcáreos gruesos y conchas apartadas por el mar. Se observa que la especie dominante es A. germinans (Vidal-Hernández, 2013)_x000D_"]
[null,null,null,null,null,null,null,null,null,null,null,null,null,null,null,null,"La Raya-2","LRAY-ZR1-LRA-2",41386,887,"La parcela se ubica perpendicular a la línea de costa, aproximadamente a un Kilómetro de la comunidad indigena Wayuú asentada en el lugar. En sus aproximaciones se encuentra La Laguna de Buena Vista, que es alimetada por el Río Ranchería y tiene conexión con el mar que permanece abierta prácticamente todo el año (Gil-Torres et al., 2009). Dentro del bosque de manglar, se encuentran suelos fangososo sin compactar altamente inundados; en las zonas exteriores y circundantes al mismo se observan suelos que corresponden a depósitos de materiales calcáreos gruesos y conchas apartadas por el mar. Se observa que la especie dominante es A. germinans (Vidal-Hernández, 2013)_x000D_"]
[null,null,null,null,null,null,null,null,null,null,null,null,null,null,null,null,"La Raya-3","LRAY-ZR1-LRA-3",41388,888,"La parcela se ubica perpendicular a la línea de costa, aproximadamente a un Kilómetro de la comunidad indigena Wayuú asentada en el lugar. En sus aproximaciones se encuentra La Laguna de Buena Vista, que es alimetada por el Río Ranchería y tiene conexión con el mar que permanece abierta prácticamente todo el año (Gil-Torres et al., 2009). Dentro del bosque de manglar, se encuentran suelos fangososo sin compactar altamente inundados; en las zonas exteriores y circundantes al mismo se observan suelos que corresponden a depósitos de materiales calcáreos gruesos y conchas apartadas por el mar. Se observa que la especie dominante es A. germinans (Vidal-Hernández, 2013)_x000D_"]
[null,null,null,null,null,null,null,null,null,null,null,null,null,null,null,null,"La Zona","BCISESTSAL-ZUS1-ZON-1",42099,1101]
[null,null,null,null,null,null,null,null,null,null,null,null,null,null,null,null,"Lagartero","TIMB-ZUS1-LARGAR-1",45484,2084,"Ubicada en la bocana de Saija, Parcela sencilla de 20 m de ancho x 50 m de largo"]
[null,null,null,null,null,null,null,null,null,null,null,null,null,null,null,null,"Laguna Salada","LSAL-ZR1-LSA-1",41396,892,"Para llegar a esta parcela se toma la troncal del Caribe en la vía Riohacha – Maicao que corresponde a la carrera 1C frente a la entrada de la circunvalar. Se llega al parque del sendero ecológico de la laguna y se ingresa al manglar por el costado suroccidental a unos 30 m aproximadamente.  La parcela de monitoreo está localizada en el bosque de cuenca dominado por L. racemosa con alturas máximas de 16 m, de gran porte, junto a árboles de A. germinans muy ramificados desde el tronco y algunos defoliados, con alturas de 6 a 9 m. El suelo es areno fangoso cubierto de una capa gruesa de hojarasca en descomposición, con pocos neumatóforos y abundante regeneración natural de L. racemosa.  (INVEMAR, 20014) _x000D_"]
[null,null,null,null,null,null,null,null,null,null,null,null,null,null,null,null,"Las Piedras-1","BARB-ZR1-Piedras-1",44496,1760,"Estación dominada por A. germinans, con presencia de árboles secos, caídos y algunos troncos partidos"]
[null,null,null,null,null,null,null,null,null,null,null,null,null,null,null,null,"Las Quintas-1","CQUINTAS-ZUS1-Quintas-1",44616,1797,"Al ingreso de la estación y sobre el borde de los 20 metros de ancho de la parcela, el exceso de basura es evidente, acompañado de malos olores.  Parcela dominada por A. germinans, sustrato duro e inundación de 10 cm en promedio.  Algunos árboles secos y muertos, pero no se evidencia tala."]
[null,null,null,null,null,null,null,null,null,null,null,null,null,null,null,null,"Lucho Guerra-1","CaiRinH-ZP1-LUCHO-1",41972,1066,"Suelo inundable con vegetación latizal, agua dulce y salada, estado fitosanitario en buen estado."]
[null,null,null,null,null,null,null,null,null,null,null,null,null,null,null,null,"Luna -1","SFFOCC-SZ1-LUN-1",45922,2153,"Parcela 3 monitoreada por el INVEMAR en el marco del ¨Monitoreo de las condiciones ambientales y los cambios estructurales y funcionales de las comunidades vegetales y de los recursos pesqueros durante la rehabilitación de la Ciénaga Grande de Santa Marta¨"]
[null,null,null,null,null,null,null,null,null,null,null,null,null,null,null,null,"Luna -2","SFFOCC-SZ1-LUN-2",47837,2319,"Parcela 3 monitoreada por el INVEMAR en el marco del ¨Monitoreo de las condiciones ambientales y los cambios estructurales y funcionales de las comunidades vegetales y de los recursos pesqueros durante la rehabilitación de la Ciénaga Grande de Santa Marta¨"]
[null,null,null,null,null,null,null,null,null,null,null,null,null,null,null,null,"Luna -3","SFFOCC-SZ1-LUN-3",47839,2320,"Parcela 3 monitoreada por el INVEMAR en el marco del ¨Monitoreo de las condiciones ambientales y los cambios estructurales y funcionales de las comunidades vegetales y de los recursos pesqueros durante la rehabilitación de la Ciénaga Grande de Santa Marta¨"]
[null,null,null,null,null,null,null,null,null,null,null,null,null,null,null,null,"MANZANILLO","MANZANILLO",58095,2844]
[null,null,null,null,null,null,null,null,null,null,null,null,null,null,null,null,"Mallorquin","CNGMLLQ-ZR1-Mr-1",45168,2020,"Localiza 15  m del mar. El manglar tiene unl nivel de desarrollo bajo. Esta zona presenta erosión costera y es azotada por los fuertes vientos. Se encuentra llena de residuos sólidos provenientes del mar. En las inmediaciones de la parcela se encuentra un potrero."]
[null,null,null,null,null,null,null,null,null,null,null,null,null,null,null,null,"Mallorquín","CNGMLLQ-ZP1-Mallorq-1",45242,2021,"Se ubica a 58 m de la ciénaga y a 560 m de  la casa más cercana. La parcela presenta mangles de gran talla, característica que va disminuyendo hasta llegar a juveniles hacia el final del bosque. Presenta crecimiento arbustivo y con distribución densa, además están inclinados por los fuertes vientos.  Se observan huecos de cangrejos y neumatóforos. Los suelos son firmes, presenta residuos sólidos provenientes del mar y de la ciénaga."]
[null,null,null,null,null,null,null,null,null,null,null,null,null,null,null,null,"ManatIes Playa","CNGMNT-ZR1-Manat-1",45253,2024,"Se localiza a 25 m del mar, al lado de un playón, a 200 m de un camino que pasa por una pequeña ciénaga. Dentro de la parcela  la especie predominante es A. germinans con copas pobres, presentan suelos encharcados y neumatóforos."]
[null,null,null,null,null,null,null,null,null,null,null,null,null,null,null,null,"Manaties -ZR1-1","CNGMNT-ZR1-MANA-1",41959,1063,"La parcela tine arboles en estado Fustal, infectados por fitoforos algunas arboles de Laguncularia agua estancada"]
[null,null,null,null,null,null,null,null,null,null,null,null,null,null,null,null,"Manaties B","CNGMNT-ZP1-MANB-1",41963,1064,"Dominancia de Avicennia g, con poco de Laguncularia y brinzales de ambas especies."]
[null,null,null,null,null,null,null,null,null,null,null,null,null,null,null,null,"Manzanillo parcela circular-1","ManzanilloPPC-1",55561,null,"Estación Manglar Manzanillo (formada por 2 parcelas circulares): Manglar localizado al sur de la isla, constituido principalmente por Rhizophora mangle, como especie dominante y por Laguncularia racemosa. Se encuentra detrás de una barra arenosa y en su interior tiene un pequeño canal central en el que se acumulan aguas derivadas de la escorrentía y de un arroyo que se forma en época de lluvias, proveniente de Murray Hills. Tiene una cobertura de manglar de 1,59 ha (INVEMAR-CORALINA, 2016)."]
[null,null,null,null,null,null,null,null,null,null,null,null,null,null,null,null,"Manzanillo parcela circular-2","ManzanilloPPC-2",55562,null,"Estación Manglar Manzanillo (formada por 2 parcelas circulares): Manglar localizado al sur de la isla, constituido principalmente por Rhizophora mangle, como especie dominante y por Laguncularia racemosa. Se encuentra detrás de una barra arenosa y en su interior tiene un pequeño canal central en el que se acumulan aguas derivadas de la escorrentía y de un arroyo que se forma en época de lluvias, proveniente de Murray Hills. Tiene una cobertura de manglar de 1,59 ha (INVEMAR-CORALINA, 2016)."]
[null,null,null,null,null,null,null,null,null,null,null,null,null,null,null,null,"Manzanillo-1","JPVI-ZUS1-JPManzanillo-1",44640,1806,"Parcela ubicada en el extremo norte de la Ciénaga de Juan Polo, bordeada por un canal, los primeros 15 metros son de R. mangle en sustrato fangoso y desde allí comienza una franja de A. germinans en terreno duro, al finalizar la parcela se encuentra sustrato duro y limita con el comienzo de vegetación de bosque seco."]
[null,null,null,null,null,null,null,null,null,null,null,null,null,null,null,null,"Matunilla","BARB-ZR1-MATU-1",42003,1077,"Sobre al  caño Matunilla, a 40 metros de la orilla, zona heterogénea, manglar caído, zonas inundadas, arboles secos"]
[null,null,null,null,null,null,null,null,null,null,null,null,null,null,null,null,"Mayapo","MAYA-ZR1-MA-1",41378,883,"La parcela se encuentra paralela a la línea de costa, en una franja de manglar de borde, alargada y de poca anchura, la cual se encuentra interrumpida y separa del mar; en sus aproximaciones se encuentra una laguna costera, a una distancia aproximada de 35m. La zona está atravesada transversalmente por dos caminos, los cuales probablemente son frecuentados por los pescadores del lugar. Dentro de los bosques de manglar se encuentran suelos principalmente arenosos con alto contenido de carbonato de calcio y que pueden ser compactos. Se observa gran cantidad de arena, que en algunos casa llega a cubrir hasta 30cm del punto de anclaje del manglar, probablemente acumulados por erosión costera y la acción de los fuertes vientos (Vidal-Hernández, 2013)_x000D_"]
[null,null,null,null,null,null,null,null,null,null,null,null,null,null,null,null,"Mayapo-2","MAYA-ZR1-MA-2",41380,884,"La parcela se encuentra paralela a la línea de costa, en una franja de manglar de borde, alargada y de poca anchura, la cual se encuentra interrumpida y separa del mar; en sus aproximaciones se encuentra una laguna costera, a una distancia aproximada de 35m. La zona está atravesada transversalmente por dos caminos, los cuales probablemente son frecuentados por los pescadores del lugar. Dentro de los bosques de manglar se encuentran suelos principalmente arenosos con alto contenido de carbonato de calcio y que pueden ser compactos. Se observa gran cantidad de arena, que en algunos casa llega a cubrir hasta 30cm del punto de anclaje del manglar, probablemente acumulados por erosión costera y la acción de los fuertes vientos (Vidal-Hernández, 2013)_x000D_"]
[null,null,null,null,null,null,null,null,null,null,null,null,null,null,null,null,"Mayapo-3","MAYA-ZR1-MA-3",41382,885,"La parcela se encuentra paralela a la línea de costa, en una franja de manglar de borde, alargada y de poca anchura, la cual se encuentra interrumpida y separa del mar; en sus aproximaciones se encuentra una laguna costera, a una distancia aproximada de 35m. La zona está atravesada transversalmente por dos caminos, los cuales probablemente son frecuentados por los pescadores del lugar. Dentro de los bosques de manglar se encuentran suelos principalmente arenosos con alto contenido de carbonato de calcio y que pueden ser compactos. Se observa gran cantidad de arena, que en algunos casa llega a cubrir hasta 30cm del punto de anclaje del manglar, probablemente acumulados por erosión costera y la acción de los fuertes vientos (Vidal-Hernández, 2013)_x000D_"]
[null,null,null,null,null,null,null,null,null,null,null,null,null,null,null,null,"Mc Bean parcela circular-1","McBeanLagoonPPC-1",55569,null,"Estación Manglar McBean Lagoon (formada por 2 parcelas circulares): El manglar se encuentra localizado en el borde noreste de la Isla, declarado como Parque Nacional Natural del mismo nombre. Esta conformado por manglares de borde y cuenca, de las especies de Rizophora mangle y Avicennia germinans  con una cobertura de 37,1 ha (INVEMAR-CORALINA, 2016)."]
[null,null,null,null,null,null,null,null,null,null,null,null,null,null,null,null,"Mc Bean parcela circular-2","McBeanLagoonPPC-2",55570,null,"Estación Manglar McBean Lagoon (formada por 2 parcelas circulares): El manglar se encuentra localizado en el borde noreste de la Isla, declarado como Parque Nacional Natural del mismo nombre. Esta conformado por manglares de borde y cuenca, de las especies de Rizophora mangle y Avicennia germinans  con una cobertura de 37,1 ha (INVEMAR-CORALINA, 2016)."]
[null,null,null,null,null,null,null,null,null,null,null,null,null,null,null,null,"Mc Bean parcela circular-3","McBeanLagoonPPC-3",55571,null,"Estación Manglar McBean Lagoon (formada por 2 parcelas circulares): El manglar se encuentra localizado en el borde noreste de la Isla, declarado como Parque Nacional Natural del mismo nombre. Esta conformado por manglares de borde y cuenca, de las especies de Rizophora mangle y Avicennia germinans  con una cobertura de 37,1 ha (INVEMAR-CORALINA, 2016)."]
[null,null,null,null,null,null,null,null,null,null,null,null,null,null,null,null,"Muertero","Nuqui-ZR2-Mtero-1",45583,2122,"Parcela de 0.1 ha, instalada en la margen izquierda del Estero Muertero, cuya composición floirística está dada por las especies: Rhizophora mangle, Pelliciera Rhizophorae y Mora oleifera."]
[null,null,null,null,null,null,null,null,null,null,null,null,null,null,null,null,"Muertero","Panguí-ZR1-Mtero-1",45411,2066]
[null,null,null,null,null,null,null,null,null,null,null,null,null,null,null,null,"Muertero","Panguí-ZR1-Mtero-2",45413,2067,"Parcela de 0.1 ha, instalada en la margen izquierda del Estero Muertero, cuya composición floirística está dada por las especies: Rhizophora mangle, Pelliciera Rhizophorae y Mora oleifera."]
[null,null,null,null,null,null,null,null,null,null,null,null,null,null,null,null,"Málaga","BMAL-ZP9-MV-1",45874,2137,"Este sector  a pesar de tener un bajo valor de área basal y pocos árboles, el diámetro y la altura promedio es mayor que en las otras cuencas conformando un bosque en mayor estado de recuperación.  Así mismo el área basal nos permite visualizar un pequeño pero muy significativo aumento de la cobertura del bosque."]
[null,null,null,null,null,null,null,null,null,null,null,null,null,null,null,null,"NORTE","NORTE_JON",58103,2850]
[null,null,null,null,null,null,null,null,null,null,null,null,null,null,null,null,"NORTE","NORTE_SAN",58127,2847]
[null,null,null,null,null,null,null,null,null,null,null,null,null,null,null,null,"Old Point -1","OPOI-ZUS2-OP-1",41463,915]
[null,null,null,null,null,null,null,null,null,null,null,null,null,null,null,null,"Old Town -2","OTOW-ZP1-OldTown-2",51437,2703,"Parcela fija (2 subparcelas) Dominancia de Avicennia germinans y Rhizophora mangle. Estación Manglar Old Town (formada por 2 parcelas circulares): Este manglar está localizado en el costado noroccidental de la Isla, ubicado detrás de una barra de arena de poca elevación. Hacia el norte se extiende detrás de la Capitanía de Puerto de la Dirección General Marítima (DIMAR) y de un centro de acopio de embarcaciones menores. En la parte sur occidental un corto camino separa una pequeña parte del bosque del resto, allí el bosque se extiende detrás de algunas viviendas ubicadas después de una barra. El manglar tiene una extensión de 6,91 ha (INVEMAR-CORALINA, 2016) y es el segundo más representativo de la Isla, después del bosque de manglar de Mc Bean Lagoon (38,8 ha) (INVEMAR-CORALINA, 2016). El bosque está dominado por Avicennia germinans, y hay presencia de R. mangle, que se distribuye principalmente hacia el costado occidental en el borde de la playa, mientras que hacia el sur se evidencian algunos individuos de L. racemosa y C. erectus."]
[null,null,null,null,null,null,null,null,null,null,null,null,null,null,null,null,"Old Town parcela circular-1","OldTownPPC-1",55563,null,"Estación Manglar Old Town (formada por 2 parcelas circulares): Este manglar está localizado en el costado noroccidental de la Isla, ubicado detrás de una barra de arena de poca elevación. Hacia el norte se extiende detrás de la Capitanía de Puerto de la Dirección General Marítima (DIMAR) y de un centro de acopio de embarcaciones menores. En la parte sur occidental un corto camino separa una pequeña parte del bosque del resto, allí el bosque se extiende detrás de algunas viviendas ubicadas después de una barra. El manglar tiene una extensión de 6,91 ha (INVEMAR-CORALINA, 2016) y es el segundo más representativo de la Isla, después del bosque de manglar de Mc Bean Lagoon (38,8 ha) (INVEMAR-CORALINA, 2016). El bosque está dominado por Avicennia germinans, y hay presencia de R. mangle, que se distribuye principalmente hacia el costado occidental en el borde de la playa, mientras que hacia el sur se evidencian algunos individuos de L. racemosa y C. erectus."]
[null,null,null,null,null,null,null,null,null,null,null,null,null,null,null,null,"Old Town parcela circular-2","OldTownPPC2",55564,null,"Estación Manglar Old Town (formada por 2 parcelas circulares): Este manglar está localizado en el costado noroccidental de la Isla, ubicado detrás de una barra de arena de poca elevación. Hacia el norte se extiende detrás de la Capitanía de Puerto de la Dirección General Marítima (DIMAR) y de un centro de acopio de embarcaciones menores. En la parte sur occidental un corto camino separa una pequeña parte del bosque del resto, allí el bosque se extiende detrás de algunas viviendas ubicadas después de una barra. El manglar tiene una extensión de 6,91 ha (INVEMAR-CORALINA, 2016) y es el segundo más representativo de la Isla, después del bosque de manglar de Mc Bean Lagoon (38,8 ha) (INVEMAR-CORALINA, 2016). El bosque está dominado por Avicennia germinans, y hay presencia de R. mangle, que se distribuye principalmente hacia el costado occidental en el borde de la playa, mientras que hacia el sur se evidencian algunos individuos de L. racemosa y C. erectus."]
[null,null,null,null,null,null,null,null,null,null,null,null,null,null,null,null,"Ostion","BCISEST-ZUS1-Ostion-1",48747,2434]
[null,null,null,null,null,null,null,null,null,null,null,null,null,null,null,null,"PNN MCBEAN PARCELA1","PNNMCBEAN_P1",58085,2834]
[null,null,null,null,null,null,null,null,null,null,null,null,null,null,null,null,"PNN MCBEAN PARCELA10","PNNMCBEAN_P10",58094,2843]
[null,null,null,null,null,null,null,null,null,null,null,null,null,null,null,null,"PNN MCBEAN PARCELA2","PNNMCBEAN_P2",58086,2835]
[null,null,null,null,null,null,null,null,null,null,null,null,null,null,null,null,"PNN MCBEAN PARCELA3","PNNMCBEAN_P3",58087,2836]
[null,null,null,null,null,null,null,null,null,null,null,null,null,null,null,null,"PNN MCBEAN PARCELA4","PNNMCBEAN_P4",58088,2837]
[null,null,null,null,null,null,null,null,null,null,null,null,null,null,null,null,"PNN MCBEAN PARCELA5","PNNMCBEAN_P5",58089,2838]
[null,null,null,null,null,null,null,null,null,null,null,null,null,null,null,null,"PNN MCBEAN PARCELA6","PNNMCBEAN_P6",58090,2839]
[null,null,null,null,null,null,null,null,null,null,null,null,null,null,null,null,"PNN MCBEAN PARCELA7","PNNMCBEAN_P7",58091,2840]
[null,null,null,null,null,null,null,null,null,null,null,null,null,null,null,null,"PNN MCBEAN PARCELA8","PNNMCBEAN_P8",58092,2841]
[null,null,null,null,null,null,null,null,null,null,null,null,null,null,null,null,"PNN MCBEAN PARCELA9","PNNMCBEAN_P9",58093,2842]
[null,null,null,null,null,null,null,null,null,null,null,null,null,null,null,null,"Palosecal","VIRU-SZ1-PALOS-1",42123,1109]
[null,null,null,null,null,null,null,null,null,null,null,null,null,null,null,null,"Parcela Esteh","CAJA-ZR1-Esteh-1",46020,2218,"manglar altamente intervenido con muchos claros en la estructura del bosque"]
[null,null,null,null,null,null,null,null,null,null,null,null,null,null,null,null,"Parcela Play","CAJA-ZUS1-Ply-1",46002,2213,"parcela medianamente intervenida con predominancia de Rizhophora mangle"]
[null,null,null,null,null,null,null,null,null,null,null,null,null,null,null,null,"Pasacaballos","CAMREAL-ZUS2-CABALLOS-1",45391,2061,"MANGLAR DE ESTRUCTURA VERTICAL Y HORIZONTAL BIEN DESARROLLADA CON DOMINANCIA DEL MANGLE ROJO. PRESENCIA DE ARBOLES MUERTOS AL PARECER POR EFECTO DE DESCARGA ELÉCTRICA."]
[null,null,null,null,null,null,null,null,null,null,null,null,null,null,null,null,"Peñitas","VIRU-SZ1-PEÑI-1",42127,1110]
[null,null,null,null,null,null,null,null,null,null,null,null,null,null,null,null,"Puerto Cesar-1","CORI-ZP1-Pces-1",48471,2378,"Bosque de porte alto.Presencia de R. mangle, L. racemosa y A. germinans.  La sp más abundante y dominante es A. germinans, Presión antrópica relacionada con el aprovechamiento del cangrejo azul, antes utilizaban barbasco, en la actualidad palas hasta sacar los pocos y de pequeñas tallas que quedan."]
[null,null,null,null,null,null,null,null,null,null,null,null,null,null,null,null,"Puerto España","BSJU-ZR3-SJPE-1",45880,2138,"Este bosque presenta características propias de un manglar medianamente intervenido en proceso de recuperación. Se observa una mayor área basal  en el 2015 con respecto al 2007 aunque el análisis comparativo no tiene relación  directa puesto que se trata de dos sitios diferentes aunque muy cercanos"]
[null,null,null,null,null,null,null,null,null,null,null,null,null,null,null,null,"Punta Arenas","TBOM-ZP1-PtaArenas-1",44603,1793,"En los 10 primeros metros se encuentran Botellas Pet, resultado de un campamento militar que se ubicó en el sector tiempo atrás, Estación dominada por L. racemosa, al final el terreno se va volviendo duro y seco"]
[null,null,null,null,null,null,null,null,null,null,null,null,null,null,null,null,"Punta Boqueron","JPVI-ZR1-Boquerón-1",44621,1799,"Parcela con presencia de L. racemosa, A. germinans y R. mangle, bosque tupido con numeras raíces fúlcreas .regeneración natural abundante, sustrato duro."]
[null,null,null,null,null,null,null,null,null,null,null,null,null,null,null,null,"Punta Cerro -1","CGSM-SZ1-PtaCerro-1",45288,2037,"Es la parcela más lejana de este sector se ubica a 1.7 km al sur del caño San Luis .Esta parcela  presenta la mayor densidad en comparación a las restante de la estación. Conformada por A. germinans y R. mangle. Es una parcela compuesta con 5 y cada una tiene un área de 100 m²."]
[null,null,null,null,null,null,null,null,null,null,null,null,null,null,null,null,"Punta Cerro -2","CGSM-SZ1-PtaCerro-2",45290,2038,"Se localiza a 1.4 km al sur del caño San Luis. Es una parcela compuesta por 5 parcelas y cada una tiene un área de 100 m². Esta Parcela presenta la menor densidad de la estación conformada por  A. germinans y R. mangle."]
[null,null,null,null,null,null,null,null,null,null,null,null,null,null,null,null,"Punta Cerro -3","CGSM-SZ1-PtaCerro-3",45292,2039,"Es la parcela más cercana al caño San Luis ubicarse a una distancia de 1 km  en dirección sur, entre áreas inundadas. Es una parcela compuesta, constituida con 5 y cada una tiene un área de 100 m². Conformada con  A. germinans y R. mangle. Se observó tala."]
[null,null,null,null,null,null,null,null,null,null,null,null,null,null,null,null,"Punta Chino -1","CGSM-SZ1-PtaChino-1",45274,2031,"Se localiza aproximadamente 5 km al norte de desembocadura del río Sevilla,  en el sector llamado Punta Chino. El bosque está constituido por A. germinans, L. racemosa y  R mangle la cual se encuentra hasta 80 metros desde la línea de agua. Es una parcela compuesta, constituida por 5 parcelas y cada una tiene un área de 100 m²."]
[null,null,null,null,null,null,null,null,null,null,null,null,null,null,null,null,"Punta Chino -2","CGSM-SZ1-PtaChino-2",45276,2032,"Se localiza a  400 m al norte de Punta Chino. El bosque se encuentra en buen estado. Presencia de R. mangle a lo largo del transecto y predominio de A. germinans, en menor proporción L. racemosa. Es una parcela compuesta, constituida por 5 parcelas y cada una tiene un área de 100 m²"]
[null,null,null,null,null,null,null,null,null,null,null,null,null,null,null,null,"Punta Chino -3","CGSM-SZ1-PtaChino-3",45278,2033,"Se ubica a  900 m al norte de Punta Chino,  Con predominio de A. germinans, presencia de R. mangla a lo largo del transecto,  y L. racemosa solo aparece en la parcela 5. Es una parcela compuesta, constituida por 5 parcelas y cada una tiene un área de 100 m²"]
[null,null,null,null,null,null,null,null,null,null,null,null,null,null,null,null,"Punta Coquito","BCOL-ZP1-Pcoq-1",48403,2362,"Pequeña franja con residuos o basuras, con predominio de arboles de baja altura y baja densidad de R. mangle.  Presión antrópica por corta de varas y aumento de la frontera agrícola."]
[null,null,null,null,null,null,null,null,null,null,null,null,null,null,null,null,"Punta Seca","PSEC-ZR1-PSEC-1",44400,1726]
[null,null,null,null,null,null,null,null,null,null,null,null,null,null,null,null,"Punta de las Vacas-1","CORI-ZP1-Pvac-1",48432,2368,"Bosque ralo al interior.  Predomina casi en su totalidad el  R. mangle, y escasa presencia de  L. racemosa y A. germinans.  Fuera de la parcela se observó un juvenil de P. rhizophorae.  Intervención Antrópica, representada en corta de varas.  Presencia de tarros, bolsas y desechos en general."]
[null,null,null,null,null,null,null,null,null,null,null,null,null,null,null,null,"Quebrada Balsadito","MAYO-ZR3-QB-1",46006,2214]
[null,null,null,null,null,null,null,null,null,null,null,null,null,null,null,null,"REF PARCELA1","REF_P1",58068,2823]
[null,null,null,null,null,null,null,null,null,null,null,null,null,null,null,null,"REF PARCELA2","REF_P2",58069,2824]
[null,null,null,null,null,null,null,null,null,null,null,null,null,null,null,null,"REF PARCELA3","REF_P3",58070,2824]
[null,null,null,null,null,null,null,null,null,null,null,null,null,null,null,null,"REF RIN PARCELA1","REF_P1",58080,2831]
[null,null,null,null,null,null,null,null,null,null,null,null,null,null,null,null,"REF RIN PARCELA2","REF_P2",58081,2832]
[null,null,null,null,null,null,null,null,null,null,null,null,null,null,null,null,"REF RIN PARCELA3","REF_P3",58082,2833]
[null,null,null,null,null,null,null,null,null,null,null,null,null,null,null,null,"Rincon Norte","RINC-ZP1-RNOR-1",44392,1724,"La parcela se encuentra  paralela a linea de costa en una franja de mangle"]
[null,null,null,null,null,null,null,null,null,null,null,null,null,null,null,null,"Rincon Sur","RINC-ZR1-RSUR-1",44395,1725,"La parcela se encuentra paralela a la linea de costa."]
[null,null,null,null,null,null,null,null,null,null,null,null,null,null,null,null,"Rinconada -1","VIPIS-SZ1-RIN-1",45914,2149,"Parcela 1 monitoreada por el INVEMAR en el marco del ¨Monitoreo de las condiciones ambientales y los cambios estructurales y funcionales de las comunidades vegetales y de los recursos pesqueros durante la rehabilitación de la Ciénaga Grande de Santa Marta¨"]
[null,null,null,null,null,null,null,null,null,null,null,null,null,null,null,null,"Rinconada -2","VIPIS-SZ1-RIN-2",45916,2150,"Parcela 2 monitoreada por el INVEMAR en el marco del ¨Monitoreo de las condiciones ambientales y los cambios estructurales y funcionales de las comunidades vegetales y de los recursos pesqueros durante la rehabilitación de la Ciénaga Grande de Santa Marta¨"]
[null,null,null,null,null,null,null,null,null,null,null,null,null,null,null,null,"Rinconada -3","VIPIS-SZ1-RIN-3",45920,2152,"Parcela 3 monitoreada por el INVEMAR en el marco del ¨Monitoreo de las condiciones ambientales y los cambios estructurales y funcionales de las comunidades vegetales y de los recursos pesqueros durante la rehabilitación de la Ciénaga Grande de Santa Marta¨"]
[null,null,null,null,null,null,null,null,null,null,null,null,null,null,null,null,"Rio Ancachi","Nuquí-ZR1-RIAN-1",45086,1999,"Parcela rectangular de 20 m x 50 m, dispuesta en la margen derecha del Río Ancachí, cuya composición florística está dada por las especies Rhizophora mangle, Avicennia germinans y Mora oleifera."]
[null,null,null,null,null,null,null,null,null,null,null,null,null,null,null,null,"Rio Caimán Viejo","CORI-ZUS1-Cviej-1",48440,2370,"Relicto de manglar de porte alto con pequeña extensión al costado sur de la desembocadura del río Caimán viejo. Se reporta R, mangle, L. racemosa y algunos A. germinans,de bajo porte y malformados, bosque poco denso. Presión antrópica por aumento de la frontera agrícola."]
[null,null,null,null,null,null,null,null,null,null,null,null,null,null,null,null,"Rio Chorí","Jurub-ZUS1-Pabarc-1",45248,2022,"Parcela rectangular de 0.1 ha, ubicada a 1.25 km aproximadamente de la comunidad de Jurubirá, en la margen derecha del Estero La Vuelta, cuya flora está compuesta por Rhizophora mangle y Rhizophora racemosa."]
[null,null,null,null,null,null,null,null,null,null,null,null,null,null,null,null,"Rio Necocli","CORI-ZR1-Rnec-2",48574,2410,"La parcela se ubicó al costado norte de la boca, encontrando un manglar con predominio de L. racemosa y R. mangle.  No se evidenció afectación por basuras o influencia antrópica.  Bosque limpio."]
[null,null,null,null,null,null,null,null,null,null,null,null,null,null,null,null,"Rio Saija 3-1","CANT-SZ1-SAIJA3-1",49591,2641]
[null,null,null,null,null,null,null,null,null,null,null,null,null,null,null,null,"Rio Sevilla -1","CGSM-SZ1-Sevillla-1",45267,2028,"Es la más cercana a la desembocadura del Rio Sevilla a unos 600 m  El manglar presenta un nivel de desarrollo bajo, en suelos pantanosos.  La regeneración natural es media. Es una parcela compuesta, constituida por 5 parcelas y cada una tiene un área de 100 m²."]
[null,null,null,null,null,null,null,null,null,null,null,null,null,null,null,null,"Rio Sevilla -2","CGSM-SZ1-Sevillla-2",45269,2029,"Se localiza a 800 m de la desembocadura del Rio Sevilla,  El mangle presenta un nivel de desarrollo Medio bajo, en suelos pantanosos. La regeneración natural es baja.  Es una parcela compuesta, constituida por 5 parcelas y cada una tiene un área de 100 m²"]
[null,null,null,null,null,null,null,null,null,null,null,null,null,null,null,null,"Rio Sevilla -3","CGSM-SZ1-Sevillla-3",45271,2030,"Se localiza a 900 m de la desembocadura del Rio Sevilla,  El mangle presenta un nivel de desarrollo Medio bajo. Es una parcela compuesta, constituida por 5 parcelas y cada una tiene un área de 100 m²"]
[null,null,null,null,null,null,null,null,null,null,null,null,null,null,null,null,"Rio Toribio - MI","Toribio_1",57505,2811]
[null,null,null,null,null,null,null,null,null,null,null,null,null,null,null,null,"Rio Toribio - MII","Toribio_2",57506,2812]
[null,null,null,null,null,null,null,null,null,null,null,null,null,null,null,null,"Rio Toribio - MIII ","Toribio_3",57507,2813]
[null,null,null,null,null,null,null,null,null,null,null,null,null,null,null,null,"Rio Toribio - MIV","Toribio_4",57508,2814]
[null,null,null,null,null,null,null,null,null,null,null,null,null,null,null,null,"Rio Toribio - MV","Toribio_5",57509,2815]
[null,null,null,null,null,null,null,null,null,null,null,null,null,null,null,null,"Rio Toribio - MVI","Toribio_6",57510,2816]
[null,null,null,null,null,null,null,null,null,null,null,null,null,null,null,null,"Rio Toribio-1","TOR-SZ1-Toribio-1",48867,2454]
[null,null,null,null,null,null,null,null,null,null,null,null,null,null,null,null,"Rio Toribio-2","TOR-SZ1-Toribio-2",48869,2455]
[null,null,null,null,null,null,null,null,null,null,null,null,null,null,null,null,"Rio Toribio-3","TOR-SZ1-Toribio-3",48871,2456]
[null,null,null,null,null,null,null,null,null,null,null,null,null,null,null,null,"Rio Toribio-4","TOR-SZ1-Toribio-4",48873,2457]
[null,null,null,null,null,null,null,null,null,null,null,null,null,null,null,null,"Rio Toribio-5","TOR-SZ1-Toribio-5",48875,2458]
[null,null,null,null,null,null,null,null,null,null,null,null,null,null,null,null,"Rio Virudo","VIRU-SZ1-RVIR-1",42129,1111]
[null,null,null,null,null,null,null,null,null,null,null,null,null,null,null,null,"Río Damaquiel-1","CNTE-ZR1-Rdmq-1",48464,2376,"Bosque muy Ralo.Presencia de R. mangle, y A. germinans.  Presión antrópica relacionada por la ampliación de áreas ganaderas.  Presencia de cercas de alambre en el manglar."]
[null,null,null,null,null,null,null,null,null,null,null,null,null,null,null,null,"S La Virgen-1","JPVI-ZR1-SurVirgen-1",44630,1802,"Parcela que inicia con una franja de regeneración natural de R. mangle muy abundante, casi impenetrable, seguida de 10 metros de franja de agua para luego comenzar sustrato duro en su mayoría de A. germinans , baja regeneración natural"]
[null,null,null,null,null,null,null,null,null,null,null,null,null,null,null,null,"Salahonda -1","FRAPIZ-ZUS1-Salho-1",44531,1765,"Compuesta por una vegetación de manglar mixto, con dominancia de la especie piñuelo en cuanto abundancia. hace presencia las especies de mangle piñuelo, Nato y rojo. ademas el helecho ranconcha."]
[null,null,null,null,null,null,null,null,null,null,null,null,null,null,null,null,"Salahonda P-1","FRAPIZ-ZP1-Salho-1",44546,1766,"Manglar adulto bien desarrollado con dominancia de la especie Mangle rojo. presencia de talas de los arboles mas desarrollados en diámetro y altura."]
[null,null,null,null,null,null,null,null,null,null,null,null,null,null,null,null,"Salahonda R-2-1","FRAPIZ-ZR2-Salho-1",44557,1770,"Bosque denso de mangle Piñuelo intervenido para uso domestico. Alta regeneración Natural. Suelo de consistencia blanda y encharcada."]
[null,null,null,null,null,null,null,null,null,null,null,null,null,null,null,null,"Salitral el Garzal","CCAIM-ZR1-SGAR-1",44419,1731]
[null,null,null,null,null,null,null,null,null,null,null,null,null,null,null,null,"Salt Creek parcela circular-2","SaltCreekPPC-2",55554,null,"Estación Manglar Salt Creek (formada por 3 parcelas circulares): Es un manglar de cuenca o interior, ubicado en el costado oriental en la parte media de la Isla, que presenta una cobertura de 4,45 ha (INVEMAR-CORALINA, 2016) y se desarrolla separado del mar por la carretera. Está constituido por el complejo Dorna Pond, el humedal de Ground Road y humedales internos. Presenta una composición florística mixta, dominada por Laguncularia racemosa y presencia de Rhizophora mangle; los árboles tienen una altura promedio de 11,7 m. Este manglar se encuentra impactado por los residuos sólidos de las familias aledañas del sector y existe evidencia de actividades de tala y rellenos en su interior."]
[null,null,null,null,null,null,null,null,null,null,null,null,null,null,null,null,"Salt Creek parcela circular-3","SaltCreekPPC-3",55555,null,"Estación Manglar Salt Creek (formada por 3 parcelas circulares): Es un manglar de cuenca o interior, ubicado en el costado oriental en la parte media de la Isla, que presenta una cobertura de 4,45 ha (INVEMAR-CORALINA, 2016) y se desarrolla separado del mar por la carretera. Está constituido por el complejo Dorna Pond, el humedal de Ground Road y humedales internos. Presenta una composición florística mixta, dominada por Laguncularia racemosa y presencia de Rhizophora mangle; los árboles tienen una altura promedio de 11,7 m. Este manglar se encuentra impactado por los residuos sólidos de las familias aledañas del sector y existe evidencia de actividades de tala y rellenos en su interior."]
[null,null,null,null,null,null,null,null,null,null,null,null,null,null,null,null,"Salt Creek-1","SCRE-ZP1-SCRE-1",41492,922]
[null,null,null,null,null,null,null,null,null,null,null,null,null,null,null,null,"Santa Ana","RAPO-ZUS4-RSA-2",45848,2133,"En conclusión para la estación Raposo se debe actualizar la zonificación por cuanto en los últimos años el manglar ha sido sometido a una fuerte presión antrópica lo cual ha cambiado de forma negativa la estructura del bosque."]
[null,null,null,null,null,null,null,null,null,null,null,null,null,null,null,null,"Santa Ana-1","BARU-ZR1-Sta-Ana-1",44500,1761,"Parcela con inundación en toda el área, nivel promedio: 25 cm, está atravesada por un pequeño canal.  Se evidencia tala y acumulación de madera para recolección."]
[null,null,null,null,null,null,null,null,null,null,null,null,null,null,null,null,"Santa Catalina parcela circular-1","SantaCatalinaPPC-1",55567,null,"Estación Manglar Santa Catalina (formada por 2 parcelas circulares): El manglar se encuentra localizado en el borde sur oriental de la Isla, bordeando el malecón. Está distribuido en una serie de parches aislados, separados entre sí por construcciones, muelles, el puente de los Enamorados que une a la isla de Providencia con Santa Catalina y una cancha de fútbol. El manglar tiene una extensión total de 3,79 ha (INVEMAR-CORALINA, 2016). El sustrato presentó diferentes niveles de inundación, hubo parches cuyo sustrato estaba seco, otros con sustrato lodoso y otras zonas que se encontraron inundadas. El manglar de una de las parcelas de monitoreo se encuentra conformado principalmente por R. mangle, entremezclado con algunos ejemplares de L. racemosa y A. germinans. El manglar de la otra parcela de monitoreo, que colinda con la cancha deportiva, se encuentra conformado exclusivamente por A. germinans, donde el sustrato es bastante estable. Es un bosque de cuenca de desarrollo diamétrico intermedio y cuyos árboles tienen una altura promedio de 5,5 m."]
[null,null,null,null,null,null,null,null,null,null,null,null,null,null,null,null,"Santa Catalina parcela circular-2","SantaCatalinaPPC-2",55568,null,"Estación Manglar Santa Catalina (formada por 2 parcelas circulares): El manglar se encuentra localizado en el borde sur oriental de la Isla, bordeando el malecón. Está distribuido en una serie de parches aislados, separados entre sí por construcciones, muelles, el puente de los Enamorados que une a la isla de Providencia con Santa Catalina y una cancha de fútbol. El manglar tiene una extensión total de 3,79 ha (INVEMAR-CORALINA, 2016). El sustrato presentó diferentes niveles de inundación, hubo parches cuyo sustrato estaba seco, otros con sustrato lodoso y otras zonas que se encontraron inundadas. El manglar de una de las parcelas de monitoreo se encuentra conformado principalmente por R. mangle, entremezclado con algunos ejemplares de L. racemosa y A. germinans. El manglar de la otra parcela de monitoreo, que colinda con la cancha deportiva, se encuentra conformado exclusivamente por A. germinans, donde el sustrato es bastante estable. Es un bosque de cuenca de desarrollo diamétrico intermedio y cuyos árboles tienen una altura promedio de 5,5 m."]
[null,null,null,null,null,null,null,null,null,null,null,null,null,null,null,null,"Sevillano -1","CGSM-SZ1-SEVI-1",50089,2660]
[null,null,null,null,null,null,null,null,null,null,null,null,null,null,null,null,"Sevillano -2","CGSM-SZ1-SEVI-2",50091,2661,"Transecto B"]
[null,null,null,null,null,null,null,null,null,null,null,null,null,null,null,null,"Sevillano -3","CGSM-SZ1-SEVI-3",50093,2662,"Transecto C"]
[null,null,null,null,null,null,null,null,null,null,null,null,null,null,null,null,"Smith Channel -1-1","SCHA-ZP1-SCH-1",41487,921]
[null,null,null,null,null,null,null,null,null,null,null,null,null,null,null,null,"Smith Channel -1-2","SCHA-ZP1-SCH-2",47758,2299,"Se localiza al extremo sureste, entre la vía Tom Hooker y Punta Sur. Tiene una distribución en forma de media luna y ocupa un área de 19,30 ha.  Se identificó por ser considerado como un manglar de cuenca y una altura promedio de 10,8 m; aproximadamente el 30% de la estación se hayo cubierta por Achrostichum aureum  o helecho mata tigre. Por otro lado, se destacó por tener presencia de hojarasca, señales de tala y poca basura._x000D_"]
[null,null,null,null,null,null,null,null,null,null,null,null,null,null,null,null,"Smith Channel -1-3","SCHA-ZP1-SCH-3",47901,2334]
[null,null,null,null,null,null,null,null,null,null,null,null,null,null,null,null,"Smith Channel parcela circular-1","SmithChannelPPC-1",55546,null,"Estación Manglar Smith Channel (formada por 3 parcelas circulares): Manglar catalogado como de tierra adentro (Medina, 2016), porque se encuentra aislado del mar, sin una conexión directa y por lo tanto no presenta inundación por mareas en ninguna época del año, pero sí por agua dulce proveniente de las precipitaciones. Está ubicado en el extremo suroriental de la Isla, con presencia de Rhizophora mangle y Laguncularia racemosa. Ocupa un área de manglar de 19,30 ha de extensión (INVEMAR-CORALINA, 2016), tiene abundante presencia de helecho de manglar Acrostichum aureum y es uno de los manglares menos intervenido en la Isla, no obstante, hay evidencia de actividades de tala y presencia de residuos sólidos."]
[null,null,null,null,null,null,null,null,null,null,null,null,null,null,null,null,"Sound Bay parcela circular-1","SoundBayPPC-1",55558,null,"Estación Manglar Sound Bay (formada por 3 parcelas circulares): Manglar de cuenca o interior de 15,29 ha de cobertura (INVEMAR-CORALINA, 2016), separado del mar por la carretera, por formaciones vegetales distintas al manglar y por la presencia de lotes con viviendas. Tiene una composición florística mixta de Rhizophora mangle, Laguncularia racemosa y Avicennia germinans. El rodal tiene una altura promedio de 10,8 m. En el pasado se encontraba fuertemente impactado por el vertimiento directo de aguas residuales, no obstante, en la actualidad, CORALINA ha regulado dicho impacto. Presenta una elevada influencia de basuras producto de los desechos depositados por parte de la comunidad vecina. Hay evidencia de árboles talados y presencia de helecho de manglar Acrostichum aureum."]
[null,null,null,null,null,null,null,null,null,null,null,null,null,null,null,null,"Sound Bay parcela circular-2","SoundBayPPC-2",55559,null,"Estación Manglar Sound Bay (formada por 3 parcelas circulares): Manglar de cuenca o interior de 15,29 ha de cobertura (INVEMAR-CORALINA, 2016), separado del mar por la carretera, por formaciones vegetales distintas al manglar y por la presencia de lotes con viviendas. Tiene una composición florística mixta de Rhizophora mangle, Laguncularia racemosa y Avicennia germinans. El rodal tiene una altura promedio de 10,8 m. En el pasado se encontraba fuertemente impactado por el vertimiento directo de aguas residuales, no obstante, en la actualidad, CORALINA ha regulado dicho impacto. Presenta una elevada influencia de basuras producto de los desechos depositados por parte de la comunidad vecina. Hay evidencia de árboles talados y presencia de helecho de manglar Acrostichum aureum."]
[null,null,null,null,null,null,null,null,null,null,null,null,null,null,null,null,"Sound Bay parcela circular-3","SoundBayPPC-3",55560,null,"Estación Manglar Sound Bay (formada por 3 parcelas circulares): Manglar de cuenca o interior de 15,29 ha de cobertura (INVEMAR-CORALINA, 2016), separado del mar por la carretera, por formaciones vegetales distintas al manglar y por la presencia de lotes con viviendas. Tiene una composición florística mixta de Rhizophora mangle, Laguncularia racemosa y Avicennia germinans. El rodal tiene una altura promedio de 10,8 m. En el pasado se encontraba fuertemente impactado por el vertimiento directo de aguas residuales, no obstante, en la actualidad, CORALINA ha regulado dicho impacto. Presenta una elevada influencia de basuras producto de los desechos depositados por parte de la comunidad vecina. Hay evidencia de árboles talados y presencia de helecho de manglar Acrostichum aureum."]
[null,null,null,null,null,null,null,null,null,null,null,null,null,null,null,null,"South West Bay -2","SWBA-ZP3-SWB-2",49327,1,"parcela fija. Estación Manglar Suroeste (formada por 2 parcelas circulares): Ubicado en el suroeste de la isla, conformado por Rhizophora mangle, como especie dominante y por Laguncularia racemosa. Presenta una barra arenosa en frente, poco elevada y posee una laguna interior de alrededor de 300 m de largo y 30 m de ancho, que permanece total o parcialmente inundada durante el año, debido a las fuertes lluvias y la escorrentía, pero disminuye su espejo de agua en época seca por evaporación e infiltración del agua. Tiene una extensión de manglar de 5,25 ha (INVEMAR-CORALINA, 2016). Existe evidencia de actividades de tala en su interior, así como la construcción de restaurantes muy cerca del mismo y presencia de cables de electricidad sobre los árboles de mangle."]
[null,null,null,null,null,null,null,null,null,null,null,null,null,null,null,null,"Suroeste parcela circular-1","SuroestePPC-1",55565,null,"Estación Manglar Suroeste (formada por 2 parcelas circulares): Ubicado en el suroeste de la isla, conformado por Rhizophora mangle, como especie dominante y por Laguncularia racemosa. Presenta una barra arenosa en frente, poco elevada y posee una laguna interior de alrededor de 300 m de largo y 30 m de ancho, que permanece total o parcialmente inundada durante el año, debido a las fuertes lluvias y la escorrentía, pero disminuye su espejo de agua en época seca por evaporación e infiltración del agua. Tiene una extensión de manglar de 5,25 ha (INVEMAR-CORALINA, 2016). Existe evidencia de actividades de tala en su interior, así como la construcción de restaurantes muy cerca del mismo y presencia de cables de electricidad sobre los árboles de mangle."]
[null,null,null,null,null,null,null,null,null,null,null,null,null,null,null,null,"Suroeste parcela circular-2","SuroestePPC-2",55566,null,"Estación Manglar Suroeste (formada por 2 parcelas circulares): Ubicado en el suroeste de la isla, conformado por Rhizophora mangle, como especie dominante y por Laguncularia racemosa. Presenta una barra arenosa en frente, poco elevada y posee una laguna interior de alrededor de 300 m de largo y 30 m de ancho, que permanece total o parcialmente inundada durante el año, debido a las fuertes lluvias y la escorrentía, pero disminuye su espejo de agua en época seca por evaporación e infiltración del agua. Tiene una extensión de manglar de 5,25 ha (INVEMAR-CORALINA, 2016). Existe evidencia de actividades de tala en su interior, así como la construcción de restaurantes muy cerca del mismo y presencia de cables de electricidad sobre los árboles de mangle."]
[null,null,null,null,null,null,null,null,null,null,null,null,null,null,null,null,"Tangarrá","JURA-ZR1-Tangarrá-1",45422,2069,"Ubicada a unos 2.1 km aproximadamente de Juradó, perpendicularmente a la margen derecha del Estero Tangarrá, compuesta florísticamente por un bosque monoespecífico de Rhizophora racemosa."]
[null,null,null,null,null,null,null,null,null,null,null,null,null,null,null,null,"Tijó","BCISEST-ZR1-Tijó-1",42103,1102]
[null,null,null,null,null,null,null,null,null,null,null,null,null,null,null,null,"Timba","CAJA-ZUS2-CT-1",45830,2129,"En términos generales el sector de Cajambre es el que presenta mayor nivel de intervención antrópica   producto de la tala del mangle con fines comerciales.  Existe un alto contraste en la zonificación de 2007 que lo cataloga como un manglar poco intervenido en contraposición al alto grado de degradación que se registró en el monitoreo actual."]
[null,null,null,null,null,null,null,null,null,null,null,null,null,null,null,null,"Totumo Oriental","CNGTOT-ZP1-Totum-1",45257,2025,"Es un relicto denso en forma de islote  que se encuentra varios centímetros por encima del suelo, y está constituido por la especie  L. racemosa. Algunos crecen retorcidos disponiendo sus ramas hacia el cuerpo de agua de la ciénaga. No se observa regeneración natural"]
[null,null,null,null,null,null,null,null,null,null,null,null,null,null,null,null,"Totumo Oriental","CNGTOT-ZP1-Totum-2",45259,2026,"Forma una franja de 15 m tierra dentro, la línea de agua está a 1 m dentro de  la parcela, algunos individuos de L. racemosa  son maduros, de crecimiento arbustivo, con ramas que crecen hacia el cuerpo de agua."]
[null,null,null,null,null,null,null,null,null,null,null,null,null,null,null,null,"Trujillo","ENSENADA-ZP1-TRUJI-1",45400,2063,"MANGLAR ADULTO BIEN DESARROLLADO E INTERVENIDO CON DOMINANCIA DEL MANGLE ROJO. PRESENCIA DE REGENERACIÓN EN LOS CLAROS DEJADOS POR LAS CORTAS DE INDIVIDUOS."]
[null,null,null,null,null,null,null,null,null,null,null,null,null,null,null,null,"Tumaco","TCO-ZR2-Tuma-1",44506,1763,"ESTA ÁREA  PRESENTA UNA VEGETACIÓN DE MANGLAR MIXTO, HACE PRESENCIA LAS ESPECIES DE MANGLE ROJO, PIÑUELO Y NATO, ADEMAS EL HELECHO RANCONCHA. ES UNA ÁREA INTERVENIDA,"]
[null,null,null,null,null,null,null,null,null,null,null,null,null,null,null,null,"Tumaco -1","TCO-ZUS1-SANAND-1",45395,2062,"BOSQUE DE MANGLE ROJO INTERVENIDO, ALTA DENSIDAD DE INDIVIDUOS CON ALTO PORCENTAJE DE FUSTES RETORCIDOS, ARQUEADOS E INCLINADOS."]
[null,null,null,null,null,null,null,null,null,null,null,null,null,null,null,null,"Ultima Boca","BCISLIT-ZR1-UltBoca-1",48762,2439]
[null,null,null,null,null,null,null,null,null,null,null,null,null,null,null,null,"Valle de los Cangrejos -1","VCAN-ZR1-CANG-1",41390,889,"La parcela se encuentra en una franja de manglar tipo borde, continua y de considerable anchura, perpendicular a la línea de costa y a su vez paralela al brazo Calcancala del Río Rancheria. _x000D_"]
[null,null,null,null,null,null,null,null,null,null,null,null,null,null,null,null,"Valle de los Cangrejos -2","VCAN-ZR1-CANG-2",41392,890,"La parcela se encuentra en una franja de manglar tipo borde, continua y de considerable anchura, perpendicular a la línea de costa y a su vez paralela al brazo Calcancala del Río Rancheria. _x000D_"]
[null,null,null,null,null,null,null,null,null,null,null,null,null,null,null,null,"Valle de los Cangrejos -3","VCAN-ZR1-CANG-3",41394,891,"La parcela se encuentra en una franja de manglar tipo borde, continua y de considerable anchura, perpendicular a la línea de costa y a su vez paralela al brazo Calcancala del Río Rancheria. _x000D_"]
[null,null,null,null,null,null,null,null,null,null,null,null,null,null,null,null,"Velero-1","PVEL-ZP2-VelP-1",45157,2019,"La parcela se ubica detrás de una cabaña de pescadores, a 18 m de esta y a 34 m de la línea de vegetación, se encuentra una cerca. En la zona predomina la C. erectus muy ramificado, en los primeros metros del transecto se encuentra B marítima y suelos firmes y arenosos. Se encontraron residuos sólidos."]
[null,null,null,null,null,null,null,null,null,null,null,null,null,null,null,null,"Velodia Road parcela circular-1","VelodiaRoadPPC-1",55557,null,"Estación Manglar Velodia Road (formada por 1 parcela circular): Es un manglar de tierra adentro, ubicado en el costado sur de la Isla, que presenta una cobertura de 1,0 ha (INVEMAR-CORALINA, 2016)."]
[null,null,null,null,null,null,null,null,null,null,null,null,null,null,null,null,"Vía al Mar","JPVI-ZUS1-VíaMar-1",44627,1801,"Estación bordeada por un canal, con sustrato fangoso, Bosque en buen estado con abundante regeneración natural."]
[null,null,null,null,null,null,null,null,null,null,null,null,null,null,null,null,"Waipare","MAYO-ZR3-MWA-1",45839,2131,"En términos generales este bosque no se ha podido recuperar desde la última zonificación y por el contrario la tendencia es a disminuir su área basal  y por reacción y como estrategia de resiliencia el bosque genera más regeneración natural que se observa en el aumento de más del 300% en  el número de árboles."]
[null,null,null,null,null,null,null,null,null,null,null,null,null,null,null,null,"Yaru-1","CORI-ZUS1-Yaru-1",48442,2371,"Bosque Ralo Presencia de R. mangle, L. racemosa y A. germinans.  Vegetación inferior del helecho A. aureum y majagua.  Escasos árboles pero de porte alto.  Presión antrópica relacionada por la ampliación de áreas ganaderas.  Presencia de cercas de alambre en el manglar."]
[null,null,null,null,null,null,null,null,null,null,null,null,null,null,null,null,"Yerbasal -1","DRATR-ZR1-Yerb-1",48523,2386,"Bosque Ralo al interior.  La sp más abundante es el R. mangle seguido de L.racemosa Presencia de helecho A. aureum.  Presión antrópica relacionada por Corta de Varas y presencia de agallas en todas las estructuras del manglar, especialmente en el R. mangle."]

{"sheet":"OTRAS REFERENTES","index":5,"n_rows":1230,"n_cols":36,"rows_kept":1230,"cut":false,"hidden":false,"merged":[[4,20,4,21],[0,0,2,10],[4,0,4,1],[4,3,4,4],[4,7,4,8],[4,10,4,11]]}
["Estas son listas para variables con valores que no se encuentran codificados, pero que deben manejarse de manera estandarizada. \nSi se requiere agregar un valor nuevo hagalo debajo de la lista correspondiente"]
[]
[]
[1,2,3,4,5,6,7,8,9,10,11,12,13,14,15,16,17,18,19,20,21,22,23,24,25,26,27,28,29]
["UNIDADES DE MEDIDA",null,null,"PROYECTO",null,null,null,"METODOS ALTURA",null,null,"PROYECTOS FINANCIADORES",null,null,null,"ORDEN","COPIAS COD","REORDENAR","LISTADO",null,null,"ROLES",null,null,null,"ESTACIONES_RES","ID",null,"ESTACIONES","ID"]
["CODIGO","DESCRIPCION",null,"COD","PROYECTO","PROYECTO DESC",null,"COD","VALOR",null,"COD","TITULO",null,{"$f":"REFERENTES!S6","v":45589},1,{"$f":"IF(M6=\"\",0,M6)","v":0},{"$f":"IF(P6=0,MAX($O$6:$O$1135)+1,O6)","v":1131},{"$f":"IFERROR(VLOOKUP(SMALL($Q$6:$Q$1135,O6),$O$6:$P$1135,2,FALSE),\"X\")","v":"X"},null,null,"ID","CARGO",null,null,null,null,null,"****ESTACIONES_RES******","NO VALIDO",null,"A","A: de 0 cm a 50 cm",null,null,1,"Vivo"]
[10,"cm",null,1513,"Monitoreo_CGSM","Monitoreo CGSM",null,663,"Regla",null,3498,"Implementación de lineamientos para la restauración del ecosistema de manglar de la desembocadura del rio Toribio, departamento del Magdalena.",{"$f":"IF(ISNUMBER(FIND(\"RES\",REFERENTES!$Q$628:$Q$1125,1)),REFERENTES!Q628,\"\")","v":""},{"$f":"REFERENTES!S7","v":44509},2,{"$f":"IF(M7=\"\",0,M7)","v":0},{"$f":"IF(P7=0,MAX($O$6:$O$1135)+1,O7)","v":1131},{"$f":"IFERROR(VLOOKUP(SMALL($Q$6:$Q$1135,O7),$O$6:$P$1135,2,FALSE),\"X\")","v":"X"},null,null,4,"Captura en campo",null,null,null,null,null,"Aperturas Canal Clarin- Restauración(RES_MGACC)",55345,null,"C","C: mayor a 150 cm",null,null,2,"Muerto"]
[11,"m",null,2187,"INVEMAR - EPA Cartagena","INVEMAR - EPA Cartagena",null,633,"Estimación visual directa",null,3360,"LINEAMIENTOS PARA LA RESTAURACIÓN DEL ECOSISTEMA DE MANGLAR EN LA DESEMBOCADURA DEL RIO TORIBIO, DEPARTAMENTO DEL MAGDALENA",{"$f":"IF(ISNUMBER(FIND(\"RES\",REFERENTES!$Q$628:$Q$1125,1)),REFERENTES!Q629,\"\")","v":""},{"$f":"REFERENTES!S8","v":44493},3,{"$f":"IF(M8=\"\",0,M8)","v":0},1131,"X",null,null,6,"Revisar datos",null,null,null,null,null,"Caleta del Tambor- Restauración(RES_MGACTRES)",55346,null,"B","B: de 50 cm a 150 cm",null,null,6,"Herbivoría"]
[null,null,null,2486,"CVS_URRA_MANGLARES","CVS.URRA",null,null,null,null,3499,"Generación de insumos técnicos para la restauración del manglar en el sector noroeste de la CGSM y evaluación del desempeño de algunas medidas previamente implementadas",{"$f":"IF(ISNUMBER(FIND(\"RES\",REFERENTES!$Q$628:$Q$1125,1)),REFERENTES!Q630,\"\")","v":""},{"$f":"REFERENTES!S9","v":58105},4,{"$f":"IF(M9=\"\",0,M9)","v":0},1131,"X",null,null,3497,"Coordinador actividad de campo",null,null,null,null,null,"Caño La caleta del tambor(RES_MGCG_CT)",52736,null,null,null,null,null,4,"Marchito"]
[null,null,null,3287,"Restauracion Petrobras","Restauración De Ecosistemas De Manglar En La Guajira. Casos De Estudio Piloto: Musichi y Santuario de Fauna y Flora Los Flamencos",null,null,null,null,3528,"Fortalecimiento de la restauración de Manglares en Colombia: técnicas saberes y experiencias",{"$f":"IF(ISNUMBER(FIND(\"RES\",REFERENTES!$Q$628:$Q$1125,1)),REFERENTES!Q631,\"\")","v":""},{"$f":"REFERENTES!S10","v":56791},5,0,1131,"X",null,null,null,null,null,null,null,null,null,"Desembocadura rio Toribio - HMP Enriquecimiento zonas degradadas manglar,  Zonas con suelo desnudo(RES_MGTBRES_SD)",52725,null,null,null,null,null,5,"Clorosis"]
[null,null,null,3360,"Restauracion Rio Toribio","LINEAMIENTOS PARA LA RESTAURACIÓN DEL ECOSISTEMA DE MANGLAR EN LA DESEMBOCADURA DEL RIO TORIBIO",null,null,null,null,1513,"Monitoreo Ambiental de las Comunidades Vegetales y de los Recurso Pesqueros Durante la Rehabilitación de la Cienaga Grande de Santa Marta",{"$f":"IF(ISNUMBER(FIND(\"RES\",REFERENTES!$Q$628:$Q$1125,1)),REFERENTES!Q632,\"\")","v":""},{"$f":"REFERENTES!S11","v":42007},6,0,1131,"X",null,null,null,null,null,null,null,null,null,"Desembocadura rio Toribio - HMP Enriquecimiento zonas degradadas manglar, Zonas con mortalidad reciente(RES_MGTBRES_MR)",52726,null,null,null,null,null,3,"Desarraigado"]
[null,null,null,3460,"Piloto restauración CORPAMAG","Implementación de un piloto de restauración activa de manglar en el sector noroccidental de la Ciénaga Grande de Santa Marta.",null,null,null,null,2239,"Sistema de Información para la Gestión de los Manglares",{"$f":"IF(ISNUMBER(FIND(\"RES\",REFERENTES!$Q$628:$Q$1125,1)),REFERENTES!Q633,\"\")","v":""},{"$f":"REFERENTES!S12","v":42000},7,0,1131,"X",null,null,null,null,null,null,null,null,null,"Jhon Mangrove borde(RES_SPSC_JM-B)",55337]
[null,null,null,3498,"VIVO_TORIBIO_2019","VIVO_TORIBIO_2019",null,null,null,null,3498,"Implementación de lineamientos para la restauración del ecosistema de manglar de la desembocadura del rio Toribio, departamento del Magdalena.",{"$f":"IF(ISNUMBER(FIND(\"RES\",REFERENTES!$Q$628:$Q$1125,1)),REFERENTES!Q634,\"\")","v":""},{"$f":"REFERENTES!S13","v":44490},8,0,1131,"X",null,null,null,null,null,null,null,null,null,"Jhon Mangrove cuenca(RES_SPSC_JM-C)",55338]
[null,null,null,3499,"RESTAURACION_CORPAMAG_2020","RESTAURACION_CORPAMAG_2020",null,null,null,null,3499,"Generación de insumos técnicos para la restauración del manglar en el sector noroeste de la CGSM y evaluación del desempeño de algunas medidas previamente implementadas",{"$f":"IF(ISNUMBER(FIND(\"RES\",REFERENTES!$Q$628:$Q$1125,1)),REFERENTES!Q635,\"\")","v":""},{"$f":"REFERENTES!S14","v":49005},9,0,1131,"X",null,null,null,null,null,null,null,null,null,"Jones Point(RES_SPSC_JP)",55339]
[null,null,null,3528,"FORTALECIMIENTO_MANGLARES","BPIN 2017011000113 - RES 0176 del 26 de febrero 2021",null,null,null,null,3528,"Investigación científica hacia la generación de información y conocimiento de  las  zonas marinas y costeras de interés de la nación - BPIN INVEMAR 2021",{"$f":"IF(ISNUMBER(FIND(\"RES\",REFERENTES!$Q$628:$Q$1125,1)),REFERENTES!Q636,\"\")","v":""},{"$f":"REFERENTES!S15","v":48492},10,0,1131,"X",null,null,null,null,null,null,null,null,null,"Manzanillo(RES_SPSC_MZ-P)",55340]
[null,null,null,3620,"RestauracionManglares","Restauracion Manglares",null,null,null,null,2486,"MONITOREO AMBIENTAL DE LOS MANGLARES DE CISPATA, CÓRDOBA,PARA EL FORTALECIMIENTO DEL SISTEMA DE INFORMACIÓN PARA LA GESTIÓN DE LOS MANGLARES DE COLOMBIA – SIGMA",{"$f":"IF(ISNUMBER(FIND(\"RES\",REFERENTES!$Q$628:$Q$1125,1)),REFERENTES!Q637,\"\")","v":""},{"$f":"REFERENTES!S16","v":48520},11,0,1131,"X",null,null,null,null,null,null,null,null,null,"Old Town Borde(RES_SPSC_OT-B)",55341]
[null,null,null,3637,"PILOTOS-RES_CORPAMAG_2019","Piloto restauración CGSM CORPAMAG",null,null,null,null,null,null,null,{"$f":"REFERENTES!S17","v":48526},12,0,1131,"X",null,null,null,null,null,null,null,null,null,"Old Town Cuenca(RES_SPSC_OT-C)",55342]
[null,null,null,2239,"SIGMA","Sistema de Información para la Gestión de los Manglares",null,null,null,null,null,null,{"$f":"IF(ISNUMBER(FIND(\"RES\",REFERENTES!$Q$628:$Q$1125,1)),REFERENTES!Q639,\"\")","v":""},{"$f":"REFERENTES!S18","v":55547},13,0,1131,"X",null,null,null,null,null,null,null,null,null,"Santa Catalina Borde(RES_SPSC_SC-B)",55344]
[null,null,null,null,null,null,null,null,null,null,null,null,{"$f":"IF(ISNUMBER(FIND(\"RES\",REFERENTES!$Q$628:$Q$1125,1)),REFERENTES!Q640,\"\")","v":""},{"$f":"REFERENTES!S19","v":55548},14,0,1131,"X",null,null,null,null,null,null,{"$f":"IF(ISNUMBER(FIND(\"RES\",REFERENTES!$Q878)),CONCATENATE(REFERENTES!T878,\"(\",REFERENTES!Q878,\")\"),\"X\")","v":"X"},{"$f":"IF(Y19=\"X\",\"\",INDEX($AB$22:$AC$287,MATCH(Y19,$AB$22:$AB$287,0),2))","v":""},null,"Santa Catalina Cuenca(RES_SPSC_SC-C)",55343]
[null,null,null,null,null,null,null,null,null,null,null,null,{"$f":"IF(ISNUMBER(FIND(\"RES\",REFERENTES!$Q$628:$Q$1125,1)),REFERENTES!Q641,\"\")","v":""},{"$f":"REFERENTES!S20","v":55549},15,0,1131,"X"]
[null,null,null,null,null,null,null,null,null,null,null,null,{"$f":"IF(ISNUMBER(FIND(\"RES\",REFERENTES!$Q$628:$Q$1125,1)),REFERENTES!Q642,\"\")","v":""},{"$f":"REFERENTES!S21","v":55550},16,0,1131,"X"]
[null,null,null,null,null,null,null,null,null,null,null,null,{"$f":"IF(ISNUMBER(FIND(\"RES\",REFERENTES!$Q$628:$Q$1125,1)),REFERENTES!Q643,\"\")","v":""},{"$f":"REFERENTES!S22","v":55551},17,0,1131,"X",null,null,null,null,null,null,null,null,null,"****PARCELAS******","NO VALIDO"]
[null,null,null,null,null,null,null,null,null,null,null,null,{"$f":"IF(ISNUMBER(FIND(\"RES\",REFERENTES!$Q$628:$Q$1125,1)),REFERENTES!Q644,\"\")","v":""},{"$f":"REFERENTES!S23","v":49002},18,0,1131,"X",null,null,null,null,null,null,null,null,null,{"$f":"CONCATENATE(REFERENTES!Q2,\"(\",REFERENTES!R2,\")\")","v":"Agrosoledad(CSISPIE-ZR1-Agrosole-1)"},{"$f":"REFERENTES!S2","v":48733}]
[null,null,null,null,null,null,null,null,null,null,null,null,{"$f":"IF(ISNUMBER(FIND(\"RES\",REFERENTES!$Q$628:$Q$1125,1)),REFERENTES!Q645,\"\")","v":""},{"$f":"REFERENTES!S24","v":48497},19,0,1131,"X",null,null,null,null,null,null,null,null,null,{"$f":"CONCATENATE(REFERENTES!Q3,\"(\",REFERENTES!R3,\")\")","v":"Aguas Negras -1(SFFOCC-SZ1-ANE-1)"},{"$f":"REFERENTES!S3","v":45924}]
[null,null,null,null,null,null,null,null,null,null,null,null,{"$f":"IF(ISNUMBER(FIND(\"RES\",REFERENTES!$Q$628:$Q$1125,1)),REFERENTES!Q646,\"\")","v":""},{"$f":"REFERENTES!S25","v":48489},20,0,1131,"X",null,null,null,null,null,null,null,null,null,{"$f":"CONCATENATE(REFERENTES!Q4,\"(\",REFERENTES!R4,\")\")","v":"Aguas Negras -2(SFFOCC-SZ1-ANE-2)"},{"$f":"REFERENTES!S4","v":45926}]
[null,null,null,null,null,null,null,null,null,null,null,null,{"$f":"IF(ISNUMBER(FIND(\"RES\",REFERENTES!$Q$628:$Q$1125,1)),REFERENTES!Q647,\"\")","v":""},{"$f":"REFERENTES!S26","v":48539},21,0,1131,"X",null,null,null,null,null,null,null,null,null,{"$f":"CONCATENATE(REFERENTES!Q5,\"(\",REFERENTES!R5,\")\")","v":"Aguas Negras -3(SFFOCC-SZ1-ANE-3)"},{"$f":"REFERENTES!S5","v":45928}]
[null,null,null,null,null,null,null,null,null,null,null,null,{"$f":"IF(ISNUMBER(FIND(\"RES\",REFERENTES!$Q$628:$Q$1125,1)),REFERENTES!Q648,\"\")","v":""},{"$f":"REFERENTES!S27","v":45097},22,0,1131,"X",null,null,null,null,null,null,null,null,null,{"$f":"CONCATENATE(REFERENTES!Q6,\"(\",REFERENTES!R6,\")\")","v":"Angostura(BCISEST-ZUS1-angostura-1)"},{"$f":"REFERENTES!S6","v":45589}]
[null,null,null,null,null,null,null,null,null,null,null,null,{"$f":"IF(ISNUMBER(FIND(\"RES\",REFERENTES!$Q$628:$Q$1125,1)),REFERENTES!Q649,\"\")","v":""},{"$f":"REFERENTES!S28","v":44580},23,0,1131,"X",null,null,null,null,null,null,null,null,null,{"$f":"CONCATENATE(REFERENTES!Q7,\"(\",REFERENTES!R7,\")\")","v":"Ararca-1(BARU-ZR1-Ararca-1)"},{"$f":"REFERENTES!S7","v":44509}]
[null,null,null,null,null,null,null,null,null,null,null,null,{"$f":"IF(ISNUMBER(FIND(\"RES\",REFERENTES!$Q$628:$Q$1125,1)),REFERENTES!Q650,\"\")","v":""},{"$f":"REFERENTES!S29","v":48517},24,0,1131,"X",null,null,null,null,null,null,null,null,null,{"$f":"CONCATENATE(REFERENTES!Q8,\"(\",REFERENTES!R8,\")\")","v":"Arroyo Plata-1(BARB-ZR1-Ay-Plata-1)"},{"$f":"REFERENTES!S8","v":44493}]
[null,null,null,null,null,null,null,null,null,null,null,null,{"$f":"IF(ISNUMBER(FIND(\"RES\",REFERENTES!$Q$628:$Q$1125,1)),REFERENTES!Q651,\"\")","v":""},{"$f":"REFERENTES!S30","v":42202},25,0,1131,"X",null,null,null,null,null,null,null,null,null,{"$f":"CONCATENATE(REFERENTES!Q9,\"(\",REFERENTES!R9,\")\")","v":"BLACK SAND BAY(BSAND_BAY1)"},{"$f":"REFERENTES!S9","v":58105}]
[null,null,null,null,null,null,null,null,null,null,null,null,{"$f":"IF(ISNUMBER(FIND(\"RES\",REFERENTES!$Q$628:$Q$1125,1)),REFERENTES!Q652,\"\")","v":""},{"$f":"REFERENTES!S31","v":44387},26,0,1131,"X",null,null,null,null,null,null,null,null,null,{"$f":"CONCATENATE(REFERENTES!Q10,\"(\",REFERENTES!R10,\")\")","v":"BOCAS DEL ATRATO P1(BCATRATO_P1)"},{"$f":"REFERENTES!S10","v":56791}]
[null,null,null,null,null,null,null,null,null,null,null,null,{"$f":"IF(ISNUMBER(FIND(\"RES\",REFERENTES!$Q$628:$Q$1125,1)),REFERENTES!Q653,\"\")","v":""},{"$f":"REFERENTES!S32","v":45918},27,0,1131,"X",null,null,null,null,null,null,null,null,null,{"$f":"CONCATENATE(REFERENTES!Q11,\"(\",REFERENTES!R11,\")\")","v":"BOQUILLA-1(JPVI-ZR1-BOQ-1)"},{"$f":"REFERENTES!S11","v":42007}]
[null,null,null,null,null,null,null,null,null,null,null,null,{"$f":"IF(ISNUMBER(FIND(\"RES\",REFERENTES!$Q$628:$Q$1125,1)),REFERENTES!Q654,\"\")","v":""},{"$f":"REFERENTES!S33","v":45418},28,0,1131,"X",null,null,null,null,null,null,null,null,null,{"$f":"CONCATENATE(REFERENTES!Q12,\"(\",REFERENTES!R12,\")\")","v":"Bahia Barbacoas-1(BARB-ZR1-Barba-1)"},{"$f":"REFERENTES!S12","v":42000}]
[null,null,null,null,null,null,null,null,null,null,null,null,{"$f":"IF(ISNUMBER(FIND(\"RES\",REFERENTES!$Q$628:$Q$1125,1)),REFERENTES!Q655,\"\")","v":""},{"$f":"REFERENTES!S34","v":41967},29,0,1131,"X",null,null,null,null,null,null,null,null,null,{"$f":"CONCATENATE(REFERENTES!Q13,\"(\",REFERENTES!R13,\")\")","v":"Bahia Barbacoas-1-1(BARB-ZR1-BARB01-1)"},{"$f":"REFERENTES!S13","v":44490}]
[null,null,null,null,null,null,null,null,null,null,null,null,{"$f":"IF(ISNUMBER(FIND(\"RES\",REFERENTES!$Q$628:$Q$1125,1)),REFERENTES!Q656,\"\")","v":""},{"$f":"REFERENTES!S35","v":45883},30,0,1131,"X",null,null,null,null,null,null,null,null,null,{"$f":"CONCATENATE(REFERENTES!Q14,\"(\",REFERENTES!R14,\")\")","v":"Bahia Honda -1(OPOI-ZP1-BahíaHonda-1)"},{"$f":"REFERENTES!S14","v":49005}]
[null,null,null,null,null,null,null,null,null,null,null,null,{"$f":"IF(ISNUMBER(FIND(\"RES\",REFERENTES!$Q$628:$Q$1125,1)),REFERENTES!Q657,\"\")","v":""},{"$f":"REFERENTES!S36","v":45862},31,0,1131,"X",null,null,null,null,null,null,null,null,null,{"$f":"CONCATENATE(REFERENTES!Q15,\"(\",REFERENTES!R15,\")\")","v":"Bahía Burrera-1(DRATR-ZUS1-Bburr-1)"},{"$f":"REFERENTES!S15","v":48492}]
[null,null,null,null,null,null,null,null,null,null,null,null,{"$f":"IF(ISNUMBER(FIND(\"RES\",REFERENTES!$Q$628:$Q$1125,1)),REFERENTES!Q658,\"\")","v":""},{"$f":"REFERENTES!S37","v":45900},32,0,1131,"X",null,null,null,null,null,null,null,null,null,{"$f":"CONCATENATE(REFERENTES!Q16,\"(\",REFERENTES!R16,\")\")","v":"Bahía Coco Grande-1(DRATR-ZR1-Bcog-1)"},{"$f":"REFERENTES!S16","v":48520}]
[null,null,null,null,null,null,null,null,null,null,null,null,{"$f":"IF(ISNUMBER(FIND(\"RES\",REFERENTES!$Q$628:$Q$1125,1)),REFERENTES!Q659,\"\")","v":""},{"$f":"REFERENTES!S38","v":45896},33,0,1131,"X",null,null,null,null,null,null,null,null,null,{"$f":"CONCATENATE(REFERENTES!Q17,\"(\",REFERENTES!R17,\")\")","v":"Bahía El Roto(DRATR-ZR1-Brot-1)"},{"$f":"REFERENTES!S17","v":48526}]
[null,null,null,null,null,null,null,null,null,null,null,null,{"$f":"IF(ISNUMBER(FIND(\"RES\",REFERENTES!$Q$628:$Q$1125,1)),REFERENTES!Q660,\"\")","v":""},{"$f":"REFERENTES!S39","v":45891},34,0,1131,"X",null,null,null,null,null,null,null,null,null,{"$f":"CONCATENATE(REFERENTES!Q18,\"(\",REFERENTES!R18,\")\")","v":"Bahía Honda parcela circular-2(BahíaHondaPPC-2)"},{"$f":"REFERENTES!S18","v":55547}]
[null,null,null,null,null,null,null,null,null,null,null,null,{"$f":"IF(ISNUMBER(FIND(\"RES\",REFERENTES!$Q$628:$Q$1125,1)),REFERENTES!Q661,\"\")","v":""},{"$f":"REFERENTES!S40","v":48444},35,0,1131,"X",null,null,null,null,null,null,null,null,null,{"$f":"CONCATENATE(REFERENTES!Q19,\"(\",REFERENTES!R19,\")\")","v":"Bahía Honda parcela circular-3(BahíaHondaPPC-3)"},{"$f":"REFERENTES!S19","v":55548}]
[null,null,null,null,null,null,null,null,null,null,null,null,{"$f":"IF(ISNUMBER(FIND(\"RES\",REFERENTES!$Q$628:$Q$1125,1)),REFERENTES!Q662,\"\")","v":""},{"$f":"REFERENTES!S41","v":45320},36,0,1131,"X",null,null,null,null,null,null,null,null,null,{"$f":"CONCATENATE(REFERENTES!Q20,\"(\",REFERENTES!R20,\")\")","v":"Bahía Hooker parcela circular-2(BahíaHookerPPC-2)"},{"$f":"REFERENTES!S20","v":55549}]
[null,null,null,null,null,null,null,null,null,null,null,null,{"$f":"IF(ISNUMBER(FIND(\"RES\",REFERENTES!$Q$628:$Q$1125,1)),REFERENTES!Q663,\"\")","v":""},{"$f":"REFERENTES!S42","v":45308},37,0,1131,"X",null,null,null,null,null,null,null,null,null,{"$f":"CONCATENATE(REFERENTES!Q21,\"(\",REFERENTES!R21,\")\")","v":"Bahía Hooker parcela circular-3(BahíaHookerPPC-3)"},{"$f":"REFERENTES!S21","v":55550}]
[null,null,null,null,null,null,null,null,null,null,null,null,{"$f":"IF(ISNUMBER(FIND(\"RES\",REFERENTES!$Q$628:$Q$1125,1)),REFERENTES!Q664,\"\")","v":""},{"$f":"REFERENTES!S43","v":45305},38,0,1131,"X",null,null,null,null,null,null,null,null,null,{"$f":"CONCATENATE(REFERENTES!Q22,\"(\",REFERENTES!R22,\")\")","v":"Bahía Hooker parcela circular-4(BahíaHookerPPC-4)"},{"$f":"REFERENTES!S22","v":55551}]
[null,null,null,null,null,null,null,null,null,null,null,null,{"$f":"IF(ISNUMBER(FIND(\"RES\",REFERENTES!$Q$628:$Q$1125,1)),REFERENTES!Q665,\"\")","v":""},{"$f":"REFERENTES!S44","v":45315},39,0,1131,"X",null,null,null,null,null,null,null,null,null,{"$f":"CONCATENATE(REFERENTES!Q23,\"(\",REFERENTES!R23,\")\")","v":"Bahía Hooker-1(OPOI-ZP1-BahíaHooker-1)"},{"$f":"REFERENTES!S23","v":49002}]
[null,null,null,null,null,null,null,null,null,null,null,null,{"$f":"IF(ISNUMBER(FIND(\"RES\",REFERENTES!$Q$628:$Q$1125,1)),REFERENTES!Q666,\"\")","v":""},{"$f":"REFERENTES!S45","v":58102},40,0,1131,"X",null,null,null,null,null,null,null,null,null,{"$f":"CONCATENATE(REFERENTES!Q24,\"(\",REFERENTES!R24,\")\")","v":"Bahía La Paila-1(DRATR-ZUS1-Bpai-1)"},{"$f":"REFERENTES!S24","v":48497}]
[null,null,null,null,null,null,null,null,null,null,null,null,{"$f":"IF(ISNUMBER(FIND(\"RES\",REFERENTES!$Q$628:$Q$1125,1)),REFERENTES!Q667,\"\")","v":""},{"$f":"REFERENTES!S46","v":58126},41,0,1131,"X",null,null,null,null,null,null,null,null,null,{"$f":"CONCATENATE(REFERENTES!Q25,\"(\",REFERENTES!R25,\")\")","v":"Bahía Marirrio(DRATR-ZP1-Bmari-2)"},{"$f":"REFERENTES!S25","v":48489}]
[null,null,null,null,null,null,null,null,null,null,null,null,{"$f":"IF(ISNUMBER(FIND(\"RES\",REFERENTES!$Q$628:$Q$1125,1)),REFERENTES!Q668,\"\")","v":""},{"$f":"REFERENTES!S47","v":42117},42,0,1131,"X",null,null,null,null,null,null,null,null,null,{"$f":"CONCATENATE(REFERENTES!Q26,\"(\",REFERENTES!R26,\")\")","v":"Bahía Marirrio(DRATR-ZP1-Bmari-3)"},{"$f":"REFERENTES!S26","v":48539}]
[null,null,null,null,null,null,null,null,null,null,null,null,{"$f":"IF(ISNUMBER(FIND(\"RES\",REFERENTES!$Q$628:$Q$1125,1)),REFERENTES!Q669,\"\")","v":""},{"$f":"REFERENTES!S48","v":45387},43,0,1131,"X",null,null,null,null,null,null,null,null,null,{"$f":"CONCATENATE(REFERENTES!Q27,\"(\",REFERENTES!R27,\")\")","v":"Balboa-1(CNGBAL-ZP3-Balboa-1)"},{"$f":"REFERENTES!S27","v":45097}]
[null,null,null,null,null,null,null,null,null,null,null,null,{"$f":"IF(ISNUMBER(FIND(\"RES\",REFERENTES!$Q$628:$Q$1125,1)),REFERENTES!Q670,\"\")","v":""},{"$f":"REFERENTES!S49","v":46010},44,0,1131,"X",null,null,null,null,null,null,null,null,null,{"$f":"CONCATENATE(REFERENTES!Q28,\"(\",REFERENTES!R28,\")\")","v":"Baru1(BARU-ZR1-Barú-1)"},{"$f":"REFERENTES!S28","v":44580}]
[null,null,null,null,null,null,null,null,null,null,null,null,{"$f":"IF(ISNUMBER(FIND(\"RES\",REFERENTES!$Q$628:$Q$1125,1)),REFERENTES!Q671,\"\")","v":""},{"$f":"REFERENTES!S50","v":48750},45,0,1131,"X",null,null,null,null,null,null,null,null,null,{"$f":"CONCATENATE(REFERENTES!Q29,\"(\",REFERENTES!R29,\")\")","v":"Bazo Matuntugo -1(DRATR-ZR1-Bmat-1)"},{"$f":"REFERENTES!S29","v":48517}]
[null,null,null,null,null,null,null,null,null,null,null,null,{"$f":"IF(ISNUMBER(FIND(\"RES\",REFERENTES!$Q$628:$Q$1125,1)),REFERENTES!Q672,\"\")","v":""},{"$f":"REFERENTES!S51","v":44380},46,0,1131,"X",null,null,null,null,null,null,null,null,null,{"$f":"CONCATENATE(REFERENTES!Q30,\"(\",REFERENTES!R30,\")\")","v":"Berrugas(BERR-ZR1-BERR-1)"},{"$f":"REFERENTES!S30","v":42202}]
[null,null,null,null,null,null,null,null,null,null,null,null,{"$f":"IF(ISNUMBER(FIND(\"RES\",REFERENTES!$Q$628:$Q$1125,1)),REFERENTES!Q673,\"\")","v":""},{"$f":"REFERENTES!S52","v":42093},47,0,1131,"X",null,null,null,null,null,null,null,null,null,{"$f":"CONCATENATE(REFERENTES!Q31,\"(\",REFERENTES!R31,\")\")","v":"Boca Cerrada(BCER-ZUS1-BCER-1)"},{"$f":"REFERENTES!S31","v":44387}]
[null,null,null,null,null,null,null,null,null,null,null,null,{"$f":"IF(ISNUMBER(FIND(\"RES\",REFERENTES!$Q$628:$Q$1125,1)),REFERENTES!Q674,\"\")","v":""},{"$f":"REFERENTES!S53","v":45264},48,0,1131,"X",null,null,null,null,null,null,null,null,null,{"$f":"CONCATENATE(REFERENTES!Q32,\"(\",REFERENTES!R32,\")\")","v":"Boca ISCUANDE(ISCUANDE-ZR1-GUABA-1)"},{"$f":"REFERENTES!S32","v":45918}]
[null,null,null,null,null,null,null,null,null,null,null,null,{"$f":"IF(ISNUMBER(FIND(\"RES\",REFERENTES!$Q$628:$Q$1125,1)),REFERENTES!Q675,\"\")","v":""},{"$f":"REFERENTES!S54","v":45930},49,0,1131,"X",null,null,null,null,null,null,null,null,null,{"$f":"CONCATENATE(REFERENTES!Q33,\"(\",REFERENTES!R33,\")\")","v":"Boca Vieja(Coquí-ZUS1-Bovi-1)"},{"$f":"REFERENTES!S33","v":45418}]
[null,null,null,null,null,null,null,null,null,null,null,null,{"$f":"IF(ISNUMBER(FIND(\"RES\",REFERENTES!$Q$628:$Q$1125,1)),REFERENTES!Q676,\"\")","v":""},{"$f":"REFERENTES!S55","v":45932},50,0,1131,"X",null,null,null,null,null,null,null,null,null,{"$f":"CONCATENATE(REFERENTES!Q34,\"(\",REFERENTES!R34,\")\")","v":"Bocana(AST-ZP1-BOCA-1)"},{"$f":"REFERENTES!S34","v":41967}]
[null,null,null,null,null,null,null,null,null,null,null,null,{"$f":"IF(ISNUMBER(FIND(\"RES\",REFERENTES!$Q$628:$Q$1125,1)),REFERENTES!Q677,\"\")","v":""},{"$f":"REFERENTES!S56","v":45934},51,0,1131,"X",null,null,null,null,null,null,null,null,null,{"$f":"CONCATENATE(REFERENTES!Q35,\"(\",REFERENTES!R35,\")\")","v":"Bocana Asocars(BVENT-ZR3-BA-1)"},{"$f":"REFERENTES!S35","v":45883}]
[null,null,null,null,null,null,null,null,null,null,null,null,{"$f":"IF(ISNUMBER(FIND(\"RES\",REFERENTES!$Q$628:$Q$1125,1)),REFERENTES!Q678,\"\")","v":""},{"$f":"REFERENTES!S57","v":45072},52,0,1131,"X",null,null,null,null,null,null,null,null,null,{"$f":"CONCATENATE(REFERENTES!Q36,\"(\",REFERENTES!R36,\")\")","v":"Bocana CVC(BVENT-ZR3-BCVC-1)"},{"$f":"REFERENTES!S36","v":45862}]
[null,null,null,null,null,null,null,null,null,null,null,null,{"$f":"IF(ISNUMBER(FIND(\"RES\",REFERENTES!$Q$628:$Q$1125,1)),REFERENTES!Q679,\"\")","v":""},{"$f":"REFERENTES!S58","v":44410},53,0,1131,"X",null,null,null,null,null,null,null,null,null,{"$f":"CONCATENATE(REFERENTES!Q37,\"(\",REFERENTES!R37,\")\")","v":"Bocas TAPAGE -1(TAPAGE-ZR2-BOTAPAJE-1)"},{"$f":"REFERENTES!S37","v":45900}]
[null,null,null,null,null,null,null,null,null,null,null,null,{"$f":"IF(ISNUMBER(FIND(\"RES\",REFERENTES!$Q$628:$Q$1125,1)),REFERENTES!Q680,\"\")","v":""},{"$f":"REFERENTES!S59","v":42074},54,0,1131,"X",null,null,null,null,null,null,null,null,null,{"$f":"CONCATENATE(REFERENTES!Q38,\"(\",REFERENTES!R38,\")\")","v":"Bocas de SEQUIHONDA -1(TAPAGE-ZR1-SEQUIHONDA-1)"},{"$f":"REFERENTES!S38","v":45896}]
[null,null,null,null,null,null,null,null,null,null,null,null,{"$f":"IF(ISNUMBER(FIND(\"RES\",REFERENTES!$Q$628:$Q$1125,1)),REFERENTES!Q681,\"\")","v":""},{"$f":"REFERENTES!S60","v":44504},55,0,1131,"X",null,null,null,null,null,null,null,null,null,{"$f":"CONCATENATE(REFERENTES!Q39,\"(\",REFERENTES!R39,\")\")","v":"Bodegas(ANCHI-ZR1-AB-1)"},{"$f":"REFERENTES!S39","v":45891}]
[null,null,null,null,null,null,null,null,null,null,null,null,{"$f":"IF(ISNUMBER(FIND(\"RES\",REFERENTES!$Q$628:$Q$1125,1)),REFERENTES!Q682,\"\")","v":""},{"$f":"REFERENTES!S61","v":44378},56,0,1131,"X",null,null,null,null,null,null,null,null,null,{"$f":"CONCATENATE(REFERENTES!Q40,\"(\",REFERENTES!R40,\")\")","v":"Buno-1(CORI-ZUS1-Buno-1)"},{"$f":"REFERENTES!S40","v":48444}]
[null,null,null,null,null,null,null,null,null,null,null,null,{"$f":"IF(ISNUMBER(FIND(\"RES\",REFERENTES!$Q$628:$Q$1125,1)),REFERENTES!Q683,\"\")","v":""},{"$f":"REFERENTES!S62","v":45100},57,0,1131,"X",null,null,null,null,null,null,null,null,null,{"$f":"CONCATENATE(REFERENTES!Q41,\"(\",REFERENTES!R41,\")\")","v":"Buritaca 2(BUR-ZR1-Buritac2-1)"},{"$f":"REFERENTES!S41","v":45320}]
[null,null,null,null,null,null,null,null,null,null,null,null,{"$f":"IF(ISNUMBER(FIND(\"RES\",REFERENTES!$Q$628:$Q$1125,1)),REFERENTES!Q684,\"\")","v":""},{"$f":"REFERENTES!S63","v":48758},58,0,1131,"X",null,null,null,null,null,null,null,null,null,{"$f":"CONCATENATE(REFERENTES!Q42,\"(\",REFERENTES!R42,\")\")","v":"Buritaca 2-1(BUR-ZP1-Buritac2-1)"},{"$f":"REFERENTES!S42","v":45308}]
[null,null,null,null,null,null,null,null,null,null,null,null,{"$f":"IF(ISNUMBER(FIND(\"RES\",REFERENTES!$Q$628:$Q$1125,1)),REFERENTES!Q685,\"\")","v":""},{"$f":"REFERENTES!S64","v":45351},59,0,1131,"X",null,null,null,null,null,null,null,null,null,{"$f":"CONCATENATE(REFERENTES!Q43,\"(\",REFERENTES!R43,\")\")","v":"Buritaca ZP 1-1(BUR-ZP1-Buritac1-1)"},{"$f":"REFERENTES!S43","v":45305}]
[null,null,null,null,null,null,null,null,null,null,null,null,{"$f":"IF(ISNUMBER(FIND(\"RES\",REFERENTES!$Q$628:$Q$1125,1)),REFERENTES!Q686,\"\")","v":""},{"$f":"REFERENTES!S65","v":42083},60,0,1131,"X",null,null,null,null,null,null,null,null,null,{"$f":"CONCATENATE(REFERENTES!Q44,\"(\",REFERENTES!R44,\")\")","v":"Buritaca ZR 1(BUR-ZR1-Buritc1-1)"},{"$f":"REFERENTES!S44","v":45315}]
[null,null,null,null,null,null,null,null,null,null,null,null,{"$f":"IF(ISNUMBER(FIND(\"RES\",REFERENTES!$Q$628:$Q$1125,1)),REFERENTES!Q687,\"\")","v":""},{"$f":"REFERENTES!S66","v":48755},61,0,1131,"X",null,null,null,null,null,null,null,null,null,{"$f":"CONCATENATE(REFERENTES!Q45,\"(\",REFERENTES!R45,\")\")","v":"CENTRO (CENTRO_JON)"},{"$f":"REFERENTES!S45","v":58102}]
[null,null,null,null,null,null,null,null,null,null,null,null,{"$f":"IF(ISNUMBER(FIND(\"RES\",REFERENTES!$Q$628:$Q$1125,1)),REFERENTES!Q688,\"\")","v":""},{"$f":"REFERENTES!S67","v":45095},62,0,1131,"X",null,null,null,null,null,null,null,null,null,{"$f":"CONCATENATE(REFERENTES!Q46,\"(\",REFERENTES!R46,\")\")","v":"CENTRO (CENTRO_SAN)"},{"$f":"REFERENTES!S46","v":58126}]
[null,null,null,null,null,null,null,null,null,null,null,null,{"$f":"IF(ISNUMBER(FIND(\"RES\",REFERENTES!$Q$628:$Q$1125,1)),REFERENTES!Q689,\"\")","v":""},{"$f":"REFERENTES!S68","v":45008},63,0,1131,"X",null,null,null,null,null,null,null,null,null,{"$f":"CONCATENATE(REFERENTES!Q47,\"(\",REFERENTES!R47,\")\")","v":"Caimanero(VIRU-SZ1-CAIM-1)"},{"$f":"REFERENTES!S47","v":42117}]
[null,null,null,null,null,null,null,null,null,null,null,null,{"$f":"IF(ISNUMBER(FIND(\"RES\",REFERENTES!$Q$628:$Q$1125,1)),REFERENTES!Q690,\"\")","v":""},{"$f":"REFERENTES!S69","v":48429},64,0,1131,"X",null,null,null,null,null,null,null,null,null,{"$f":"CONCATENATE(REFERENTES!Q48,\"(\",REFERENTES!R48,\")\")","v":"Camino Real(CAMREAL-ZUS1-CAMREAL-1)"},{"$f":"REFERENTES!S48","v":45387}]
[null,null,null,null,null,null,null,null,null,null,null,null,{"$f":"IF(ISNUMBER(FIND(\"RES\",REFERENTES!$Q$628:$Q$1125,1)),REFERENTES!Q691,\"\")","v":""},{"$f":"REFERENTES!S70","v":44414},65,0,1131,"X",null,null,null,null,null,null,null,null,null,{"$f":"CONCATENATE(REFERENTES!Q49,\"(\",REFERENTES!R49,\")\")","v":"Cangrejo(MAYO-ZUS1-Can-1)"},{"$f":"REFERENTES!S49","v":46010}]
[null,null,null,null,null,null,null,null,null,null,null,null,{"$f":"IF(ISNUMBER(FIND(\"RES\",REFERENTES!$Q$628:$Q$1125,1)),REFERENTES!Q692,\"\")","v":""},{"$f":"REFERENTES!S71","v":45040},66,0,{"$f":"IF(P71=0,MAX($O$6:$O$1135)+1,O71)","v":1131},{"$f":"IFERROR(VLOOKUP(SMALL($Q$6:$Q$1135,O71),$O$6:$P$1135,2,FALSE),\"X\")","v":"X"},null,null,null,null,null,null,null,null,null,{"$f":"CONCATENATE(REFERENTES!Q50,\"(\",REFERENTES!R50,\")\")","v":"Caño Arteaga(BCISEST-ZUS1-CñArteaga-1)"},{"$f":"REFERENTES!S50","v":48750}]
[null,null,null,null,null,null,null,null,null,null,null,null,{"$f":"IF(ISNUMBER(FIND(\"RES\",REFERENTES!$Q$628:$Q$1125,1)),REFERENTES!Q693,\"\")","v":""},{"$f":"REFERENTES!S72","v":41954},67,0,1131,"X",null,null,null,null,null,null,null,null,null,{"$f":"CONCATENATE(REFERENTES!Q51,\"(\",REFERENTES!R51,\")\")","v":"Caño Camaronera-1(BARC-ZUS1-CCAM-1)"},{"$f":"REFERENTES!S51","v":44380}]
[null,null,null,null,null,null,null,null,null,null,null,null,{"$f":"IF(ISNUMBER(FIND(\"RES\",REFERENTES!$Q$628:$Q$1125,1)),REFERENTES!Q694,\"\")","v":""},{"$f":"REFERENTES!S73","v":45821},68,{"$f":"IF(M73=\"\",0,M73)","v":0},1131,"X",null,null,null,null,null,null,null,null,null,{"$f":"CONCATENATE(REFERENTES!Q52,\"(\",REFERENTES!R52,\")\")","v":"Caño Corea -1(TIN-ZR1-EC-1)"},{"$f":"REFERENTES!S52","v":42093}]
[null,null,null,null,null,null,null,null,null,null,null,null,{"$f":"IF(ISNUMBER(FIND(\"RES\",REFERENTES!$Q$628:$Q$1125,1)),REFERENTES!Q695,\"\")","v":""},{"$f":"REFERENTES!S74","v":42181},69,0,1131,"X",null,null,null,null,null,null,null,null,null,{"$f":"CONCATENATE(REFERENTES!Q53,\"(\",REFERENTES!R53,\")\")","v":"Caño Dulce-1(CÑDULC-SZ1-CÑDULC-1)"},{"$f":"REFERENTES!S53","v":45264}]
[null,null,null,null,null,null,null,null,null,null,null,null,{"$f":"IF(ISNUMBER(FIND(\"RES\",REFERENTES!$Q$628:$Q$1125,1)),REFERENTES!Q696,\"\")","v":""},{"$f":"REFERENTES!S75","v":44585},70,0,1131,"X",null,null,null,null,null,null,null,null,null,{"$f":"CONCATENATE(REFERENTES!Q54,\"(\",REFERENTES!R54,\")\")","v":"Caño Grande E-1(CGSM-SZ1-CGE-1)"},{"$f":"REFERENTES!S54","v":45930}]
[null,null,null,null,null,null,null,null,null,null,null,null,{"$f":"IF(ISNUMBER(FIND(\"RES\",REFERENTES!$Q$628:$Q$1125,1)),REFERENTES!Q697,\"\")","v":""},{"$f":"REFERENTES!S76","v":44598},71,0,1131,"X",null,null,null,null,null,null,null,null,null,{"$f":"CONCATENATE(REFERENTES!Q55,\"(\",REFERENTES!R55,\")\")","v":"Caño Grande E-2(CGSM-SZ1-CGE-2)"},{"$f":"REFERENTES!S55","v":45932}]
[null,null,null,null,null,null,null,null,null,null,null,null,{"$f":"IF(ISNUMBER(FIND(\"RES\",REFERENTES!$Q$628:$Q$1125,1)),REFERENTES!Q698,\"\")","v":""},{"$f":"REFERENTES!S77","v":44407},72,0,1131,"X",null,null,null,null,null,null,null,null,null,{"$f":"CONCATENATE(REFERENTES!Q56,\"(\",REFERENTES!R56,\")\")","v":"Caño Grande E-3(CGSM-SZ1-CGE-3)"},{"$f":"REFERENTES!S56","v":45934}]
[null,null,null,null,null,null,null,null,null,null,null,null,{"$f":"IF(ISNUMBER(FIND(\"RES\",REFERENTES!$Q$628:$Q$1125,1)),REFERENTES!Q699,\"\")","v":""},{"$f":"REFERENTES!S78","v":44369},73,0,1131,"X",null,null,null,null,null,null,null,null,null,{"$f":"CONCATENATE(REFERENTES!Q57,\"(\",REFERENTES!R57,\")\")","v":"Caño Grande-1(BCISEST-ZUS2-cañogrande-1)"},{"$f":"REFERENTES!S57","v":45072}]
[null,null,null,null,null,null,null,null,null,null,null,null,{"$f":"IF(ISNUMBER(FIND(\"RES\",REFERENTES!$Q$628:$Q$1125,1)),REFERENTES!Q700,\"\")","v":""},{"$f":"REFERENTES!S79","v":44422},74,0,1131,"X",null,null,null,null,null,null,null,null,null,{"$f":"CONCATENATE(REFERENTES!Q58,\"(\",REFERENTES!R58,\")\")","v":"Caño Guacamayas-1(GUAC-ZP1-CGUA-1)"},{"$f":"REFERENTES!S58","v":44410}]
[null,null,null,null,null,null,null,null,null,null,null,null,{"$f":"IF(ISNUMBER(FIND(\"RES\",REFERENTES!$Q$628:$Q$1125,1)),REFERENTES!Q701,\"\")","v":""},{"$f":"REFERENTES!S80","v":45078},75,0,1131,"X",null,null,null,null,null,null,null,null,null,{"$f":"CONCATENATE(REFERENTES!Q59,\"(\",REFERENTES!R59,\")\")","v":"Caño La Balsa(LBAL-ZUS1-clb-1)"},{"$f":"REFERENTES!S59","v":42074}]
[null,null,null,null,null,null,null,null,null,null,null,null,{"$f":"IF(ISNUMBER(FIND(\"RES\",REFERENTES!$Q$628:$Q$1125,1)),REFERENTES!Q702,\"\")","v":""},{"$f":"REFERENTES!S81","v":45054},76,0,1131,"X",null,null,null,null,null,null,null,null,null,{"$f":"CONCATENATE(REFERENTES!Q60,\"(\",REFERENTES!R60,\")\")","v":"Caño Lequerica(BARB-ZR1-Lequerica-1)"},{"$f":"REFERENTES!S60","v":44504}]
[null,null,null,null,null,null,null,null,null,null,null,null,{"$f":"IF(ISNUMBER(FIND(\"RES\",REFERENTES!$Q$628:$Q$1125,1)),REFERENTES!Q703,\"\")","v":""},{"$f":"REFERENTES!S82","v":45145},77,0,1131,"X",null,null,null,null,null,null,null,null,null,{"$f":"CONCATENATE(REFERENTES!Q61,\"(\",REFERENTES!R61,\")\")","v":"Caño Matuna-1(BARC-ZUS1-CMAT-1)"},{"$f":"REFERENTES!S61","v":44378}]
[null,null,null,null,null,null,null,null,null,null,null,null,{"$f":"IF(ISNUMBER(FIND(\"RES\",REFERENTES!$Q$628:$Q$1125,1)),REFERENTES!Q704,\"\")","v":""},{"$f":"REFERENTES!S83","v":45118},78,0,1131,"X",null,null,null,null,null,null,null,null,null,{"$f":"CONCATENATE(REFERENTES!Q62,\"(\",REFERENTES!R62,\")\")","v":"Caño Palermo-1(BCISEST-ZUS4-palermo-1)"},{"$f":"REFERENTES!S62","v":45100}]
[null,null,null,null,null,null,null,null,null,null,null,null,{"$f":"IF(ISNUMBER(FIND(\"RES\",REFERENTES!$Q$628:$Q$1125,1)),REFERENTES!Q705,\"\")","v":""},{"$f":"REFERENTES!S84","v":48753},79,0,1131,"X",null,null,null,null,null,null,null,null,null,{"$f":"CONCATENATE(REFERENTES!Q63,\"(\",REFERENTES!R63,\")\")","v":"Caño Salado(BCISEST-ZP1-CñSalado-1)"},{"$f":"REFERENTES!S63","v":48758}]
[null,null,null,null,null,null,null,null,null,null,null,null,{"$f":"IF(ISNUMBER(FIND(\"RES\",REFERENTES!$Q$628:$Q$1125,1)),REFERENTES!Q706,\"\")","v":""},{"$f":"REFERENTES!S85","v":49325},80,0,1131,"X",null,null,null,null,null,null,null,null,null,{"$f":"CONCATENATE(REFERENTES!Q64,\"(\",REFERENTES!R64,\")\")","v":"Caño Salado -2(BCISEST-ZP1-cañosalado2-1)"},{"$f":"REFERENTES!S64","v":45351}]
[null,null,null,null,null,null,null,null,null,null,null,null,{"$f":"IF(ISNUMBER(FIND(\"RES\",REFERENTES!$Q$628:$Q$1125,1)),REFERENTES!Q707,\"\")","v":""},{"$f":"REFERENTES!S86","v":48766},81,0,1131,"X",null,null,null,null,null,null,null,null,null,{"$f":"CONCATENATE(REFERENTES!Q65,\"(\",REFERENTES!R65,\")\")","v":"Caño Salado-11(BCISESTSAL-ZP1-CS-1)"},{"$f":"REFERENTES!S65","v":42083}]
[null,null,null,null,null,null,null,null,null,null,null,null,{"$f":"IF(ISNUMBER(FIND(\"RES\",REFERENTES!$Q$628:$Q$1125,1)),REFERENTES!Q708,\"\")","v":""},{"$f":"REFERENTES!S87","v":45121},82,0,1131,"X",null,null,null,null,null,null,null,null,null,{"$f":"CONCATENATE(REFERENTES!Q66,\"(\",REFERENTES!R66,\")\")","v":"Caño Tijo-1(CSISPIE-ZUS1-CñTijo-1)"},{"$f":"REFERENTES!S66","v":48755}]
[null,null,null,null,null,null,null,null,null,null,null,null,{"$f":"IF(ISNUMBER(FIND(\"RES\",REFERENTES!$Q$628:$Q$1125,1)),REFERENTES!Q709,\"\")","v":""},{"$f":"REFERENTES!S88","v":45136},83,0,1131,"X",null,null,null,null,null,null,null,null,null,{"$f":"CONCATENATE(REFERENTES!Q67,\"(\",REFERENTES!R67,\")\")","v":"Caño Tijo-2(BCISEST-ZR1-eltijo2-1)"},{"$f":"REFERENTES!S67","v":45095}]
[null,null,null,null,null,null,null,null,null,null,null,null,{"$f":"IF(ISNUMBER(FIND(\"RES\",REFERENTES!$Q$628:$Q$1125,1)),REFERENTES!Q710,\"\")","v":""},{"$f":"REFERENTES!S89","v":45125},84,0,1131,"X",null,null,null,null,null,null,null,null,null,{"$f":"CONCATENATE(REFERENTES!Q68,\"(\",REFERENTES!R68,\")\")","v":"Caño Tijo-2(BCISLIT-ZUS1-TIJO-1)"},{"$f":"REFERENTES!S68","v":45008}]
[null,null,null,null,null,null,null,null,null,null,null,null,{"$f":"IF(ISNUMBER(FIND(\"RES\",REFERENTES!$Q$628:$Q$1125,1)),REFERENTES!Q711,\"\")","v":""},{"$f":"REFERENTES!S90","v":45142},85,0,1131,"X",null,null,null,null,null,null,null,null,null,{"$f":"CONCATENATE(REFERENTES!Q69,\"(\",REFERENTES!R69,\")\")","v":"Caño Urabalito -1(CORI-ZR1-Cura-1)"},{"$f":"REFERENTES!S69","v":48429}]
[null,null,null,null,null,null,null,null,null,null,null,null,{"$f":"IF(ISNUMBER(FIND(\"RES\",REFERENTES!$Q$628:$Q$1125,1)),REFERENTES!Q712,\"\")","v":""},{"$f":"REFERENTES!S91","v":48769},86,0,1131,"X",null,null,null,null,null,null,null,null,null,{"$f":"CONCATENATE(REFERENTES!Q70,\"(\",REFERENTES!R70,\")\")","v":"Caño el Frances-1(FRAN-ZR1-BCFRA-1)"},{"$f":"REFERENTES!S70","v":44414}]
[null,null,null,null,null,null,null,null,null,null,null,null,{"$f":"IF(ISNUMBER(FIND(\"RES\",REFERENTES!$Q$628:$Q$1125,1)),REFERENTES!Q713,\"\")","v":""},{"$f":"REFERENTES!S92","v":41479},87,0,1131,"X",null,null,null,null,null,null,null,null,null,{"$f":"CONCATENATE(REFERENTES!Q71,\"(\",REFERENTES!R71,\")\")","v":"Caño el Nene -1(CCISinu-ZUS1-elnene-1)"},{"$f":"REFERENTES!S71","v":45040}]
[null,null,null,null,null,null,null,null,null,null,null,null,{"$f":"IF(ISNUMBER(FIND(\"RES\",REFERENTES!$Q$628:$Q$1125,1)),REFERENTES!Q714,\"\")","v":""},{"$f":"REFERENTES!S93","v":55552},88,0,1131,"X",null,null,null,null,null,null,null,null,null,{"$f":"CONCATENATE(REFERENTES!Q72,\"(\",REFERENTES!R72,\")\")","v":"CañoTubo(CNGMLLQ-ZP1-CATO-1)"},{"$f":"REFERENTES!S72","v":41954}]
[null,null,null,null,null,null,null,null,null,null,null,null,{"$f":"IF(ISNUMBER(FIND(\"RES\",REFERENTES!$Q$628:$Q$1125,1)),REFERENTES!Q715,\"\")","v":""},{"$f":"REFERENTES!S94","v":55553},89,0,1131,"X",null,null,null,null,null,null,null,null,null,{"$f":"CONCATENATE(REFERENTES!Q73,\"(\",REFERENTES!R73,\")\")","v":"Chamuscado(BNAY-ZUS3-NC-1)"},{"$f":"REFERENTES!S73","v":45821}]
[null,null,null,null,null,null,null,null,null,null,null,null,{"$f":"IF(ISNUMBER(FIND(\"RES\",REFERENTES!$Q$628:$Q$1125,1)),REFERENTES!Q716,\"\")","v":""},{"$f":"REFERENTES!S95","v":45429},90,0,1131,"X",null,null,null,null,null,null,null,null,null,{"$f":"CONCATENATE(REFERENTES!Q74,\"(\",REFERENTES!R74,\")\")","v":"Chichiman -1(PCOM-ZR1-Chichi-1)"},{"$f":"REFERENTES!S74","v":42181}]
[null,null,null,null,null,null,null,null,null,null,null,null,{"$f":"IF(ISNUMBER(FIND(\"RES\",REFERENTES!$Q$628:$Q$1125,1)),REFERENTES!Q717,\"\")","v":""},{"$f":"REFERENTES!S96","v":45575},91,0,1131,"X",null,null,null,null,null,null,null,null,null,{"$f":"CONCATENATE(REFERENTES!Q75,\"(\",REFERENTES!R75,\")\")","v":"Cholon-1(BARU-ZR1-Cholón-1)"},{"$f":"REFERENTES!S75","v":44585}]
[null,null,null,null,null,null,null,null,null,null,null,null,{"$f":"IF(ISNUMBER(FIND(\"RES\",REFERENTES!$Q$628:$Q$1125,1)),REFERENTES!Q718,\"\")","v":""},{"$f":"REFERENTES!S97","v":45301},92,0,1131,"X",null,null,null,null,null,null,null,null,null,{"$f":"CONCATENATE(REFERENTES!Q76,\"(\",REFERENTES!R76,\")\")","v":"Cienaga El Picon-1(TBOM-ZP1-Picón-1)"},{"$f":"REFERENTES!S76","v":44598}]
[null,null,null,null,null,null,null,null,null,null,null,null,{"$f":"IF(ISNUMBER(FIND(\"RES\",REFERENTES!$Q$628:$Q$1125,1)),REFERENTES!Q719,\"\")","v":""},{"$f":"REFERENTES!S98","v":45297},93,0,1131,"X",null,null,null,null,null,null,null,null,null,{"$f":"CONCATENATE(REFERENTES!Q77,\"(\",REFERENTES!R77,\")\")","v":"Ciénaga Ana Gomez-2(CANG-ZR1-CANG-2)"},{"$f":"REFERENTES!S77","v":44407}]
[null,null,null,null,null,null,null,null,null,null,null,null,{"$f":"IF(ISNUMBER(FIND(\"RES\",REFERENTES!$Q$628:$Q$1125,1)),REFERENTES!Q720,\"\")","v":""},{"$f":"REFERENTES!S99","v":45489},94,0,1131,"X",null,null,null,null,null,null,null,null,null,{"$f":"CONCATENATE(REFERENTES!Q78,\"(\",REFERENTES!R78,\")\")","v":"Ciénaga Benitez-1(CBEN-ZR1-CBEN-1)"},{"$f":"REFERENTES!S78","v":44369}]
[null,null,null,null,null,null,null,null,null,null,null,null,{"$f":"IF(ISNUMBER(FIND(\"RES\",REFERENTES!$Q$628:$Q$1125,1)),REFERENTES!Q721,\"\")","v":""},{"$f":"REFERENTES!S100","v":58076},95,0,1131,"X",null,null,null,null,null,null,null,null,null,{"$f":"CONCATENATE(REFERENTES!Q79,\"(\",REFERENTES!R79,\")\")","v":"Ciénaga Caimanera-1(CCAIM-ZUS1-CCAIM-1)"},{"$f":"REFERENTES!S79","v":44422}]
[null,null,null,null,null,null,null,null,null,null,null,null,{"$f":"IF(ISNUMBER(FIND(\"RES\",REFERENTES!$Q$628:$Q$1125,1)),REFERENTES!Q722,\"\")","v":""},{"$f":"REFERENTES!S101","v":58077},96,0,1131,"X",null,null,null,null,null,null,null,null,null,{"$f":"CONCATENATE(REFERENTES!Q80,\"(\",REFERENTES!R80,\")\")","v":"Ciénaga El Garzal -2(BCISEST-ZR1-elgarzal-2)"},{"$f":"REFERENTES!S80","v":45078}]
[null,null,null,null,null,null,null,null,null,null,null,null,{"$f":"IF(ISNUMBER(FIND(\"RES\",REFERENTES!$Q$628:$Q$1125,1)),REFERENTES!Q723,\"\")","v":""},{"$f":"REFERENTES!S102","v":58078},97,0,1131,"X",null,null,null,null,null,null,null,null,null,{"$f":"CONCATENATE(REFERENTES!Q81,\"(\",REFERENTES!R81,\")\")","v":"Ciénaga El Garzal-1(BCISEST-ZR1-elgarzal-1)"},{"$f":"REFERENTES!S81","v":45054}]
[null,null,null,null,null,null,null,null,null,null,null,null,{"$f":"IF(ISNUMBER(FIND(\"RES\",REFERENTES!$Q$628:$Q$1125,1)),REFERENTES!Q724,\"\")","v":""},{"$f":"REFERENTES!S103","v":58060},98,0,1131,"X",null,null,null,null,null,null,null,null,null,{"$f":"CONCATENATE(REFERENTES!Q82,\"(\",REFERENTES!R82,\")\")","v":"Ciénaga El Garzal-3(BCISEST-ZUS1-elgarzal3-1)"},{"$f":"REFERENTES!S82","v":45145}]
[null,null,null,null,null,null,null,null,null,null,null,null,{"$f":"IF(ISNUMBER(FIND(\"RES\",REFERENTES!$Q$628:$Q$1125,1)),REFERENTES!Q725,\"\")","v":""},{"$f":"REFERENTES!S104","v":58061},99,0,1131,"X",null,null,null,null,null,null,null,null,null,{"$f":"CONCATENATE(REFERENTES!Q83,\"(\",REFERENTES!R83,\")\")","v":"Ciénaga Galo(BCISEST-ZR1-golo-1)"},{"$f":"REFERENTES!S83","v":45118}]
[null,null,null,null,null,null,null,null,null,null,null,null,{"$f":"IF(ISNUMBER(FIND(\"RES\",REFERENTES!$Q$628:$Q$1125,1)),REFERENTES!Q726,\"\")","v":""},{"$f":"REFERENTES!S105","v":58062},100,0,1131,"X",null,null,null,null,null,null,null,null,null,{"$f":"CONCATENATE(REFERENTES!Q84,\"(\",REFERENTES!R84,\")\")","v":"Ciénaga Galo(BCISEST-ZUS1-CgGalo-1)"},{"$f":"REFERENTES!S84","v":48753}]
[null,null,null,null,null,null,null,null,null,null,null,null,{"$f":"IF(ISNUMBER(FIND(\"RES\",REFERENTES!$Q$628:$Q$1125,1)),REFERENTES!Q727,\"\")","v":""},{"$f":"REFERENTES!S106","v":58072},101,0,1131,"X",null,null,null,null,null,null,null,null,null,{"$f":"CONCATENATE(REFERENTES!Q85,\"(\",REFERENTES!R85,\")\")","v":"Ciénaga Manzanillo-1(MABA-ZP1-Manzanillo-1)"},{"$f":"REFERENTES!S85","v":49325}]
[null,null,null,null,null,null,null,null,null,null,null,null,{"$f":"IF(ISNUMBER(FIND(\"RES\",REFERENTES!$Q$628:$Q$1125,1)),REFERENTES!Q728,\"\")","v":""},{"$f":"REFERENTES!S107","v":58073},102,0,1131,"X",null,null,null,null,null,null,null,null,null,{"$f":"CONCATENATE(REFERENTES!Q86,\"(\",REFERENTES!R86,\")\")","v":"Ciénaga Mestizos-1(BCISLIT-ZP1-CgMestizo-1)"},{"$f":"REFERENTES!S86","v":48766}]
[null,null,null,null,null,null,null,null,null,null,null,null,{"$f":"IF(ISNUMBER(FIND(\"RES\",REFERENTES!$Q$628:$Q$1125,1)),REFERENTES!Q729,\"\")","v":""},{"$f":"REFERENTES!S108","v":58074},103,0,1131,"X",null,null,null,null,null,null,null,null,null,{"$f":"CONCATENATE(REFERENTES!Q87,\"(\",REFERENTES!R87,\")\")","v":"Ciénaga Ostional-1(BCISEST-ZUS2-ostional-1)"},{"$f":"REFERENTES!S87","v":45121}]
[null,null,null,null,null,null,null,null,null,null,null,null,{"$f":"IF(ISNUMBER(FIND(\"RES\",REFERENTES!$Q$628:$Q$1125,1)),REFERENTES!Q730,\"\")","v":""},{"$f":"REFERENTES!S109","v":58064},104,0,1131,"X",null,null,null,null,null,null,null,null,null,{"$f":"CONCATENATE(REFERENTES!Q88,\"(\",REFERENTES!R88,\")\")","v":"Ciénaga Remedia Pobre-1(BCISEST-ZUS1-remediapobre-1)"},{"$f":"REFERENTES!S88","v":45136}]
[null,null,null,null,null,null,null,null,null,null,null,null,{"$f":"IF(ISNUMBER(FIND(\"RES\",REFERENTES!$Q$628:$Q$1125,1)),REFERENTES!Q731,\"\")","v":""},{"$f":"REFERENTES!S110","v":58065},105,0,1131,"X",null,null,null,null,null,null,null,null,null,{"$f":"CONCATENATE(REFERENTES!Q89,\"(\",REFERENTES!R89,\")\")","v":"Ciénaga Rincon Grillo-1(BCISEST-ZUS4-elgrillo-1)"},{"$f":"REFERENTES!S89","v":45125}]
[null,null,null,null,null,null,null,null,null,null,null,null,{"$f":"IF(ISNUMBER(FIND(\"RES\",REFERENTES!$Q$628:$Q$1125,1)),REFERENTES!Q732,\"\")","v":""},{"$f":"REFERENTES!S111","v":58066},106,0,1131,"X",null,null,null,null,null,null,null,null,null,{"$f":"CONCATENATE(REFERENTES!Q90,\"(\",REFERENTES!R90,\")\")","v":"Ciénaga Soledad(BCISEST-ZR1-soledad-1)"},{"$f":"REFERENTES!S90","v":45142}]
[null,null,null,null,null,null,null,null,null,null,null,null,{"$f":"IF(ISNUMBER(FIND(\"RES\",REFERENTES!$Q$628:$Q$1125,1)),REFERENTES!Q733,\"\")","v":""},{"$f":"REFERENTES!S112","v":45330},107,0,1131,"X",null,null,null,null,null,null,null,null,null,{"$f":"CONCATENATE(REFERENTES!Q91,\"(\",REFERENTES!R91,\")\")","v":"Ciénaga la Balsa-1(BCISLIT-ZUS1-CñBalsa-1)"},{"$f":"REFERENTES!S91","v":48769}]
[null,null,null,null,null,null,null,null,null,null,null,null,{"$f":"IF(ISNUMBER(FIND(\"RES\",REFERENTES!$Q$628:$Q$1125,1)),REFERENTES!Q734,\"\")","v":""},{"$f":"REFERENTES!S113","v":45326},108,0,1131,"X",null,null,null,null,null,null,null,null,null,{"$f":"CONCATENATE(REFERENTES!Q92,\"(\",REFERENTES!R92,\")\")","v":"Cocoplum B-1(COCO-ZP1-CO-1)"},{"$f":"REFERENTES!S92","v":41479}]
[null,null,null,null,null,null,null,null,null,null,null,null,{"$f":"IF(ISNUMBER(FIND(\"RES\",REFERENTES!$Q$628:$Q$1125,1)),REFERENTES!Q735,\"\")","v":""},{"$f":"REFERENTES!S114","v":45332},109,0,1131,"X",null,null,null,null,null,null,null,null,null,{"$f":"CONCATENATE(REFERENTES!Q93,\"(\",REFERENTES!R93,\")\")","v":"Cocoplum parcela circular-2(CocoplumPPC-2)"},{"$f":"REFERENTES!S93","v":55552}]
[null,null,null,null,null,null,null,null,null,null,null,null,{"$f":"IF(ISNUMBER(FIND(\"RES\",REFERENTES!$Q$628:$Q$1125,1)),REFERENTES!Q736,\"\")","v":""},{"$f":"REFERENTES!S115","v":44635},110,0,1131,"X",null,null,null,null,null,null,null,null,null,{"$f":"CONCATENATE(REFERENTES!Q94,\"(\",REFERENTES!R94,\")\")","v":"Cocoplum parcela circular-3(CocoplumPPC-3)"},{"$f":"REFERENTES!S94","v":55553}]
[null,null,null,null,null,null,null,null,null,null,null,null,{"$f":"IF(ISNUMBER(FIND(\"RES\",REFERENTES!$Q$628:$Q$1125,1)),REFERENTES!Q737,\"\")","v":""},{"$f":"REFERENTES!S116","v":45012},111,0,1131,"X",null,null,null,null,null,null,null,null,null,{"$f":"CONCATENATE(REFERENTES!Q95,\"(\",REFERENTES!R95,\")\")","v":"Concho(Curch-ZUS1-Concho-1)"},{"$f":"REFERENTES!S95","v":45429}]
[null,null,null,null,null,null,null,null,null,null,null,null,{"$f":"IF(ISNUMBER(FIND(\"RES\",REFERENTES!$Q$628:$Q$1125,1)),REFERENTES!Q738,\"\")","v":""},{"$f":"REFERENTES!S117","v":48990},112,0,1131,"X",null,null,null,null,null,null,null,null,null,{"$f":"CONCATENATE(REFERENTES!Q96,\"(\",REFERENTES!R96,\")\")","v":"Concho(JURA-ZUS1-Concho-1)"},{"$f":"REFERENTES!S96","v":45575}]
[null,null,null,null,null,null,null,null,null,null,null,null,{"$f":"IF(ISNUMBER(FIND(\"RES\",REFERENTES!$Q$628:$Q$1125,1)),REFERENTES!Q739,\"\")","v":""},{"$f":"REFERENTES!S118","v":55556},113,0,1131,"X",null,null,null,null,null,null,null,null,null,{"$f":"CONCATENATE(REFERENTES!Q97,\"(\",REFERENTES!R97,\")\")","v":"Costa Verde P1(COR-ZP1-CtaVerde-1)"},{"$f":"REFERENTES!S97","v":45301}]
[null,null,null,null,null,null,null,null,null,null,null,null,{"$f":"IF(ISNUMBER(FIND(\"RES\",REFERENTES!$Q$628:$Q$1125,1)),REFERENTES!Q740,\"\")","v":""},{"$f":"REFERENTES!S119","v":44592},114,0,1131,"X",null,null,null,null,null,null,null,null,null,{"$f":"CONCATENATE(REFERENTES!Q98,\"(\",REFERENTES!R98,\")\")","v":"Costa Verde R1(COR-ZR1-CtaVerde-1)"},{"$f":"REFERENTES!S98","v":45297}]
[null,null,null,null,null,null,null,null,null,null,null,null,{"$f":"IF(ISNUMBER(FIND(\"RES\",REFERENTES!$Q$628:$Q$1125,1)),REFERENTES!Q741,\"\")","v":""},{"$f":"REFERENTES!S120","v":45905},115,0,1131,"X",null,null,null,null,null,null,null,null,null,{"$f":"CONCATENATE(REFERENTES!Q99,\"(\",REFERENTES!R99,\")\")","v":"Cuerval(CUER-ZP2-CUERVAL-1)"},{"$f":"REFERENTES!S99","v":45489}]
[null,null,null,null,null,null,null,null,null,null,null,null,{"$f":"IF(ISNUMBER(FIND(\"RES\",REFERENTES!$Q$628:$Q$1125,1)),REFERENTES!Q742,\"\")","v":""},{"$f":"REFERENTES!S121","v":45404},116,0,1131,"X",null,null,null,null,null,null,null,null,null,{"$f":"CONCATENATE(REFERENTES!Q100,\"(\",REFERENTES!R100,\")\")","v":"DCI CLARIN PARCELA1(DCI_P1)"},{"$f":"REFERENTES!S100","v":58076}]
[null,null,null,null,null,null,null,null,null,null,null,null,{"$f":"IF(ISNUMBER(FIND(\"RES\",REFERENTES!$Q$628:$Q$1125,1)),REFERENTES!Q743,\"\")","v":""},{"$f":"REFERENTES!S122","v":45318},117,0,1131,"X",null,null,null,null,null,null,null,null,null,{"$f":"CONCATENATE(REFERENTES!Q101,\"(\",REFERENTES!R101,\")\")","v":"DCI CLARIN PARCELA2(DCI_P2)"},{"$f":"REFERENTES!S101","v":58077}]
[null,null,null,null,null,null,null,null,null,null,null,null,{"$f":"IF(ISNUMBER(FIND(\"RES\",REFERENTES!$Q$628:$Q$1125,1)),REFERENTES!Q744,\"\")","v":""},{"$f":"REFERENTES!S123","v":45406},118,0,1131,"X",null,null,null,null,null,null,null,null,null,{"$f":"CONCATENATE(REFERENTES!Q102,\"(\",REFERENTES!R102,\")\")","v":"DCI CLARIN PARCELA3(DCI_P3)"},{"$f":"REFERENTES!S102","v":58078}]
[null,null,null,null,null,null,null,null,null,null,null,null,{"$f":"IF(ISNUMBER(FIND(\"RES\",REFERENTES!$Q$628:$Q$1125,1)),REFERENTES!Q745,\"\")","v":""},{"$f":"REFERENTES!S124","v":48578},119,0,1131,"X",null,null,null,null,null,null,null,null,null,{"$f":"CONCATENATE(REFERENTES!Q103,\"(\",REFERENTES!R103,\")\")","v":"DCI PARCELA1(DCI_P1)"},{"$f":"REFERENTES!S103","v":58060}]
[null,null,null,null,null,null,null,null,null,null,null,null,{"$f":"IF(ISNUMBER(FIND(\"RES\",REFERENTES!$Q$628:$Q$1125,1)),REFERENTES!Q746,\"\")","v":""},{"$f":"REFERENTES!S125","v":50305},120,0,1131,"X",null,null,null,null,null,null,null,null,null,{"$f":"CONCATENATE(REFERENTES!Q104,\"(\",REFERENTES!R104,\")\")","v":"DCI PARCELA2(DCI_P2)"},{"$f":"REFERENTES!S104","v":58061}]
[null,null,null,null,null,null,null,null,null,null,null,null,{"$f":"IF(ISNUMBER(FIND(\"RES\",REFERENTES!$Q$628:$Q$1125,1)),REFERENTES!Q747,\"\")","v":""},{"$f":"REFERENTES!S126","v":47534},121,0,1131,"X",null,null,null,null,null,null,null,null,null,{"$f":"CONCATENATE(REFERENTES!Q105,\"(\",REFERENTES!R105,\")\")","v":"DCI PARCELA3(DCI_P3)"},{"$f":"REFERENTES!S105","v":58062}]
[null,null,null,null,null,null,null,null,null,null,null,null,{"$f":"IF(ISNUMBER(FIND(\"RES\",REFERENTES!$Q$628:$Q$1125,1)),REFERENTES!Q748,\"\")","v":""},{"$f":"REFERENTES!S127","v":45832},122,0,1131,"X",null,null,null,null,null,null,null,null,null,{"$f":"CONCATENATE(REFERENTES!Q106,\"(\",REFERENTES!R106,\")\")","v":"DSI CLARIN PARCELA1(DSI_P1)"},{"$f":"REFERENTES!S106","v":58072}]
[null,null,null,null,null,null,null,null,null,null,null,null,{"$f":"IF(ISNUMBER(FIND(\"RES\",REFERENTES!$Q$628:$Q$1125,1)),REFERENTES!Q749,\"\")","v":""},{"$f":"REFERENTES!S128","v":47536},123,0,1131,"X",null,null,null,null,null,null,null,null,null,{"$f":"CONCATENATE(REFERENTES!Q107,\"(\",REFERENTES!R107,\")\")","v":"DSI CLARIN PARCELA2(DSI_P2)"},{"$f":"REFERENTES!S107","v":58073}]
[null,null,null,null,null,null,null,null,null,null,null,null,{"$f":"IF(ISNUMBER(FIND(\"RES\",REFERENTES!$Q$628:$Q$1125,1)),REFERENTES!Q750,\"\")","v":""},{"$f":"REFERENTES!S129","v":47510},124,0,1131,"X",null,null,null,null,null,null,null,null,null,{"$f":"CONCATENATE(REFERENTES!Q108,\"(\",REFERENTES!R108,\")\")","v":"DSI CLARIN PARCELA3(DSI_P3)"},{"$f":"REFERENTES!S108","v":58074}]
[null,null,null,null,null,null,null,null,null,null,null,null,{"$f":"IF(ISNUMBER(FIND(\"RES\",REFERENTES!$Q$628:$Q$1125,1)),REFERENTES!Q751,\"\")","v":""},{"$f":"REFERENTES!S130","v":47512},125,0,1131,"X",null,null,null,null,null,null,null,null,null,{"$f":"CONCATENATE(REFERENTES!Q109,\"(\",REFERENTES!R109,\")\")","v":"DSI PARCELA1(DSI_P1)"},{"$f":"REFERENTES!S109","v":58064}]
[null,null,null,null,null,null,null,null,null,null,null,null,{"$f":"IF(ISNUMBER(FIND(\"RES\",REFERENTES!$Q$628:$Q$1125,1)),REFERENTES!Q752,\"\")","v":""},{"$f":"REFERENTES!S131","v":46022},126,0,1131,"X",null,null,null,null,null,null,null,null,null,{"$f":"CONCATENATE(REFERENTES!Q110,\"(\",REFERENTES!R110,\")\")","v":"DSI PARCELA2(DSI_P2)"},{"$f":"REFERENTES!S110","v":58065}]
[null,null,null,null,null,null,null,null,null,null,null,null,{"$f":"IF(ISNUMBER(FIND(\"RES\",REFERENTES!$Q$628:$Q$1125,1)),REFERENTES!Q753,\"\")","v":""},{"$f":"REFERENTES!S132","v":45888},127,0,1131,"X",null,null,null,null,null,null,null,null,null,{"$f":"CONCATENATE(REFERENTES!Q111,\"(\",REFERENTES!R111,\")\")","v":"DSI PARCELA3(DSI_P3)"},{"$f":"REFERENTES!S111","v":58066}]
[null,null,null,null,null,null,null,null,null,null,null,null,{"$f":"IF(ISNUMBER(FIND(\"RES\",REFERENTES!$Q$628:$Q$1125,1)),REFERENTES!Q754,\"\")","v":""},{"$f":"REFERENTES!S133","v":42211},128,0,1131,"X",null,null,null,null,null,null,null,null,null,{"$f":"CONCATENATE(REFERENTES!Q112,\"(\",REFERENTES!R112,\")\")","v":"Don Diego(DDGO-ZR1-DnDieg-1)"},{"$f":"REFERENTES!S112","v":45330}]
[null,null,null,null,null,null,null,null,null,null,null,null,{"$f":"IF(ISNUMBER(FIND(\"RES\",REFERENTES!$Q$628:$Q$1125,1)),REFERENTES!Q755,\"\")","v":""},{"$f":"REFERENTES!S134","v":45339},129,0,1131,"X",null,null,null,null,null,null,null,null,null,{"$f":"CONCATENATE(REFERENTES!Q113,\"(\",REFERENTES!R113,\")\")","v":"Don Diego-1(DDGO-ZP2-DnDieg-1)"},{"$f":"REFERENTES!S113","v":45326}]
[null,null,null,null,null,null,null,null,null,null,null,null,{"$f":"IF(ISNUMBER(FIND(\"RES\",REFERENTES!$Q$628:$Q$1125,1)),REFERENTES!Q756,\"\")","v":""},{"$f":"REFERENTES!S135","v":45858},130,0,{"$f":"IF(P135=0,MAX($O$6:$O$1135)+1,O135)","v":1131},{"$f":"IFERROR(VLOOKUP(SMALL($Q$6:$Q$1135,O135),$O$6:$P$1135,2,FALSE),\"X\")","v":"X"},null,null,null,null,null,null,null,null,null,{"$f":"CONCATENATE(REFERENTES!Q114,\"(\",REFERENTES!R114,\")\")","v":"Don Diego-2(DDGO-ZR1-DnDieg-2)"},{"$f":"REFERENTES!S114","v":45332}]
[null,null,null,null,null,null,null,null,null,null,null,null,{"$f":"IF(ISNUMBER(FIND(\"RES\",REFERENTES!$Q$628:$Q$1125,1)),REFERENTES!Q757,\"\")","v":""},{"$f":"REFERENTES!S136","v":44561},131,0,1131,"X",null,null,null,null,null,null,null,null,null,{"$f":"CONCATENATE(REFERENTES!Q115,\"(\",REFERENTES!R115,\")\")","v":"E La Virgen(JPVI-ZR1-VirgenOriente-1)"},{"$f":"REFERENTES!S115","v":44635}]
[null,null,null,null,null,null,null,null,null,null,null,null,{"$f":"IF(ISNUMBER(FIND(\"RES\",REFERENTES!$Q$628:$Q$1125,1)),REFERENTES!Q758,\"\")","v":""},{"$f":"REFERENTES!S137","v":45852},132,{"$f":"IF(M137=\"\",0,M137)","v":0},1131,"X",null,null,null,null,null,null,null,null,null,{"$f":"CONCATENATE(REFERENTES!Q116,\"(\",REFERENTES!R116,\")\")","v":"El Claval(CCISinu-ZUS1-CLAVAL-1)"},{"$f":"REFERENTES!S116","v":45012}]
[null,null,null,null,null,null,null,null,null,null,null,null,{"$f":"IF(ISNUMBER(FIND(\"RES\",REFERENTES!$Q$628:$Q$1125,1)),REFERENTES!Q759,\"\")","v":""},{"$f":"REFERENTES!S138","v":58101},133,0,1131,"X",null,null,null,null,null,null,null,null,null,{"$f":"CONCATENATE(REFERENTES!Q117,\"(\",REFERENTES!R117,\")\")","v":"El Cove -1(ElCove-ZP1-Elcove-1)"},{"$f":"REFERENTES!S117","v":48990}]
[null,null,null,null,null,null,null,null,null,null,null,null,{"$f":"IF(ISNUMBER(FIND(\"RES\",REFERENTES!$Q$628:$Q$1125,1)),REFERENTES!Q760,\"\")","v":""},{"$f":"REFERENTES!S139","v":58125},134,0,1131,"X",null,null,null,null,null,null,null,null,null,{"$f":"CONCATENATE(REFERENTES!Q118,\"(\",REFERENTES!R118,\")\")","v":"El Cove parcela circular-2(ElCovePPC-2)"},{"$f":"REFERENTES!S118","v":55556}]
[null,null,null,null,null,null,null,null,null,null,null,null,{"$f":"IF(ISNUMBER(FIND(\"RES\",REFERENTES!$Q$628:$Q$1125,1)),REFERENTES!Q761,\"\")","v":""},{"$f":"REFERENTES!S140","v":44609},135,0,1131,"X",null,null,null,null,null,null,null,null,null,{"$f":"CONCATENATE(REFERENTES!Q119,\"(\",REFERENTES!R119,\")\")","v":"El Mohan-1(BARU-ZR1-Mohán-1)"},{"$f":"REFERENTES!S119","v":44592}]
[null,null,null,null,null,null,null,null,null,null,null,null,{"$f":"IF(ISNUMBER(FIND(\"RES\",REFERENTES!$Q$628:$Q$1125,1)),REFERENTES!Q762,\"\")","v":""},{"$f":"REFERENTES!S141","v":45281},136,0,1131,"X",null,null,null,null,null,null,null,null,null,{"$f":"CONCATENATE(REFERENTES!Q120,\"(\",REFERENTES!R120,\")\")","v":"El Muerto(ISCUANDE-ZR1-ELMUERTO-1)"},{"$f":"REFERENTES!S120","v":45905}]
[null,null,null,null,null,null,null,null,null,null,null,null,{"$f":"IF(ISNUMBER(FIND(\"RES\",REFERENTES!$Q$628:$Q$1125,1)),REFERENTES!Q763,\"\")","v":""},{"$f":"REFERENTES!S142","v":45283},137,0,1131,"X",null,null,null,null,null,null,null,null,null,{"$f":"CONCATENATE(REFERENTES!Q121,\"(\",REFERENTES!R121,\")\")","v":"Ensenada Miquitos(ENSENADA-ZP2-MIQUITOS-1MIQUITOSCURAY)"},{"$f":"REFERENTES!S121","v":45404}]
[null,null,null,null,null,null,null,null,null,null,null,null,{"$f":"IF(ISNUMBER(FIND(\"RES\",REFERENTES!$Q$628:$Q$1125,1)),REFERENTES!Q764,\"\")","v":""},{"$f":"REFERENTES!S143","v":45285},138,0,1131,"X",null,null,null,null,null,null,null,null,null,{"$f":"CONCATENATE(REFERENTES!Q122,\"(\",REFERENTES!R122,\")\")","v":"Ensenada Tribuga -1(Tribugá-ZP1-Enstrib-1)"},{"$f":"REFERENTES!S122","v":45318}]
[null,null,null,null,null,null,null,null,null,null,null,null,{"$f":"IF(ISNUMBER(FIND(\"RES\",REFERENTES!$Q$628:$Q$1125,1)),REFERENTES!Q765,\"\")","v":""},{"$f":"REFERENTES!S144","v":45151},139,0,1131,"X",null,null,null,null,null,null,null,null,null,{"$f":"CONCATENATE(REFERENTES!Q123,\"(\",REFERENTES!R123,\")\")","v":"Ensenada Tribuga -2(Tribugá-ZP1-Enstrib-2)"},{"$f":"REFERENTES!S123","v":45406}]
[null,null,null,null,null,null,null,null,null,null,null,null,{"$f":"IF(ISNUMBER(FIND(\"RES\",REFERENTES!$Q$628:$Q$1125,1)),REFERENTES!Q766,\"\")","v":""},{"$f":"REFERENTES!S145","v":55572},140,0,1131,"X",null,null,null,null,null,null,null,null,null,{"$f":"CONCATENATE(REFERENTES!Q124,\"(\",REFERENTES!R124,\")\")","v":"Ensenada de Rionegro -4(ERIO-ZP8-Errio-4)"},{"$f":"REFERENTES!S124","v":48578}]
[null,null,null,null,null,null,null,null,null,null,null,null,{"$f":"IF(ISNUMBER(FIND(\"RES\",REFERENTES!$Q$628:$Q$1125,1)),REFERENTES!Q767,\"\")","v":""},{"$f":"REFERENTES!S146","v":45907},141,0,1131,"X",null,null,null,null,null,null,null,null,null,{"$f":"CONCATENATE(REFERENTES!Q125,\"(\",REFERENTES!R125,\")\")","v":"Ensenada de Rionegro -5(ERIO-ZP8-Errio-5)"},{"$f":"REFERENTES!S125","v":50305}]
[null,null,null,null,null,null,null,null,null,null,null,null,{"$f":"IF(ISNUMBER(FIND(\"RES\",REFERENTES!$Q$628:$Q$1125,1)),REFERENTES!Q768,\"\")","v":""},{"$f":"REFERENTES!S147","v":45910},142,0,1131,"X",null,null,null,null,null,null,null,null,null,{"$f":"CONCATENATE(REFERENTES!Q126,\"(\",REFERENTES!R126,\")\")","v":"Estero Aguacate-1(BB-ZR2-EAg-1)"},{"$f":"REFERENTES!S126","v":47534}]
[null,null,null,null,null,null,null,null,null,null,null,null,{"$f":"IF(ISNUMBER(FIND(\"RES\",REFERENTES!$Q$628:$Q$1125,1)),REFERENTES!Q769,\"\")","v":""},{"$f":"REFERENTES!S148","v":45912},143,0,1131,"X",null,null,null,null,null,null,null,null,null,{"$f":"CONCATENATE(REFERENTES!Q127,\"(\",REFERENTES!R127,\")\")","v":"Estero Pasadero(YURU-ZP2-YEP-1)"},{"$f":"REFERENTES!S127","v":45832}]
[null,null,null,null,null,null,null,null,null,null,null,null,{"$f":"IF(ISNUMBER(FIND(\"RES\",REFERENTES!$Q$628:$Q$1125,1)),REFERENTES!Q770,\"\")","v":""},{"$f":"REFERENTES!S149","v":49587},144,0,1131,"X",null,null,null,null,null,null,null,null,null,{"$f":"CONCATENATE(REFERENTES!Q128,\"(\",REFERENTES!R128,\")\")","v":"Estero Piñal(BB-ZR2-EAg-2)"},{"$f":"REFERENTES!S128","v":47536}]
[null,null,null,null,null,null,null,null,null,null,null,null,{"$f":"IF(ISNUMBER(FIND(\"RES\",REFERENTES!$Q$628:$Q$1125,1)),REFERENTES!Q771,\"\")","v":""},{"$f":"REFERENTES!S150","v":45139},145,0,1131,"X",null,null,null,null,null,null,null,null,null,{"$f":"CONCATENATE(REFERENTES!Q129,\"(\",REFERENTES!R129,\")\")","v":"Estero San Antonio -1(Piñtcb-ZR1-EA-1)"},{"$f":"REFERENTES!S129","v":47510}]
[null,null,null,null,null,null,null,null,null,null,null,null,{"$f":"IF(ISNUMBER(FIND(\"RES\",REFERENTES!$Q$628:$Q$1125,1)),REFERENTES!Q772,\"\")","v":""},{"$f":"REFERENTES!S151","v":42198},146,0,1131,"X",null,null,null,null,null,null,null,null,null,{"$f":"CONCATENATE(REFERENTES!Q130,\"(\",REFERENTES!R130,\")\")","v":"Estero San Antonio -2(Piñtcb-ZR1-EA-2)"},{"$f":"REFERENTES!S130","v":47512}]
[null,null,null,null,null,null,null,null,null,null,null,null,{"$f":"IF(ISNUMBER(FIND(\"RES\",REFERENTES!$Q$628:$Q$1125,1)),REFERENTES!Q773,\"\")","v":""},{"$f":"REFERENTES!S152","v":45433},147,0,1131,"X",null,null,null,null,null,null,null,null,null,{"$f":"CONCATENATE(REFERENTES!Q131,\"(\",REFERENTES!R131,\")\")","v":"Estero San Miguel(RAPO-ZR1-ESaM-1)"},{"$f":"REFERENTES!S131","v":46022}]
[null,null,null,null,null,null,null,null,null,null,null,null,{"$f":"IF(ISNUMBER(FIND(\"RES\",REFERENTES!$Q$628:$Q$1125,1)),REFERENTES!Q774,\"\")","v":""},{"$f":"REFERENTES!S153","v":45579},148,0,1131,"X",null,null,null,null,null,null,null,null,null,{"$f":"CONCATENATE(REFERENTES!Q132,\"(\",REFERENTES!R132,\")\")","v":"Firme Bonito(ANCHI-ZR1-AFB-1)"},{"$f":"REFERENTES!S132","v":45888}]
[null,null,null,null,null,null,null,null,null,null,null,null,{"$f":"IF(ISNUMBER(FIND(\"RES\",REFERENTES!$Q$628:$Q$1125,1)),REFERENTES!Q775,\"\")","v":""},{"$f":"REFERENTES!S154","v":45133},149,0,1131,"X",null,null,null,null,null,null,null,null,null,{"$f":"CONCATENATE(REFERENTES!Q133,\"(\",REFERENTES!R133,\")\")","v":"Guacamayas(GUAC-ZP1-GUACA-1)"},{"$f":"REFERENTES!S133","v":42211}]
[null,null,null,null,null,null,null,null,null,null,null,null,{"$f":"IF(ISNUMBER(FIND(\"RES\",REFERENTES!$Q$628:$Q$1125,1)),REFERENTES!Q776,\"\")","v":""},{"$f":"REFERENTES!S155","v":45347},150,0,1131,"X",null,null,null,null,null,null,null,null,null,{"$f":"CONCATENATE(REFERENTES!Q134,\"(\",REFERENTES!R134,\")\")","v":"Guachaca-1(GUA-ZP4-Guachc-1)"},{"$f":"REFERENTES!S134","v":45339}]
[null,null,null,null,null,null,null,null,null,null,null,null,{"$f":"IF(ISNUMBER(FIND(\"RES\",REFERENTES!$Q$628:$Q$1125,1)),REFERENTES!Q777,\"\")","v":""},{"$f":"REFERENTES!S156","v":45586},151,0,1131,"X",null,null,null,null,null,null,null,null,null,{"$f":"CONCATENATE(REFERENTES!Q135,\"(\",REFERENTES!R135,\")\")","v":"Guadualito(DGUA-ZR3-DG-1)"},{"$f":"REFERENTES!S135","v":45858}]
[null,null,null,null,null,null,null,null,null,null,null,null,{"$f":"IF(ISNUMBER(FIND(\"RES\",REFERENTES!$Q$628:$Q$1125,1)),REFERENTES!Q778,\"\")","v":""},{"$f":"REFERENTES!S157","v":41384},152,0,1131,"X",null,null,null,null,null,null,null,null,null,{"$f":"CONCATENATE(REFERENTES!Q136,\"(\",REFERENTES!R136,\")\")","v":"Hojas Blancas(esza-ZUS1-Hoblan-1)"},{"$f":"REFERENTES!S136","v":44561}]
[null,null,null,null,null,null,null,null,null,null,null,null,{"$f":"IF(ISNUMBER(FIND(\"RES\",REFERENTES!$Q$628:$Q$1125,1)),REFERENTES!Q779,\"\")","v":""},{"$f":"REFERENTES!S158","v":41386},153,0,1131,"X",null,null,null,null,null,null,null,null,null,{"$f":"CONCATENATE(REFERENTES!Q137,\"(\",REFERENTES!R137,\")\")","v":"Humanes Mar(ANCHI-ZR1-AHM-1)"},{"$f":"REFERENTES!S137","v":45852}]
[null,null,null,null,null,null,null,null,null,null,null,null,{"$f":"IF(ISNUMBER(FIND(\"RES\",REFERENTES!$Q$628:$Q$1125,1)),REFERENTES!Q780,\"\")","v":""},{"$f":"REFERENTES!S159","v":41388},154,0,1131,"X",null,null,null,null,null,null,null,null,null,{"$f":"CONCATENATE(REFERENTES!Q138,\"(\",REFERENTES!R138,\")\")","v":"INICIO(INICIO_JON)"},{"$f":"REFERENTES!S138","v":58101}]
[null,null,null,null,null,null,null,null,null,null,null,null,{"$f":"IF(ISNUMBER(FIND(\"RES\",REFERENTES!$Q$628:$Q$1125,1)),REFERENTES!Q781,\"\")","v":""},{"$f":"REFERENTES!S160","v":42099},155,0,1131,"X",null,null,null,null,null,null,null,null,null,{"$f":"CONCATENATE(REFERENTES!Q139,\"(\",REFERENTES!R139,\")\")","v":"INICIO(INICIO_SAN)"},{"$f":"REFERENTES!S139","v":58125}]
[null,null,null,null,null,null,null,null,null,null,null,null,{"$f":"IF(ISNUMBER(FIND(\"RES\",REFERENTES!$Q$628:$Q$1125,1)),REFERENTES!Q782,\"\")","v":""},{"$f":"REFERENTES!S161","v":45484},156,0,1131,"X",null,null,null,null,null,null,null,null,null,{"$f":"CONCATENATE(REFERENTES!Q140,\"(\",REFERENTES!R140,\")\")","v":"Ingesa(BCAR-ZP1-Ingesa-1)"},{"$f":"REFERENTES!S140","v":44609}]
[null,null,null,null,null,null,null,null,null,null,null,null,{"$f":"IF(ISNUMBER(FIND(\"RES\",REFERENTES!$Q$628:$Q$1125,1)),REFERENTES!Q783,\"\")","v":""},{"$f":"REFERENTES!S162","v":41396},157,0,1131,"X",null,null,null,null,null,null,null,null,null,{"$f":"CONCATENATE(REFERENTES!Q141,\"(\",REFERENTES!R141,\")\")","v":"Isla Boqueron -1(CGSM-SZ1-IBoqrn-1)"},{"$f":"REFERENTES!S141","v":45281}]
[null,null,null,null,null,null,null,null,null,null,null,null,{"$f":"IF(ISNUMBER(FIND(\"RES\",REFERENTES!$Q$628:$Q$1125,1)),REFERENTES!Q784,\"\")","v":""},{"$f":"REFERENTES!S163","v":44496},158,0,1131,"X",null,null,null,null,null,null,null,null,null,{"$f":"CONCATENATE(REFERENTES!Q142,\"(\",REFERENTES!R142,\")\")","v":"Isla Boqueron -2(CGSM-SZ1-IBoqrn-2)"},{"$f":"REFERENTES!S142","v":45283}]
[null,null,null,null,null,null,null,null,null,null,null,null,{"$f":"IF(ISNUMBER(FIND(\"RES\",REFERENTES!$Q$628:$Q$1125,1)),REFERENTES!Q785,\"\")","v":""},{"$f":"REFERENTES!S164","v":44616},159,0,1131,"X",null,null,null,null,null,null,null,null,null,{"$f":"CONCATENATE(REFERENTES!Q143,\"(\",REFERENTES!R143,\")\")","v":"Isla Boqueron -3(CGSM-SZ1-IBoqrn-3)"},{"$f":"REFERENTES!S143","v":45285}]
[null,null,null,null,null,null,null,null,null,null,null,null,{"$f":"IF(ISNUMBER(FIND(\"RES\",REFERENTES!$Q$628:$Q$1125,1)),REFERENTES!Q786,\"\")","v":""},{"$f":"REFERENTES!S165","v":41972},160,0,1131,"X",null,null,null,null,null,null,null,null,null,{"$f":"CONCATENATE(REFERENTES!Q144,\"(\",REFERENTES!R144,\")\")","v":"Jesus Primera(BCISEST-ZUS1-Jesúsprimera-1)"},{"$f":"REFERENTES!S144","v":45151}]
[null,null,null,null,null,null,null,null,null,null,null,null,{"$f":"IF(ISNUMBER(FIND(\"RES\",REFERENTES!$Q$628:$Q$1125,1)),REFERENTES!Q787,\"\")","v":""},{"$f":"REFERENTES!S166","v":45922},161,0,1131,"X",null,null,null,null,null,null,null,null,null,{"$f":"CONCATENATE(REFERENTES!Q145,\"(\",REFERENTES!R145,\")\")","v":"Jhon Mangrove parcela circular-3(JhonMangrovePPC-1)"},{"$f":"REFERENTES!S145","v":55572}]
[null,null,null,null,null,null,null,null,null,null,null,null,{"$f":"IF(ISNUMBER(FIND(\"RES\",REFERENTES!$Q$628:$Q$1125,1)),REFERENTES!Q788,\"\")","v":""},{"$f":"REFERENTES!S167","v":47837},162,0,1131,"X",null,null,null,null,null,null,null,null,null,{"$f":"CONCATENATE(REFERENTES!Q146,\"(\",REFERENTES!R146,\")\")","v":"Kilómetro 22 -1(VIPIS-SZ1-KM22-1)"},{"$f":"REFERENTES!S146","v":45907}]
[null,null,null,null,null,null,null,null,null,null,null,null,{"$f":"IF(ISNUMBER(FIND(\"RES\",REFERENTES!$Q$628:$Q$1125,1)),REFERENTES!Q789,\"\")","v":""},{"$f":"REFERENTES!S168","v":47839},163,0,1131,"X",null,null,null,null,null,null,null,null,null,{"$f":"CONCATENATE(REFERENTES!Q147,\"(\",REFERENTES!R147,\")\")","v":"Kilómetro 22 -2(VIPIS-SZ1-KM22-2)"},{"$f":"REFERENTES!S147","v":45910}]
[null,null,null,null,null,null,null,null,null,null,null,null,{"$f":"IF(ISNUMBER(FIND(\"RES\",REFERENTES!$Q$628:$Q$1125,1)),REFERENTES!Q790,\"\")","v":""},{"$f":"REFERENTES!S169","v":58095},164,0,1131,"X",null,null,null,null,null,null,null,null,null,{"$f":"CONCATENATE(REFERENTES!Q148,\"(\",REFERENTES!R148,\")\")","v":"Kilómetro 22 -3(VIPIS-SZ1-KM22-3)"},{"$f":"REFERENTES!S148","v":45912}]
[null,null,null,null,null,null,null,null,null,null,null,null,{"$f":"IF(ISNUMBER(FIND(\"RES\",REFERENTES!$Q$628:$Q$1125,1)),REFERENTES!Q791,\"\")","v":""},{"$f":"REFERENTES!S170","v":45168},165,0,1131,"X",null,null,null,null,null,null,null,null,null,{"$f":"CONCATENATE(REFERENTES!Q149,\"(\",REFERENTES!R149,\")\")","v":"LAGO(OBRE;CHA-SZ1-LAGO-1)"},{"$f":"REFERENTES!S149","v":49587}]
[null,null,null,null,null,null,null,null,null,null,null,null,{"$f":"IF(ISNUMBER(FIND(\"RES\",REFERENTES!$Q$628:$Q$1125,1)),REFERENTES!Q792,\"\")","v":""},{"$f":"REFERENTES!S171","v":45242},166,0,1131,"X",null,null,null,null,null,null,null,null,null,{"$f":"CONCATENATE(REFERENTES!Q150,\"(\",REFERENTES!R150,\")\")","v":"La Alberca(BCISEST-ZUS1-laalberca-1)"},{"$f":"REFERENTES!S150","v":45139}]
[null,null,null,null,null,null,null,null,null,null,null,null,{"$f":"IF(ISNUMBER(FIND(\"RES\",REFERENTES!$Q$628:$Q$1125,1)),REFERENTES!Q793,\"\")","v":""},{"$f":"REFERENTES!S172","v":45253},167,0,1131,"X",null,null,null,null,null,null,null,null,null,{"$f":"CONCATENATE(REFERENTES!Q151,\"(\",REFERENTES!R151,\")\")","v":"La Boquilla(CBOQ-ZR1-BOQU-1)"},{"$f":"REFERENTES!S151","v":42198}]
[null,null,null,null,null,null,null,null,null,null,null,null,{"$f":"IF(ISNUMBER(FIND(\"RES\",REFERENTES!$Q$628:$Q$1125,1)),REFERENTES!Q794,\"\")","v":""},{"$f":"REFERENTES!S173","v":41959},168,0,1131,"X",null,null,null,null,null,null,null,null,null,{"$f":"CONCATENATE(REFERENTES!Q152,\"(\",REFERENTES!R152,\")\")","v":"La Calle(Curch-ZP1-Lacalle-1)"},{"$f":"REFERENTES!S152","v":45433}]
[null,null,null,null,null,null,null,null,null,null,null,null,{"$f":"IF(ISNUMBER(FIND(\"RES\",REFERENTES!$Q$628:$Q$1125,1)),REFERENTES!Q795,\"\")","v":""},{"$f":"REFERENTES!S174","v":41963},169,0,1131,"X",null,null,null,null,null,null,null,null,null,{"$f":"CONCATENATE(REFERENTES!Q153,\"(\",REFERENTES!R153,\")\")","v":"La Calle(JURA-ZP1-Laca-1)"},{"$f":"REFERENTES!S153","v":45579}]
[null,null,null,null,null,null,null,null,null,null,null,null,{"$f":"IF(ISNUMBER(FIND(\"RES\",REFERENTES!$Q$628:$Q$1125,1)),REFERENTES!Q796,\"\")","v":""},{"$f":"REFERENTES!S175","v":55561},170,0,1131,"X",null,null,null,null,null,null,null,null,null,{"$f":"CONCATENATE(REFERENTES!Q154,\"(\",REFERENTES!R154,\")\")","v":"La Camaronera(BCISEST-ZR1-camaronera-1)"},{"$f":"REFERENTES!S154","v":45133}]
[null,null,null,null,null,null,null,null,null,null,null,null,{"$f":"IF(ISNUMBER(FIND(\"RES\",REFERENTES!$Q$628:$Q$1125,1)),REFERENTES!Q797,\"\")","v":""},{"$f":"REFERENTES!S176","v":55562},171,0,1131,"X",null,null,null,null,null,null,null,null,null,{"$f":"CONCATENATE(REFERENTES!Q155,\"(\",REFERENTES!R155,\")\")","v":"La Cuenca(BCISEST-ZUS6-lacuenca-1)"},{"$f":"REFERENTES!S155","v":45347}]
[null,null,null,null,null,null,null,null,null,null,null,null,{"$f":"IF(ISNUMBER(FIND(\"RES\",REFERENTES!$Q$628:$Q$1125,1)),REFERENTES!Q798,\"\")","v":""},{"$f":"REFERENTES!S177","v":44640},172,0,1131,"X",null,null,null,null,null,null,null,null,null,{"$f":"CONCATENATE(REFERENTES!Q156,\"(\",REFERENTES!R156,\")\")","v":"La Flotante(BCISEST-ZUS1-laflotante-1)"},{"$f":"REFERENTES!S156","v":45586}]
[null,null,null,null,null,null,null,null,null,null,null,null,{"$f":"IF(ISNUMBER(FIND(\"RES\",REFERENTES!$Q$628:$Q$1125,1)),REFERENTES!Q799,\"\")","v":""},{"$f":"REFERENTES!S178","v":42003},173,0,1131,"X",null,null,null,null,null,null,null,null,null,{"$f":"CONCATENATE(REFERENTES!Q157,\"(\",REFERENTES!R157,\")\")","v":"La Raya(LRAY-ZR1-LRA-1)"},{"$f":"REFERENTES!S157","v":41384}]
[null,null,null,null,null,null,null,null,null,null,null,null,{"$f":"IF(ISNUMBER(FIND(\"RES\",REFERENTES!$Q$628:$Q$1125,1)),REFERENTES!Q800,\"\")","v":""},{"$f":"REFERENTES!S179","v":41378},174,0,1131,"X",null,null,null,null,null,null,null,null,null,{"$f":"CONCATENATE(REFERENTES!Q158,\"(\",REFERENTES!R158,\")\")","v":"La Raya-2(LRAY-ZR1-LRA-2)"},{"$f":"REFERENTES!S158","v":41386}]
[null,null,null,null,null,null,null,null,null,null,null,null,{"$f":"IF(ISNUMBER(FIND(\"RES\",REFERENTES!$Q$628:$Q$1125,1)),REFERENTES!Q801,\"\")","v":""},{"$f":"REFERENTES!S180","v":41380},175,0,1131,"X",null,null,null,null,null,null,null,null,null,{"$f":"CONCATENATE(REFERENTES!Q159,\"(\",REFERENTES!R159,\")\")","v":"La Raya-3(LRAY-ZR1-LRA-3)"},{"$f":"REFERENTES!S159","v":41388}]
[null,null,null,null,null,null,null,null,null,null,null,null,{"$f":"IF(ISNUMBER(FIND(\"RES\",REFERENTES!$Q$628:$Q$1125,1)),REFERENTES!Q802,\"\")","v":""},{"$f":"REFERENTES!S181","v":41382},176,0,1131,"X",null,null,null,null,null,null,null,null,null,{"$f":"CONCATENATE(REFERENTES!Q160,\"(\",REFERENTES!R160,\")\")","v":"La Zona(BCISESTSAL-ZUS1-ZON-1)"},{"$f":"REFERENTES!S160","v":42099}]
[null,null,null,null,null,null,null,null,null,null,null,null,{"$f":"IF(ISNUMBER(FIND(\"RES\",REFERENTES!$Q$628:$Q$1125,1)),REFERENTES!Q803,\"\")","v":""},{"$f":"REFERENTES!S182","v":55569},177,0,1131,"X",null,null,null,null,null,null,null,null,null,{"$f":"CONCATENATE(REFERENTES!Q161,\"(\",REFERENTES!R161,\")\")","v":"Lagartero(TIMB-ZUS1-LARGAR-1)"},{"$f":"REFERENTES!S161","v":45484}]
[null,null,null,null,null,null,null,null,null,null,null,null,{"$f":"IF(ISNUMBER(FIND(\"RES\",REFERENTES!$Q$628:$Q$1125,1)),REFERENTES!Q804,\"\")","v":""},{"$f":"REFERENTES!S183","v":55570},178,0,1131,"X",null,null,null,null,null,null,null,null,null,{"$f":"CONCATENATE(REFERENTES!Q162,\"(\",REFERENTES!R162,\")\")","v":"Laguna Salada(LSAL-ZR1-LSA-1)"},{"$f":"REFERENTES!S162","v":41396}]
[null,null,null,null,null,null,null,null,null,null,null,null,{"$f":"IF(ISNUMBER(FIND(\"RES\",REFERENTES!$Q$628:$Q$1125,1)),REFERENTES!Q805,\"\")","v":""},{"$f":"REFERENTES!S184","v":55571},179,0,1131,"X",null,null,null,null,null,null,null,null,null,{"$f":"CONCATENATE(REFERENTES!Q163,\"(\",REFERENTES!R163,\")\")","v":"Las Piedras-1(BARB-ZR1-Piedras-1)"},{"$f":"REFERENTES!S163","v":44496}]
[null,null,null,null,null,null,null,null,null,null,null,null,{"$f":"IF(ISNUMBER(FIND(\"RES\",REFERENTES!$Q$628:$Q$1125,1)),REFERENTES!Q806,\"\")","v":""},{"$f":"REFERENTES!S185","v":45583},180,0,1131,"X",null,null,null,null,null,null,null,null,null,{"$f":"CONCATENATE(REFERENTES!Q164,\"(\",REFERENTES!R164,\")\")","v":"Las Quintas-1(CQUINTAS-ZUS1-Quintas-1)"},{"$f":"REFERENTES!S164","v":44616}]
[null,null,null,null,null,null,null,null,null,null,null,null,{"$f":"IF(ISNUMBER(FIND(\"RES\",REFERENTES!$Q$628:$Q$1125,1)),REFERENTES!Q807,\"\")","v":""},{"$f":"REFERENTES!S186","v":45411},181,0,1131,"X",null,null,null,null,null,null,null,null,null,{"$f":"CONCATENATE(REFERENTES!Q165,\"(\",REFERENTES!R165,\")\")","v":"Lucho Guerra-1(CaiRinH-ZP1-LUCHO-1)"},{"$f":"REFERENTES!S165","v":41972}]
[null,null,null,null,null,null,null,null,null,null,null,null,{"$f":"IF(ISNUMBER(FIND(\"RES\",REFERENTES!$Q$628:$Q$1125,1)),REFERENTES!Q808,\"\")","v":""},{"$f":"REFERENTES!S187","v":45413},182,0,1131,"X",null,null,null,null,null,null,null,null,null,{"$f":"CONCATENATE(REFERENTES!Q166,\"(\",REFERENTES!R166,\")\")","v":"Luna -1(SFFOCC-SZ1-LUN-1)"},{"$f":"REFERENTES!S166","v":45922}]
[null,null,null,null,null,null,null,null,null,null,null,null,{"$f":"IF(ISNUMBER(FIND(\"RES\",REFERENTES!$Q$628:$Q$1125,1)),REFERENTES!Q809,\"\")","v":""},{"$f":"REFERENTES!S188","v":45874},183,0,1131,"X",null,null,null,null,null,null,null,null,null,{"$f":"CONCATENATE(REFERENTES!Q167,\"(\",REFERENTES!R167,\")\")","v":"Luna -2(SFFOCC-SZ1-LUN-2)"},{"$f":"REFERENTES!S167","v":47837}]
[null,null,null,null,null,null,null,null,null,null,null,null,{"$f":"IF(ISNUMBER(FIND(\"RES\",REFERENTES!$Q$628:$Q$1125,1)),REFERENTES!Q810,\"\")","v":""},{"$f":"REFERENTES!S189","v":58103},184,0,1131,"X",null,null,null,null,null,null,null,null,null,{"$f":"CONCATENATE(REFERENTES!Q168,\"(\",REFERENTES!R168,\")\")","v":"Luna -3(SFFOCC-SZ1-LUN-3)"},{"$f":"REFERENTES!S168","v":47839}]
[null,null,null,null,null,null,null,null,null,null,null,null,{"$f":"IF(ISNUMBER(FIND(\"RES\",REFERENTES!$Q$628:$Q$1125,1)),REFERENTES!Q811,\"\")","v":""},{"$f":"REFERENTES!S190","v":58127},185,0,1131,"X",null,null,null,null,null,null,null,null,null,{"$f":"CONCATENATE(REFERENTES!Q169,\"(\",REFERENTES!R169,\")\")","v":"MANZANILLO(MANZANILLO)"},{"$f":"REFERENTES!S169","v":58095}]
[null,null,null,null,null,null,null,null,null,null,null,null,{"$f":"IF(ISNUMBER(FIND(\"RES\",REFERENTES!$Q$628:$Q$1125,1)),REFERENTES!Q812,\"\")","v":""},{"$f":"REFERENTES!S191","v":41463},186,0,1131,"X",null,null,null,null,null,null,null,null,null,{"$f":"CONCATENATE(REFERENTES!Q170,\"(\",REFERENTES!R170,\")\")","v":"Mallorquin(CNGMLLQ-ZR1-Mr-1)"},{"$f":"REFERENTES!S170","v":45168}]
[null,null,null,null,null,null,null,null,null,null,null,null,{"$f":"IF(ISNUMBER(FIND(\"RES\",REFERENTES!$Q$628:$Q$1125,1)),REFERENTES!Q813,\"\")","v":""},{"$f":"REFERENTES!S192","v":51437},187,0,1131,"X",null,null,null,null,null,null,null,null,null,{"$f":"CONCATENATE(REFERENTES!Q171,\"(\",REFERENTES!R171,\")\")","v":"Mallorquín(CNGMLLQ-ZP1-Mallorq-1)"},{"$f":"REFERENTES!S171","v":45242}]
[null,null,null,null,null,null,null,null,null,null,null,null,{"$f":"IF(ISNUMBER(FIND(\"RES\",REFERENTES!$Q$628:$Q$1125,1)),REFERENTES!Q814,\"\")","v":""},{"$f":"REFERENTES!S193","v":55563},188,0,1131,"X",null,null,null,null,null,null,null,null,null,{"$f":"CONCATENATE(REFERENTES!Q172,\"(\",REFERENTES!R172,\")\")","v":"ManatIes Playa(CNGMNT-ZR1-Manat-1)"},{"$f":"REFERENTES!S172","v":45253}]
[null,null,null,null,null,null,null,null,null,null,null,null,{"$f":"IF(ISNUMBER(FIND(\"RES\",REFERENTES!$Q$628:$Q$1125,1)),REFERENTES!Q815,\"\")","v":""},{"$f":"REFERENTES!S194","v":55564},189,0,1131,"X",null,null,null,null,null,null,null,null,null,{"$f":"CONCATENATE(REFERENTES!Q173,\"(\",REFERENTES!R173,\")\")","v":"Manaties -ZR1-1(CNGMNT-ZR1-MANA-1)"},{"$f":"REFERENTES!S173","v":41959}]
[null,null,null,null,null,null,null,null,null,null,null,null,{"$f":"IF(ISNUMBER(FIND(\"RES\",REFERENTES!$Q$628:$Q$1125,1)),REFERENTES!Q816,\"\")","v":""},{"$f":"REFERENTES!S195","v":48747},190,0,1131,"X",null,null,null,null,null,null,null,null,null,{"$f":"CONCATENATE(REFERENTES!Q174,\"(\",REFERENTES!R174,\")\")","v":"Manaties B(CNGMNT-ZP1-MANB-1)"},{"$f":"REFERENTES!S174","v":41963}]
[null,null,null,null,null,null,null,null,null,null,null,null,{"$f":"IF(ISNUMBER(FIND(\"RES\",REFERENTES!$Q$628:$Q$1125,1)),REFERENTES!Q817,\"\")","v":""},{"$f":"REFERENTES!S196","v":58085},191,0,1131,"X",null,null,null,null,null,null,null,null,null,{"$f":"CONCATENATE(REFERENTES!Q175,\"(\",REFERENTES!R175,\")\")","v":"Manzanillo parcela circular-1(ManzanilloPPC-1)"},{"$f":"REFERENTES!S175","v":55561}]
[null,null,null,null,null,null,null,null,null,null,null,null,{"$f":"IF(ISNUMBER(FIND(\"RES\",REFERENTES!$Q$628:$Q$1125,1)),REFERENTES!Q818,\"\")","v":""},{"$f":"REFERENTES!S197","v":58094},192,0,1131,"X",null,null,null,null,null,null,null,null,null,{"$f":"CONCATENATE(REFERENTES!Q176,\"(\",REFERENTES!R176,\")\")","v":"Manzanillo parcela circular-2(ManzanilloPPC-2)"},{"$f":"REFERENTES!S176","v":55562}]
[null,null,null,null,null,null,null,null,null,null,null,null,{"$f":"IF(ISNUMBER(FIND(\"RES\",REFERENTES!$Q$628:$Q$1125,1)),REFERENTES!Q819,\"\")","v":""},{"$f":"REFERENTES!S198","v":58086},193,0,1131,"X",null,null,null,null,null,null,null,null,null,{"$f":"CONCATENATE(REFERENTES!Q177,\"(\",REFERENTES!R177,\")\")","v":"Manzanillo-1(JPVI-ZUS1-JPManzanillo-1)"},{"$f":"REFERENTES!S177","v":44640}]
[null,null,null,null,null,null,null,null,null,null,null,null,{"$f":"IF(ISNUMBER(FIND(\"RES\",REFERENTES!$Q$628:$Q$1125,1)),REFERENTES!Q820,\"\")","v":""},{"$f":"REFERENTES!S199","v":58087},194,0,{"$f":"IF(P199=0,MAX($O$6:$O$1135)+1,O199)","v":1131},{"$f":"IFERROR(VLOOKUP(SMALL($Q$6:$Q$1135,O199),$O$6:$P$1135,2,FALSE),\"X\")","v":"X"},null,null,null,null,null,null,null,null,null,{"$f":"CONCATENATE(REFERENTES!Q178,\"(\",REFERENTES!R178,\")\")","v":"Matunilla(BARB-ZR1-MATU-1)"},{"$f":"REFERENTES!S178","v":42003}]
[null,null,null,null,null,null,null,null,null,null,null,null,{"$f":"IF(ISNUMBER(FIND(\"RES\",REFERENTES!$Q$628:$Q$1125,1)),REFERENTES!Q821,\"\")","v":""},{"$f":"REFERENTES!S200","v":58088},195,0,1131,"X",null,null,null,null,null,null,null,null,null,{"$f":"CONCATENATE(REFERENTES!Q179,\"(\",REFERENTES!R179,\")\")","v":"Mayapo(MAYA-ZR1-MA-1)"},{"$f":"REFERENTES!S179","v":41378}]
[null,null,null,null,null,null,null,null,null,null,null,null,{"$f":"IF(ISNUMBER(FIND(\"RES\",REFERENTES!$Q$628:$Q$1125,1)),REFERENTES!Q822,\"\")","v":""},{"$f":"REFERENTES!S201","v":58089},196,{"$f":"IF(M201=\"\",0,M201)","v":0},1131,"X",null,null,null,null,null,null,null,null,null,{"$f":"CONCATENATE(REFERENTES!Q180,\"(\",REFERENTES!R180,\")\")","v":"Mayapo-2(MAYA-ZR1-MA-2)"},{"$f":"REFERENTES!S180","v":41380}]
[null,null,null,null,null,null,null,null,null,null,null,null,{"$f":"IF(ISNUMBER(FIND(\"RES\",REFERENTES!$Q$628:$Q$1125,1)),REFERENTES!Q823,\"\")","v":""},{"$f":"REFERENTES!S202","v":58090},197,0,1131,"X",null,null,null,null,null,null,null,null,null,{"$f":"CONCATENATE(REFERENTES!Q181,\"(\",REFERENTES!R181,\")\")","v":"Mayapo-3(MAYA-ZR1-MA-3)"},{"$f":"REFERENTES!S181","v":41382}]
[null,null,null,null,null,null,null,null,null,null,null,null,{"$f":"IF(ISNUMBER(FIND(\"RES\",REFERENTES!$Q$628:$Q$1125,1)),REFERENTES!Q824,\"\")","v":""},{"$f":"REFERENTES!S203","v":58091},198,0,1131,"X",null,null,null,null,null,null,null,null,null,{"$f":"CONCATENATE(REFERENTES!Q182,\"(\",REFERENTES!R182,\")\")","v":"Mc Bean parcela circular-1(McBeanLagoonPPC-1)"},{"$f":"REFERENTES!S182","v":55569}]
[null,null,null,null,null,null,null,null,null,null,null,null,{"$f":"IF(ISNUMBER(FIND(\"RES\",REFERENTES!$Q$628:$Q$1125,1)),REFERENTES!Q825,\"\")","v":""},{"$f":"REFERENTES!S204","v":58092},199,0,1131,"X",null,null,null,null,null,null,null,null,null,{"$f":"CONCATENATE(REFERENTES!Q183,\"(\",REFERENTES!R183,\")\")","v":"Mc Bean parcela circular-2(McBeanLagoonPPC-2)"},{"$f":"REFERENTES!S183","v":55570}]
[null,null,null,null,null,null,null,null,null,null,null,null,{"$f":"IF(ISNUMBER(FIND(\"RES\",REFERENTES!$Q$628:$Q$1125,1)),REFERENTES!Q826,\"\")","v":""},{"$f":"REFERENTES!S205","v":58093},200,0,1131,"X",null,null,null,null,null,null,null,null,null,{"$f":"CONCATENATE(REFERENTES!Q184,\"(\",REFERENTES!R184,\")\")","v":"Mc Bean parcela circular-3(McBeanLagoonPPC-3)"},{"$f":"REFERENTES!S184","v":55571}]
[null,null,null,null,null,null,null,null,null,null,null,null,{"$f":"IF(ISNUMBER(FIND(\"RES\",REFERENTES!$Q$628:$Q$1125,1)),REFERENTES!Q827,\"\")","v":""},{"$f":"REFERENTES!S206","v":42123},201,0,1131,"X",null,null,null,null,null,null,null,null,null,{"$f":"CONCATENATE(REFERENTES!Q185,\"(\",REFERENTES!R185,\")\")","v":"Muertero(Nuqui-ZR2-Mtero-1)"},{"$f":"REFERENTES!S185","v":45583}]
[null,null,null,null,null,null,null,null,null,null,null,null,{"$f":"IF(ISNUMBER(FIND(\"RES\",REFERENTES!$Q$628:$Q$1125,1)),REFERENTES!Q828,\"\")","v":""},{"$f":"REFERENTES!S207","v":46020},202,0,1131,"X",null,null,null,null,null,null,null,null,null,{"$f":"CONCATENATE(REFERENTES!Q186,\"(\",REFERENTES!R186,\")\")","v":"Muertero(Panguí-ZR1-Mtero-1)"},{"$f":"REFERENTES!S186","v":45411}]
[null,null,null,null,null,null,null,null,null,null,null,null,{"$f":"IF(ISNUMBER(FIND(\"RES\",REFERENTES!$Q$628:$Q$1125,1)),REFERENTES!Q829,\"\")","v":""},{"$f":"REFERENTES!S208","v":46002},203,0,1131,"X",null,null,null,null,null,null,null,null,null,{"$f":"CONCATENATE(REFERENTES!Q187,\"(\",REFERENTES!R187,\")\")","v":"Muertero(Panguí-ZR1-Mtero-2)"},{"$f":"REFERENTES!S187","v":45413}]
[null,null,null,null,null,null,null,null,null,null,null,null,{"$f":"IF(ISNUMBER(FIND(\"RES\",REFERENTES!$Q$628:$Q$1125,1)),REFERENTES!Q830,\"\")","v":""},{"$f":"REFERENTES!S209","v":45391},204,0,1131,"X",null,null,null,null,null,null,null,null,null,{"$f":"CONCATENATE(REFERENTES!Q188,\"(\",REFERENTES!R188,\")\")","v":"Málaga(BMAL-ZP9-MV-1)"},{"$f":"REFERENTES!S188","v":45874}]
[null,null,null,null,null,null,null,null,null,null,null,null,{"$f":"IF(ISNUMBER(FIND(\"RES\",REFERENTES!$Q$628:$Q$1125,1)),REFERENTES!Q831,\"\")","v":""},{"$f":"REFERENTES!S210","v":42127},205,0,1131,"X",null,null,null,null,null,null,null,null,null,{"$f":"CONCATENATE(REFERENTES!Q189,\"(\",REFERENTES!R189,\")\")","v":"NORTE(NORTE_JON)"},{"$f":"REFERENTES!S189","v":58103}]
[null,null,null,null,null,null,null,null,null,null,null,null,{"$f":"IF(ISNUMBER(FIND(\"RES\",REFERENTES!$Q$628:$Q$1125,1)),REFERENTES!Q832,\"\")","v":""},{"$f":"REFERENTES!S211","v":48471},206,0,1131,"X",null,null,null,null,null,null,null,null,null,{"$f":"CONCATENATE(REFERENTES!Q190,\"(\",REFERENTES!R190,\")\")","v":"NORTE(NORTE_SAN)"},{"$f":"REFERENTES!S190","v":58127}]
[null,null,null,null,null,null,null,null,null,null,null,null,{"$f":"IF(ISNUMBER(FIND(\"RES\",REFERENTES!$Q$628:$Q$1125,1)),REFERENTES!Q833,\"\")","v":""},{"$f":"REFERENTES!S212","v":45880},207,0,1131,"X",null,null,null,null,null,null,null,null,null,{"$f":"CONCATENATE(REFERENTES!Q191,\"(\",REFERENTES!R191,\")\")","v":"Old Point -1(OPOI-ZUS2-OP-1)"},{"$f":"REFERENTES!S191","v":41463}]
[null,null,null,null,null,null,null,null,null,null,null,null,{"$f":"IF(ISNUMBER(FIND(\"RES\",REFERENTES!$Q$628:$Q$1125,1)),REFERENTES!Q834,\"\")","v":""},{"$f":"REFERENTES!S213","v":44603},208,0,1131,"X",null,null,null,null,null,null,null,null,null,{"$f":"CONCATENATE(REFERENTES!Q192,\"(\",REFERENTES!R192,\")\")","v":"Old Town -2(OTOW-ZP1-OldTown-2)"},{"$f":"REFERENTES!S192","v":51437}]
[null,null,null,null,null,null,null,null,null,null,null,null,{"$f":"IF(ISNUMBER(FIND(\"RES\",REFERENTES!$Q$628:$Q$1125,1)),REFERENTES!Q835,\"\")","v":""},{"$f":"REFERENTES!S214","v":44621},209,0,1131,"X",null,null,null,null,null,null,null,null,null,{"$f":"CONCATENATE(REFERENTES!Q193,\"(\",REFERENTES!R193,\")\")","v":"Old Town parcela circular-1(OldTownPPC-1)"},{"$f":"REFERENTES!S193","v":55563}]
[null,null,null,null,null,null,null,null,null,null,null,null,{"$f":"IF(ISNUMBER(FIND(\"RES\",REFERENTES!$Q$628:$Q$1125,1)),REFERENTES!Q836,\"\")","v":""},{"$f":"REFERENTES!S215","v":45288},210,0,1131,"X",null,null,null,null,null,null,null,null,null,{"$f":"CONCATENATE(REFERENTES!Q194,\"(\",REFERENTES!R194,\")\")","v":"Old Town parcela circular-2(OldTownPPC2)"},{"$f":"REFERENTES!S194","v":55564}]
[null,null,null,null,null,null,null,null,null,null,null,null,{"$f":"IF(ISNUMBER(FIND(\"RES\",REFERENTES!$Q$628:$Q$1125,1)),REFERENTES!Q837,\"\")","v":""},{"$f":"REFERENTES!S216","v":45290},211,0,1131,"X",null,null,null,null,null,null,null,null,null,{"$f":"CONCATENATE(REFERENTES!Q195,\"(\",REFERENTES!R195,\")\")","v":"Ostion(BCISEST-ZUS1-Ostion-1)"},{"$f":"REFERENTES!S195","v":48747}]
[null,null,null,null,null,null,null,null,null,null,null,null,{"$f":"IF(ISNUMBER(FIND(\"RES\",REFERENTES!$Q$628:$Q$1125,1)),REFERENTES!Q838,\"\")","v":""},{"$f":"REFERENTES!S217","v":45292},212,0,1131,"X",null,null,null,null,null,null,null,null,null,{"$f":"CONCATENATE(REFERENTES!Q196,\"(\",REFERENTES!R196,\")\")","v":"PNN MCBEAN PARCELA1(PNNMCBEAN_P1)"},{"$f":"REFERENTES!S196","v":58085}]
[null,null,null,null,null,null,null,null,null,null,null,null,{"$f":"IF(ISNUMBER(FIND(\"RES\",REFERENTES!$Q$628:$Q$1125,1)),REFERENTES!Q839,\"\")","v":""},{"$f":"REFERENTES!S218","v":45274},213,0,1131,"X",null,null,null,null,null,null,null,null,null,{"$f":"CONCATENATE(REFERENTES!Q197,\"(\",REFERENTES!R197,\")\")","v":"PNN MCBEAN PARCELA10(PNNMCBEAN_P10)"},{"$f":"REFERENTES!S197","v":58094}]
[null,null,null,null,null,null,null,null,null,null,null,null,{"$f":"IF(ISNUMBER(FIND(\"RES\",REFERENTES!$Q$628:$Q$1125,1)),REFERENTES!Q840,\"\")","v":""},{"$f":"REFERENTES!S219","v":45276},214,0,1131,"X",null,null,null,null,null,null,null,null,null,{"$f":"CONCATENATE(REFERENTES!Q198,\"(\",REFERENTES!R198,\")\")","v":"PNN MCBEAN PARCELA2(PNNMCBEAN_P2)"},{"$f":"REFERENTES!S198","v":58086}]
[null,null,null,null,null,null,null,null,null,null,null,null,{"$f":"IF(ISNUMBER(FIND(\"RES\",REFERENTES!$Q$628:$Q$1125,1)),REFERENTES!Q841,\"\")","v":""},{"$f":"REFERENTES!S220","v":45278},215,0,1131,"X",null,null,null,null,null,null,null,null,null,{"$f":"CONCATENATE(REFERENTES!Q199,\"(\",REFERENTES!R199,\")\")","v":"PNN MCBEAN PARCELA3(PNNMCBEAN_P3)"},{"$f":"REFERENTES!S199","v":58087}]
[null,null,null,null,null,null,null,null,null,null,null,null,{"$f":"IF(ISNUMBER(FIND(\"RES\",REFERENTES!$Q$628:$Q$1125,1)),REFERENTES!Q842,\"\")","v":""},{"$f":"REFERENTES!S221","v":48403},216,0,1131,"X",null,null,null,null,null,null,null,null,null,{"$f":"CONCATENATE(REFERENTES!Q200,\"(\",REFERENTES!R200,\")\")","v":"PNN MCBEAN PARCELA4(PNNMCBEAN_P4)"},{"$f":"REFERENTES!S200","v":58088}]
[null,null,null,null,null,null,null,null,null,null,null,null,{"$f":"IF(ISNUMBER(FIND(\"RES\",REFERENTES!$Q$628:$Q$1125,1)),REFERENTES!Q843,\"\")","v":""},{"$f":"REFERENTES!S222","v":44400},217,0,1131,"X",null,null,null,null,null,null,null,null,null,{"$f":"CONCATENATE(REFERENTES!Q201,\"(\",REFERENTES!R201,\")\")","v":"PNN MCBEAN PARCELA5(PNNMCBEAN_P5)"},{"$f":"REFERENTES!S201","v":58089}]
[null,null,null,null,null,null,null,null,null,null,null,null,{"$f":"IF(ISNUMBER(FIND(\"RES\",REFERENTES!$Q$628:$Q$1125,1)),REFERENTES!Q844,\"\")","v":""},{"$f":"REFERENTES!S223","v":48432},218,0,1131,"X",null,null,null,null,null,null,null,null,null,{"$f":"CONCATENATE(REFERENTES!Q202,\"(\",REFERENTES!R202,\")\")","v":"PNN MCBEAN PARCELA6(PNNMCBEAN_P6)"},{"$f":"REFERENTES!S202","v":58090}]
[null,null,null,null,null,null,null,null,null,null,null,null,{"$f":"IF(ISNUMBER(FIND(\"RES\",REFERENTES!$Q$628:$Q$1125,1)),REFERENTES!Q845,\"\")","v":""},{"$f":"REFERENTES!S224","v":46006},219,0,1131,"X",null,null,null,null,null,null,null,null,null,{"$f":"CONCATENATE(REFERENTES!Q203,\"(\",REFERENTES!R203,\")\")","v":"PNN MCBEAN PARCELA7(PNNMCBEAN_P7)"},{"$f":"REFERENTES!S203","v":58091}]
[null,null,null,null,null,null,null,null,null,null,null,null,{"$f":"IF(ISNUMBER(FIND(\"RES\",REFERENTES!$Q$628:$Q$1125,1)),REFERENTES!Q846,\"\")","v":""},{"$f":"REFERENTES!S225","v":58068},220,0,1131,"X",null,null,null,null,null,null,null,null,null,{"$f":"CONCATENATE(REFERENTES!Q204,\"(\",REFERENTES!R204,\")\")","v":"PNN MCBEAN PARCELA8(PNNMCBEAN_P8)"},{"$f":"REFERENTES!S204","v":58092}]
[null,null,null,null,null,null,null,null,null,null,null,null,{"$f":"IF(ISNUMBER(FIND(\"RES\",REFERENTES!$Q$628:$Q$1125,1)),REFERENTES!Q847,\"\")","v":""},{"$f":"REFERENTES!S226","v":58069},221,0,1131,"X",null,null,null,null,null,null,null,null,null,{"$f":"CONCATENATE(REFERENTES!Q205,\"(\",REFERENTES!R205,\")\")","v":"PNN MCBEAN PARCELA9(PNNMCBEAN_P9)"},{"$f":"REFERENTES!S205","v":58093}]
[null,null,null,null,null,null,null,null,null,null,null,null,{"$f":"IF(ISNUMBER(FIND(\"RES\",REFERENTES!$Q$628:$Q$1125,1)),REFERENTES!Q848,\"\")","v":""},{"$f":"REFERENTES!S227","v":58070},222,0,1131,"X",null,null,null,null,null,null,null,null,null,{"$f":"CONCATENATE(REFERENTES!Q206,\"(\",REFERENTES!R206,\")\")","v":"Palosecal(VIRU-SZ1-PALOS-1)"},{"$f":"REFERENTES!S206","v":42123}]
[null,null,null,null,null,null,null,null,null,null,null,null,{"$f":"IF(ISNUMBER(FIND(\"RES\",REFERENTES!$Q$628:$Q$1125,1)),REFERENTES!Q849,\"\")","v":""},{"$f":"REFERENTES!S228","v":58080},223,0,1131,"X",null,null,null,null,null,null,null,null,null,{"$f":"CONCATENATE(REFERENTES!Q207,\"(\",REFERENTES!R207,\")\")","v":"Parcela Esteh(CAJA-ZR1-Esteh-1)"},{"$f":"REFERENTES!S207","v":46020}]
[null,null,null,null,null,null,null,null,null,null,null,null,{"$f":"IF(ISNUMBER(FIND(\"RES\",REFERENTES!$Q$628:$Q$1125,1)),REFERENTES!Q850,\"\")","v":""},{"$f":"REFERENTES!S229","v":58081},224,0,1131,"X",null,null,null,null,null,null,null,null,null,{"$f":"CONCATENATE(REFERENTES!Q208,\"(\",REFERENTES!R208,\")\")","v":"Parcela Play(CAJA-ZUS1-Ply-1)"},{"$f":"REFERENTES!S208","v":46002}]
[null,null,null,null,null,null,null,null,null,null,null,null,{"$f":"IF(ISNUMBER(FIND(\"RES\",REFERENTES!$Q$628:$Q$1125,1)),REFERENTES!Q851,\"\")","v":""},{"$f":"REFERENTES!S230","v":58082},225,0,1131,"X",null,null,null,null,null,null,null,null,null,{"$f":"CONCATENATE(REFERENTES!Q209,\"(\",REFERENTES!R209,\")\")","v":"Pasacaballos(CAMREAL-ZUS2-CABALLOS-1)"},{"$f":"REFERENTES!S209","v":45391}]
[null,null,null,null,null,null,null,null,null,null,null,null,{"$f":"IF(ISNUMBER(FIND(\"RES\",REFERENTES!$Q$628:$Q$1125,1)),REFERENTES!Q852,\"\")","v":""},{"$f":"REFERENTES!S231","v":44392},226,0,1131,"X",null,null,null,null,null,null,null,null,null,{"$f":"CONCATENATE(REFERENTES!Q210,\"(\",REFERENTES!R210,\")\")","v":"Peñitas(VIRU-SZ1-PEÑI-1)"},{"$f":"REFERENTES!S210","v":42127}]
[null,null,null,null,null,null,null,null,null,null,null,null,{"$f":"IF(ISNUMBER(FIND(\"RES\",REFERENTES!$Q$628:$Q$1125,1)),REFERENTES!Q853,\"\")","v":""},{"$f":"REFERENTES!S232","v":44395},227,0,1131,"X",null,null,null,null,null,null,null,null,null,{"$f":"CONCATENATE(REFERENTES!Q211,\"(\",REFERENTES!R211,\")\")","v":"Puerto Cesar-1(CORI-ZP1-Pces-1)"},{"$f":"REFERENTES!S211","v":48471}]
[null,null,null,null,null,null,null,null,null,null,null,null,{"$f":"IF(ISNUMBER(FIND(\"RES\",REFERENTES!$Q$628:$Q$1125,1)),REFERENTES!Q854,\"\")","v":""},{"$f":"REFERENTES!S233","v":45914},228,0,1131,"X",null,null,null,null,null,null,null,null,null,{"$f":"CONCATENATE(REFERENTES!Q212,\"(\",REFERENTES!R212,\")\")","v":"Puerto España(BSJU-ZR3-SJPE-1)"},{"$f":"REFERENTES!S212","v":45880}]
[null,null,null,null,null,null,null,null,null,null,null,null,{"$f":"IF(ISNUMBER(FIND(\"RES\",REFERENTES!$Q$628:$Q$1125,1)),REFERENTES!Q855,\"\")","v":""},{"$f":"REFERENTES!S234","v":45916},229,0,1131,"X",null,null,null,null,null,null,null,null,null,{"$f":"CONCATENATE(REFERENTES!Q213,\"(\",REFERENTES!R213,\")\")","v":"Punta Arenas(TBOM-ZP1-PtaArenas-1)"},{"$f":"REFERENTES!S213","v":44603}]
[null,null,null,null,null,null,null,null,null,null,null,null,{"$f":"IF(ISNUMBER(FIND(\"RES\",REFERENTES!$Q$628:$Q$1125,1)),REFERENTES!Q856,\"\")","v":""},{"$f":"REFERENTES!S235","v":45920},230,0,1131,"X",null,null,null,null,null,null,null,null,null,{"$f":"CONCATENATE(REFERENTES!Q214,\"(\",REFERENTES!R214,\")\")","v":"Punta Boqueron(JPVI-ZR1-Boquerón-1)"},{"$f":"REFERENTES!S214","v":44621}]
[null,null,null,null,null,null,null,null,null,null,null,null,{"$f":"IF(ISNUMBER(FIND(\"RES\",REFERENTES!$Q$628:$Q$1125,1)),REFERENTES!Q857,\"\")","v":""},{"$f":"REFERENTES!S236","v":45086},231,0,1131,"X",null,null,null,null,null,null,null,null,null,{"$f":"CONCATENATE(REFERENTES!Q215,\"(\",REFERENTES!R215,\")\")","v":"Punta Cerro -1(CGSM-SZ1-PtaCerro-1)"},{"$f":"REFERENTES!S215","v":45288}]
[null,null,null,null,null,null,null,null,null,null,null,null,{"$f":"IF(ISNUMBER(FIND(\"RES\",REFERENTES!$Q$628:$Q$1125,1)),REFERENTES!Q858,\"\")","v":""},{"$f":"REFERENTES!S237","v":48440},232,0,1131,"X",null,null,null,null,null,null,null,null,null,{"$f":"CONCATENATE(REFERENTES!Q216,\"(\",REFERENTES!R216,\")\")","v":"Punta Cerro -2(CGSM-SZ1-PtaCerro-2)"},{"$f":"REFERENTES!S216","v":45290}]
[null,null,null,null,null,null,null,null,null,null,null,null,{"$f":"IF(ISNUMBER(FIND(\"RES\",REFERENTES!$Q$628:$Q$1125,1)),REFERENTES!Q859,\"\")","v":""},{"$f":"REFERENTES!S238","v":45248},233,0,1131,"X",null,null,null,null,null,null,null,null,null,{"$f":"CONCATENATE(REFERENTES!Q217,\"(\",REFERENTES!R217,\")\")","v":"Punta Cerro -3(CGSM-SZ1-PtaCerro-3)"},{"$f":"REFERENTES!S217","v":45292}]
[null,null,null,null,null,null,null,null,null,null,null,null,{"$f":"IF(ISNUMBER(FIND(\"RES\",REFERENTES!$Q$628:$Q$1125,1)),REFERENTES!Q860,\"\")","v":""},{"$f":"REFERENTES!S239","v":48574},234,0,1131,"X",null,null,null,null,null,null,null,null,null,{"$f":"CONCATENATE(REFERENTES!Q218,\"(\",REFERENTES!R218,\")\")","v":"Punta Chino -1(CGSM-SZ1-PtaChino-1)"},{"$f":"REFERENTES!S218","v":45274}]
[null,null,null,null,null,null,null,null,null,null,null,null,{"$f":"IF(ISNUMBER(FIND(\"RES\",REFERENTES!$Q$628:$Q$1125,1)),REFERENTES!Q861,\"\")","v":""},{"$f":"REFERENTES!S240","v":49591},235,0,1131,"X",null,null,null,null,null,null,null,null,null,{"$f":"CONCATENATE(REFERENTES!Q219,\"(\",REFERENTES!R219,\")\")","v":"Punta Chino -2(CGSM-SZ1-PtaChino-2)"},{"$f":"REFERENTES!S219","v":45276}]
[null,null,null,null,null,null,null,null,null,null,null,null,{"$f":"IF(ISNUMBER(FIND(\"RES\",REFERENTES!$Q$628:$Q$1125,1)),REFERENTES!Q862,\"\")","v":""},{"$f":"REFERENTES!S241","v":45267},236,0,1131,"X",null,null,null,null,null,null,null,null,null,{"$f":"CONCATENATE(REFERENTES!Q220,\"(\",REFERENTES!R220,\")\")","v":"Punta Chino -3(CGSM-SZ1-PtaChino-3)"},{"$f":"REFERENTES!S220","v":45278}]
[null,null,null,null,null,null,null,null,null,null,null,null,{"$f":"IF(ISNUMBER(FIND(\"RES\",REFERENTES!$Q$628:$Q$1125,1)),REFERENTES!Q863,\"\")","v":""},{"$f":"REFERENTES!S242","v":45269},237,0,1131,"X",null,null,null,null,null,null,null,null,null,{"$f":"CONCATENATE(REFERENTES!Q221,\"(\",REFERENTES!R221,\")\")","v":"Punta Coquito(BCOL-ZP1-Pcoq-1)"},{"$f":"REFERENTES!S221","v":48403}]
[null,null,null,null,null,null,null,null,null,null,null,null,{"$f":"IF(ISNUMBER(FIND(\"RES\",REFERENTES!$Q$628:$Q$1125,1)),REFERENTES!Q864,\"\")","v":""},{"$f":"REFERENTES!S243","v":45271},238,0,1131,"X",null,null,null,null,null,null,null,null,null,{"$f":"CONCATENATE(REFERENTES!Q222,\"(\",REFERENTES!R222,\")\")","v":"Punta Seca(PSEC-ZR1-PSEC-1)"},{"$f":"REFERENTES!S222","v":44400}]
[null,null,null,null,null,null,null,null,null,null,null,null,{"$f":"IF(ISNUMBER(FIND(\"RES\",REFERENTES!$Q$628:$Q$1125,1)),REFERENTES!Q865,\"\")","v":""},{"$f":"REFERENTES!S244","v":57505},239,0,1131,"X",null,null,null,null,null,null,null,null,null,{"$f":"CONCATENATE(REFERENTES!Q223,\"(\",REFERENTES!R223,\")\")","v":"Punta de las Vacas-1(CORI-ZP1-Pvac-1)"},{"$f":"REFERENTES!S223","v":48432}]
[null,null,null,null,null,null,null,null,null,null,null,null,{"$f":"IF(ISNUMBER(FIND(\"RES\",REFERENTES!$Q$628:$Q$1125,1)),REFERENTES!Q866,\"\")","v":""},{"$f":"REFERENTES!S245","v":57506},240,0,1131,"X",null,null,null,null,null,null,null,null,null,{"$f":"CONCATENATE(REFERENTES!Q224,\"(\",REFERENTES!R224,\")\")","v":"Quebrada Balsadito(MAYO-ZR3-QB-1)"},{"$f":"REFERENTES!S224","v":46006}]
[null,null,null,null,null,null,null,null,null,null,null,null,{"$f":"IF(ISNUMBER(FIND(\"RES\",REFERENTES!$Q$628:$Q$1125,1)),REFERENTES!Q867,\"\")","v":""},{"$f":"REFERENTES!S246","v":57507},241,0,1131,"X",null,null,null,null,null,null,null,null,null,{"$f":"CONCATENATE(REFERENTES!Q225,\"(\",REFERENTES!R225,\")\")","v":"REF PARCELA1(REF_P1)"},{"$f":"REFERENTES!S225","v":58068}]
[null,null,null,null,null,null,null,null,null,null,null,null,{"$f":"IF(ISNUMBER(FIND(\"RES\",REFERENTES!$Q$628:$Q$1125,1)),REFERENTES!Q868,\"\")","v":""},{"$f":"REFERENTES!S247","v":57508},242,0,1131,"X",null,null,null,null,null,null,null,null,null,{"$f":"CONCATENATE(REFERENTES!Q226,\"(\",REFERENTES!R226,\")\")","v":"REF PARCELA2(REF_P2)"},{"$f":"REFERENTES!S226","v":58069}]
[null,null,null,null,null,null,null,null,null,null,null,null,{"$f":"IF(ISNUMBER(FIND(\"RES\",REFERENTES!$Q$628:$Q$1125,1)),REFERENTES!Q869,\"\")","v":""},{"$f":"REFERENTES!S248","v":57509},243,0,1131,"X",null,null,null,null,null,null,null,null,null,{"$f":"CONCATENATE(REFERENTES!Q227,\"(\",REFERENTES!R227,\")\")","v":"REF PARCELA3(REF_P3)"},{"$f":"REFERENTES!S227","v":58070}]
[null,null,null,null,null,null,null,null,null,null,null,null,{"$f":"IF(ISNUMBER(FIND(\"RES\",REFERENTES!$Q$628:$Q$1125,1)),REFERENTES!Q870,\"\")","v":""},{"$f":"REFERENTES!S249","v":57510},244,0,1131,"X",null,null,null,null,null,null,null,null,null,{"$f":"CONCATENATE(REFERENTES!Q228,\"(\",REFERENTES!R228,\")\")","v":"REF RIN PARCELA1(REF_P1)"},{"$f":"REFERENTES!S228","v":58080}]
[null,null,null,null,null,null,null,null,null,null,null,null,{"$f":"IF(ISNUMBER(FIND(\"RES\",REFERENTES!$Q$628:$Q$1125,1)),REFERENTES!Q871,\"\")","v":""},{"$f":"REFERENTES!S250","v":48867},245,0,1131,"X",null,null,null,null,null,null,null,null,null,{"$f":"CONCATENATE(REFERENTES!Q229,\"(\",REFERENTES!R229,\")\")","v":"REF RIN PARCELA2(REF_P2)"},{"$f":"REFERENTES!S229","v":58081}]
[null,null,null,null,null,null,null,null,null,null,null,null,{"$f":"IF(ISNUMBER(FIND(\"RES\",REFERENTES!$Q$628:$Q$1125,1)),REFERENTES!Q872,\"\")","v":""},{"$f":"REFERENTES!S251","v":48869},246,0,1131,"X",null,null,null,null,null,null,null,null,null,{"$f":"CONCATENATE(REFERENTES!Q230,\"(\",REFERENTES!R230,\")\")","v":"REF RIN PARCELA3(REF_P3)"},{"$f":"REFERENTES!S230","v":58082}]
[null,null,null,null,null,null,null,null,null,null,null,null,{"$f":"IF(ISNUMBER(FIND(\"RES\",REFERENTES!$Q$628:$Q$1125,1)),REFERENTES!Q873,\"\")","v":""},{"$f":"REFERENTES!S252","v":48871},247,0,1131,"X",null,null,null,null,null,null,null,null,null,{"$f":"CONCATENATE(REFERENTES!Q231,\"(\",REFERENTES!R231,\")\")","v":"Rincon Norte(RINC-ZP1-RNOR-1)"},{"$f":"REFERENTES!S231","v":44392}]
[null,null,null,null,null,null,null,null,null,null,null,null,{"$f":"IF(ISNUMBER(FIND(\"RES\",REFERENTES!$Q$628:$Q$1125,1)),REFERENTES!Q874,\"\")","v":""},{"$f":"REFERENTES!S253","v":48873},248,0,1131,"X",null,null,null,null,null,null,null,null,null,{"$f":"CONCATENATE(REFERENTES!Q232,\"(\",REFERENTES!R232,\")\")","v":"Rincon Sur(RINC-ZR1-RSUR-1)"},{"$f":"REFERENTES!S232","v":44395}]
[null,null,null,null,null,null,null,null,null,null,null,null,{"$f":"IF(ISNUMBER(FIND(\"RES\",REFERENTES!$Q$628:$Q$1125,1)),REFERENTES!Q875,\"\")","v":""},{"$f":"REFERENTES!S254","v":48875},249,0,1131,"X",null,null,null,null,null,null,null,null,null,{"$f":"CONCATENATE(REFERENTES!Q233,\"(\",REFERENTES!R233,\")\")","v":"Rinconada -1(VIPIS-SZ1-RIN-1)"},{"$f":"REFERENTES!S233","v":45914}]
[null,null,null,null,null,null,null,null,null,null,null,null,{"$f":"IF(ISNUMBER(FIND(\"RES\",REFERENTES!$Q$628:$Q$1125,1)),REFERENTES!Q876,\"\")","v":""},{"$f":"REFERENTES!S255","v":42129},250,0,1131,"X",null,null,null,null,null,null,null,null,null,{"$f":"CONCATENATE(REFERENTES!Q234,\"(\",REFERENTES!R234,\")\")","v":"Rinconada -2(VIPIS-SZ1-RIN-2)"},{"$f":"REFERENTES!S234","v":45916}]
[null,null,null,null,null,null,null,null,null,null,null,null,{"$f":"IF(ISNUMBER(FIND(\"RES\",REFERENTES!$Q$628:$Q$1125,1)),REFERENTES!Q877,\"\")","v":""},{"$f":"REFERENTES!S256","v":48464},251,0,1131,"X",null,null,null,null,null,null,null,null,null,{"$f":"CONCATENATE(REFERENTES!Q235,\"(\",REFERENTES!R235,\")\")","v":"Rinconada -3(VIPIS-SZ1-RIN-3)"},{"$f":"REFERENTES!S235","v":45920}]
[null,null,null,null,null,null,null,null,null,null,null,null,{"$f":"IF(ISNUMBER(FIND(\"RES\",REFERENTES!$Q$628:$Q$1125,1)),REFERENTES!Q878,\"\")","v":""},{"$f":"REFERENTES!S257","v":44630},252,0,1131,"X",null,null,null,null,null,null,null,null,null,{"$f":"CONCATENATE(REFERENTES!Q236,\"(\",REFERENTES!R236,\")\")","v":"Rio Ancachi(Nuquí-ZR1-RIAN-1)"},{"$f":"REFERENTES!S236","v":45086}]
[null,null,null,null,null,null,null,null,null,null,null,null,{"$f":"IF(ISNUMBER(FIND(\"RES\",REFERENTES!$Q$628:$Q$1125,1)),REFERENTES!Q879,\"\")","v":""},{"$f":"REFERENTES!S258","v":44531},253,0,1131,"X",null,null,null,null,null,null,null,null,null,{"$f":"CONCATENATE(REFERENTES!Q237,\"(\",REFERENTES!R237,\")\")","v":"Rio Caimán Viejo(CORI-ZUS1-Cviej-1)"},{"$f":"REFERENTES!S237","v":48440}]
[null,null,null,null,null,null,null,null,null,null,null,null,{"$f":"IF(ISNUMBER(FIND(\"RES\",REFERENTES!$Q$628:$Q$1125,1)),REFERENTES!Q880,\"\")","v":""},{"$f":"REFERENTES!S259","v":44546},254,0,1131,"X",null,null,null,null,null,null,null,null,null,{"$f":"CONCATENATE(REFERENTES!Q238,\"(\",REFERENTES!R238,\")\")","v":"Rio Chorí(Jurub-ZUS1-Pabarc-1)"},{"$f":"REFERENTES!S238","v":45248}]
[null,null,null,null,null,null,null,null,null,null,null,null,{"$f":"IF(ISNUMBER(FIND(\"RES\",REFERENTES!$Q$628:$Q$1125,1)),REFERENTES!Q881,\"\")","v":""},{"$f":"REFERENTES!S260","v":44557},255,0,1131,"X",null,null,null,null,null,null,null,null,null,{"$f":"CONCATENATE(REFERENTES!Q239,\"(\",REFERENTES!R239,\")\")","v":"Rio Necocli(CORI-ZR1-Rnec-2)"},{"$f":"REFERENTES!S239","v":48574}]
[null,null,null,null,null,null,null,null,null,null,null,null,{"$f":"IF(ISNUMBER(FIND(\"RES\",REFERENTES!$Q$628:$Q$1125,1)),REFERENTES!Q882,\"\")","v":""},{"$f":"REFERENTES!S261","v":44419},256,0,1131,"X",null,null,null,null,null,null,null,null,null,{"$f":"CONCATENATE(REFERENTES!Q240,\"(\",REFERENTES!R240,\")\")","v":"Rio Saija 3-1(CANT-SZ1-SAIJA3-1)"},{"$f":"REFERENTES!S240","v":49591}]
[null,null,null,null,null,null,null,null,null,null,null,null,{"$f":"IF(ISNUMBER(FIND(\"RES\",REFERENTES!$Q$628:$Q$1125,1)),REFERENTES!Q883,\"\")","v":""},{"$f":"REFERENTES!S262","v":55554},257,0,1131,"X",null,null,null,null,null,null,null,null,null,{"$f":"CONCATENATE(REFERENTES!Q241,\"(\",REFERENTES!R241,\")\")","v":"Rio Sevilla -1(CGSM-SZ1-Sevillla-1)"},{"$f":"REFERENTES!S241","v":45267}]
[null,null,null,null,null,null,null,null,null,null,null,null,{"$f":"IF(ISNUMBER(FIND(\"RES\",REFERENTES!$Q$628:$Q$1125,1)),REFERENTES!Q884,\"\")","v":""},{"$f":"REFERENTES!S263","v":55555},258,0,{"$f":"IF(P263=0,MAX($O$6:$O$1135)+1,O263)","v":1131},{"$f":"IFERROR(VLOOKUP(SMALL($Q$6:$Q$1135,O263),$O$6:$P$1135,2,FALSE),\"X\")","v":"X"},null,null,null,null,null,null,null,null,null,{"$f":"CONCATENATE(REFERENTES!Q242,\"(\",REFERENTES!R242,\")\")","v":"Rio Sevilla -2(CGSM-SZ1-Sevillla-2)"},{"$f":"REFERENTES!S242","v":45269}]
[null,null,null,null,null,null,null,null,null,null,null,null,{"$f":"IF(ISNUMBER(FIND(\"RES\",REFERENTES!$Q$628:$Q$1125,1)),REFERENTES!Q885,\"\")","v":""},{"$f":"REFERENTES!S264","v":41492},259,0,1131,"X",null,null,null,null,null,null,null,null,null,{"$f":"CONCATENATE(REFERENTES!Q243,\"(\",REFERENTES!R243,\")\")","v":"Rio Sevilla -3(CGSM-SZ1-Sevillla-3)"},{"$f":"REFERENTES!S243","v":45271}]
[null,null,null,null,null,null,null,null,null,null,null,null,{"$f":"IF(ISNUMBER(FIND(\"RES\",REFERENTES!$Q$628:$Q$1125,1)),REFERENTES!Q886,\"\")","v":""},{"$f":"REFERENTES!S265","v":45848},260,{"$f":"IF(M265=\"\",0,M265)","v":0},1131,"X",null,null,null,null,null,null,null,null,null,{"$f":"CONCATENATE(REFERENTES!Q244,\"(\",REFERENTES!R244,\")\")","v":"Rio Toribio - MI(Toribio_1)"},{"$f":"REFERENTES!S244","v":57505}]
[null,null,null,null,null,null,null,null,null,null,null,null,{"$f":"IF(ISNUMBER(FIND(\"RES\",REFERENTES!$Q$628:$Q$1125,1)),REFERENTES!Q887,\"\")","v":""},{"$f":"REFERENTES!S266","v":44500},261,0,1131,"X",null,null,null,null,null,null,null,null,null,{"$f":"CONCATENATE(REFERENTES!Q245,\"(\",REFERENTES!R245,\")\")","v":"Rio Toribio - MII(Toribio_2)"},{"$f":"REFERENTES!S245","v":57506}]
[null,null,null,null,null,null,null,null,null,null,null,null,{"$f":"IF(ISNUMBER(FIND(\"RES\",REFERENTES!$Q$628:$Q$1125,1)),REFERENTES!Q888,\"\")","v":""},{"$f":"REFERENTES!S267","v":55567},262,0,1131,"X",null,null,null,null,null,null,null,null,null,{"$f":"CONCATENATE(REFERENTES!Q246,\"(\",REFERENTES!R246,\")\")","v":"Rio Toribio - MIII (Toribio_3)"},{"$f":"REFERENTES!S246","v":57507}]
[null,null,null,null,null,null,null,null,null,null,null,null,{"$f":"IF(ISNUMBER(FIND(\"RES\",REFERENTES!$Q$628:$Q$1125,1)),REFERENTES!Q889,\"\")","v":""},{"$f":"REFERENTES!S268","v":55568},263,0,1131,"X",null,null,null,null,null,null,null,null,null,{"$f":"CONCATENATE(REFERENTES!Q247,\"(\",REFERENTES!R247,\")\")","v":"Rio Toribio - MIV(Toribio_4)"},{"$f":"REFERENTES!S247","v":57508}]
[null,null,null,null,null,null,null,null,null,null,null,null,{"$f":"IF(ISNUMBER(FIND(\"RES\",REFERENTES!$Q$628:$Q$1125,1)),REFERENTES!Q890,\"\")","v":""},{"$f":"REFERENTES!S269","v":50089},264,0,1131,"X",null,null,null,null,null,null,null,null,null,{"$f":"CONCATENATE(REFERENTES!Q248,\"(\",REFERENTES!R248,\")\")","v":"Rio Toribio - MV(Toribio_5)"},{"$f":"REFERENTES!S248","v":57509}]
[null,null,null,null,null,null,null,null,null,null,null,null,{"$f":"IF(ISNUMBER(FIND(\"RES\",REFERENTES!$Q$628:$Q$1125,1)),REFERENTES!Q891,\"\")","v":""},{"$f":"REFERENTES!S270","v":50091},265,0,1131,"X",null,null,null,null,null,null,null,null,null,{"$f":"CONCATENATE(REFERENTES!Q249,\"(\",REFERENTES!R249,\")\")","v":"Rio Toribio - MVI(Toribio_6)"},{"$f":"REFERENTES!S249","v":57510}]
[null,null,null,null,null,null,null,null,null,null,null,null,{"$f":"IF(ISNUMBER(FIND(\"RES\",REFERENTES!$Q$628:$Q$1125,1)),REFERENTES!Q892,\"\")","v":""},{"$f":"REFERENTES!S271","v":50093},266,0,1131,"X",null,null,null,null,null,null,null,null,null,{"$f":"CONCATENATE(REFERENTES!Q250,\"(\",REFERENTES!R250,\")\")","v":"Rio Toribio-1(TOR-SZ1-Toribio-1)"},{"$f":"REFERENTES!S250","v":48867}]
[null,null,null,null,null,null,null,null,null,null,null,null,{"$f":"IF(ISNUMBER(FIND(\"RES\",REFERENTES!$Q$628:$Q$1125,1)),REFERENTES!Q893,\"\")","v":""},{"$f":"REFERENTES!S272","v":41487},267,0,1131,"X",null,null,null,null,null,null,null,null,null,{"$f":"CONCATENATE(REFERENTES!Q251,\"(\",REFERENTES!R251,\")\")","v":"Rio Toribio-2(TOR-SZ1-Toribio-2)"},{"$f":"REFERENTES!S251","v":48869}]
[null,null,null,null,null,null,null,null,null,null,null,null,{"$f":"IF(ISNUMBER(FIND(\"RES\",REFERENTES!$Q$628:$Q$1125,1)),REFERENTES!Q894,\"\")","v":""},{"$f":"REFERENTES!S273","v":47758},268,0,1131,"X",null,null,null,null,null,null,null,null,null,{"$f":"CONCATENATE(REFERENTES!Q252,\"(\",REFERENTES!R252,\")\")","v":"Rio Toribio-3(TOR-SZ1-Toribio-3)"},{"$f":"REFERENTES!S252","v":48871}]
[null,null,null,null,null,null,null,null,null,null,null,null,{"$f":"IF(ISNUMBER(FIND(\"RES\",REFERENTES!$Q$628:$Q$1125,1)),REFERENTES!Q895,\"\")","v":""},{"$f":"REFERENTES!S274","v":47901},269,0,1131,"X",null,null,null,null,null,null,null,null,null,{"$f":"CONCATENATE(REFERENTES!Q253,\"(\",REFERENTES!R253,\")\")","v":"Rio Toribio-4(TOR-SZ1-Toribio-4)"},{"$f":"REFERENTES!S253","v":48873}]
[null,null,null,null,null,null,null,null,null,null,null,null,{"$f":"IF(ISNUMBER(FIND(\"RES\",REFERENTES!$Q$628:$Q$1125,1)),REFERENTES!Q896,\"\")","v":""},{"$f":"REFERENTES!S275","v":55546},270,0,1131,"X",null,null,null,null,null,null,null,null,null,{"$f":"CONCATENATE(REFERENTES!Q254,\"(\",REFERENTES!R254,\")\")","v":"Rio Toribio-5(TOR-SZ1-Toribio-5)"},{"$f":"REFERENTES!S254","v":48875}]
[null,null,null,null,null,null,null,null,null,null,null,null,{"$f":"IF(ISNUMBER(FIND(\"RES\",REFERENTES!$Q$628:$Q$1125,1)),REFERENTES!Q897,\"\")","v":""},{"$f":"REFERENTES!S276","v":55558},271,0,1131,"X",null,null,null,null,null,null,null,null,null,{"$f":"CONCATENATE(REFERENTES!Q255,\"(\",REFERENTES!R255,\")\")","v":"Rio Virudo(VIRU-SZ1-RVIR-1)"},{"$f":"REFERENTES!S255","v":42129}]
[null,null,null,null,null,null,null,null,null,null,null,null,{"$f":"IF(ISNUMBER(FIND(\"RES\",REFERENTES!$Q$628:$Q$1125,1)),REFERENTES!Q898,\"\")","v":""},{"$f":"REFERENTES!S277","v":55559},272,0,1131,"X",null,null,null,null,null,null,null,null,null,{"$f":"CONCATENATE(REFERENTES!Q256,\"(\",REFERENTES!R256,\")\")","v":"Río Damaquiel-1(CNTE-ZR1-Rdmq-1)"},{"$f":"REFERENTES!S256","v":48464}]
[null,null,null,null,null,null,null,null,null,null,null,null,{"$f":"IF(ISNUMBER(FIND(\"RES\",REFERENTES!$Q$628:$Q$1125,1)),REFERENTES!Q899,\"\")","v":""},{"$f":"REFERENTES!S278","v":55560},273,0,1131,"X",null,null,null,null,null,null,null,null,null,{"$f":"CONCATENATE(REFERENTES!Q257,\"(\",REFERENTES!R257,\")\")","v":"S La Virgen-1(JPVI-ZR1-SurVirgen-1)"},{"$f":"REFERENTES!S257","v":44630}]
[null,null,null,null,null,null,null,null,null,null,null,null,{"$f":"IF(ISNUMBER(FIND(\"RES\",REFERENTES!$Q$628:$Q$1125,1)),REFERENTES!Q900,\"\")","v":""},{"$f":"REFERENTES!S279","v":49327},274,0,1131,"X",null,null,null,null,null,null,null,null,null,{"$f":"CONCATENATE(REFERENTES!Q258,\"(\",REFERENTES!R258,\")\")","v":"Salahonda -1(FRAPIZ-ZUS1-Salho-1)"},{"$f":"REFERENTES!S258","v":44531}]
[null,null,null,null,null,null,null,null,null,null,null,null,{"$f":"IF(ISNUMBER(FIND(\"RES\",REFERENTES!$Q$628:$Q$1125,1)),REFERENTES!Q901,\"\")","v":""},{"$f":"REFERENTES!S280","v":55565},275,0,1131,"X",null,null,null,null,null,null,null,null,null,{"$f":"CONCATENATE(REFERENTES!Q259,\"(\",REFERENTES!R259,\")\")","v":"Salahonda P-1(FRAPIZ-ZP1-Salho-1)"},{"$f":"REFERENTES!S259","v":44546}]
[null,null,null,null,null,null,null,null,null,null,null,null,{"$f":"IF(ISNUMBER(FIND(\"RES\",REFERENTES!$Q$628:$Q$1125,1)),REFERENTES!Q902,\"\")","v":""},{"$f":"REFERENTES!S281","v":55566},276,0,1131,"X",null,null,null,null,null,null,null,null,null,{"$f":"CONCATENATE(REFERENTES!Q260,\"(\",REFERENTES!R260,\")\")","v":"Salahonda R-2-1(FRAPIZ-ZR2-Salho-1)"},{"$f":"REFERENTES!S260","v":44557}]
[null,null,null,null,null,null,null,null,null,null,null,null,{"$f":"IF(ISNUMBER(FIND(\"RES\",REFERENTES!$Q$628:$Q$1125,1)),REFERENTES!Q903,\"\")","v":""},{"$f":"REFERENTES!S282","v":45422},277,0,1131,"X",null,null,null,null,null,null,null,null,null,{"$f":"CONCATENATE(REFERENTES!Q261,\"(\",REFERENTES!R261,\")\")","v":"Salitral el Garzal(CCAIM-ZR1-SGAR-1)"},{"$f":"REFERENTES!S261","v":44419}]
[null,null,null,null,null,null,null,null,null,null,null,null,{"$f":"IF(ISNUMBER(FIND(\"RES\",REFERENTES!$Q$628:$Q$1125,1)),REFERENTES!Q904,\"\")","v":""},{"$f":"REFERENTES!S283","v":42103},278,0,1131,"X",null,null,null,null,null,null,null,null,null,{"$f":"CONCATENATE(REFERENTES!Q262,\"(\",REFERENTES!R262,\")\")","v":"Salt Creek parcela circular-2(SaltCreekPPC-2)"},{"$f":"REFERENTES!S262","v":55554}]
[null,null,null,null,null,null,null,null,null,null,null,null,{"$f":"IF(ISNUMBER(FIND(\"RES\",REFERENTES!$Q$628:$Q$1125,1)),REFERENTES!Q905,\"\")","v":""},{"$f":"REFERENTES!S284","v":45830},279,0,1131,"X",null,null,null,null,null,null,null,null,null,{"$f":"CONCATENATE(REFERENTES!Q263,\"(\",REFERENTES!R263,\")\")","v":"Salt Creek parcela circular-3(SaltCreekPPC-3)"},{"$f":"REFERENTES!S263","v":55555}]
[null,null,null,null,null,null,null,null,null,null,null,null,{"$f":"IF(ISNUMBER(FIND(\"RES\",REFERENTES!$Q$628:$Q$1125,1)),REFERENTES!Q906,\"\")","v":""},{"$f":"REFERENTES!S285","v":45257},280,0,1131,"X",null,null,null,null,null,null,null,null,null,{"$f":"CONCATENATE(REFERENTES!Q264,\"(\",REFERENTES!R264,\")\")","v":"Salt Creek-1(SCRE-ZP1-SCRE-1)"},{"$f":"REFERENTES!S264","v":41492}]
[null,null,null,null,null,null,null,null,null,null,null,null,{"$f":"IF(ISNUMBER(FIND(\"RES\",REFERENTES!$Q$628:$Q$1125,1)),REFERENTES!Q907,\"\")","v":""},{"$f":"REFERENTES!S286","v":45259},281,0,1131,"X",null,null,null,null,null,null,null,null,null,{"$f":"CONCATENATE(REFERENTES!Q265,\"(\",REFERENTES!R265,\")\")","v":"Santa Ana(RAPO-ZUS4-RSA-2)"},{"$f":"REFERENTES!S265","v":45848}]
[null,null,null,null,null,null,null,null,null,null,null,null,{"$f":"IF(ISNUMBER(FIND(\"RES\",REFERENTES!$Q$628:$Q$1125,1)),REFERENTES!Q908,\"\")","v":""},{"$f":"REFERENTES!S287","v":45400},282,0,1131,"X",null,null,null,null,null,null,null,null,null,{"$f":"CONCATENATE(REFERENTES!Q266,\"(\",REFERENTES!R266,\")\")","v":"Santa Ana-1(BARU-ZR1-Sta-Ana-1)"},{"$f":"REFERENTES!S266","v":44500}]
[null,null,null,null,null,null,null,null,null,null,null,null,{"$f":"IF(ISNUMBER(FIND(\"RES\",REFERENTES!$Q$628:$Q$1125,1)),REFERENTES!Q909,\"\")","v":""},{"$f":"REFERENTES!S288","v":44506},283,0,1131,"X",null,null,null,null,null,null,null,null,null,{"$f":"CONCATENATE(REFERENTES!Q267,\"(\",REFERENTES!R267,\")\")","v":"Santa Catalina parcela circular-1(SantaCatalinaPPC-1)"},{"$f":"REFERENTES!S267","v":55567}]
[null,null,null,null,null,null,null,null,null,null,null,null,{"$f":"IF(ISNUMBER(FIND(\"RES\",REFERENTES!$Q$628:$Q$1125,1)),REFERENTES!Q910,\"\")","v":""},{"$f":"REFERENTES!S289","v":45395},284,0,1131,"X",null,null,null,null,null,null,null,null,null,{"$f":"CONCATENATE(REFERENTES!Q268,\"(\",REFERENTES!R268,\")\")","v":"Santa Catalina parcela circular-2(SantaCatalinaPPC-2)"},{"$f":"REFERENTES!S268","v":55568}]
[null,null,null,null,null,null,null,null,null,null,null,null,{"$f":"IF(ISNUMBER(FIND(\"RES\",REFERENTES!$Q$628:$Q$1125,1)),REFERENTES!Q911,\"\")","v":""},{"$f":"REFERENTES!S290","v":48762},285,0,1131,"X",null,null,null,null,null,null,null,null,null,{"$f":"CONCATENATE(REFERENTES!Q269,\"(\",REFERENTES!R269,\")\")","v":"Sevillano -1(CGSM-SZ1-SEVI-1)"},{"$f":"REFERENTES!S269","v":50089}]
[null,null,null,null,null,null,null,null,null,null,null,null,{"$f":"IF(ISNUMBER(FIND(\"RES\",REFERENTES!$Q$628:$Q$1125,1)),REFERENTES!Q912,\"\")","v":""},{"$f":"REFERENTES!S291","v":41390},286,0,1131,"X",null,null,null,null,null,null,null,null,null,{"$f":"CONCATENATE(REFERENTES!Q270,\"(\",REFERENTES!R270,\")\")","v":"Sevillano -2(CGSM-SZ1-SEVI-2)"},{"$f":"REFERENTES!S270","v":50091}]
[null,null,null,null,null,null,null,null,null,null,null,null,{"$f":"IF(ISNUMBER(FIND(\"RES\",REFERENTES!$Q$628:$Q$1125,1)),REFERENTES!Q913,\"\")","v":""},{"$f":"REFERENTES!S292","v":41392},287,0,1131,"X",null,null,null,null,null,null,null,null,null,{"$f":"CONCATENATE(REFERENTES!Q271,\"(\",REFERENTES!R271,\")\")","v":"Sevillano -3(CGSM-SZ1-SEVI-3)"},{"$f":"REFERENTES!S271","v":50093}]
[null,null,null,null,null,null,null,null,null,null,null,null,{"$f":"IF(ISNUMBER(FIND(\"RES\",REFERENTES!$Q$628:$Q$1125,1)),REFERENTES!Q914,\"\")","v":""},{"$f":"REFERENTES!S293","v":41394},288,0,1131,"X",null,null,null,null,null,null,null,null,null,{"$f":"CONCATENATE(REFERENTES!Q272,\"(\",REFERENTES!R272,\")\")","v":"Smith Channel -1-1(SCHA-ZP1-SCH-1)"},{"$f":"REFERENTES!S272","v":41487}]
[null,null,null,null,null,null,null,null,null,null,null,null,{"$f":"IF(ISNUMBER(FIND(\"RES\",REFERENTES!$Q$628:$Q$1125,1)),REFERENTES!Q915,\"\")","v":""},{"$f":"REFERENTES!S294","v":45157},289,0,1131,"X",null,null,null,null,null,null,null,null,null,{"$f":"CONCATENATE(REFERENTES!Q273,\"(\",REFERENTES!R273,\")\")","v":"Smith Channel -1-2(SCHA-ZP1-SCH-2)"},{"$f":"REFERENTES!S273","v":47758}]
[null,null,null,null,null,null,null,null,null,null,null,null,{"$f":"IF(ISNUMBER(FIND(\"RES\",REFERENTES!$Q$628:$Q$1125,1)),REFERENTES!Q916,\"\")","v":""},{"$f":"REFERENTES!S295","v":55557},290,0,1131,"X",null,null,null,null,null,null,null,null,null,{"$f":"CONCATENATE(REFERENTES!Q274,\"(\",REFERENTES!R274,\")\")","v":"Smith Channel -1-3(SCHA-ZP1-SCH-3)"},{"$f":"REFERENTES!S274","v":47901}]
[null,null,null,null,null,null,null,null,null,null,null,null,{"$f":"IF(ISNUMBER(FIND(\"RES\",REFERENTES!$Q$628:$Q$1125,1)),REFERENTES!Q917,\"\")","v":""},{"$f":"REFERENTES!S296","v":44627},291,0,1131,"X",null,null,null,null,null,null,null,null,null,{"$f":"CONCATENATE(REFERENTES!Q275,\"(\",REFERENTES!R275,\")\")","v":"Smith Channel parcela circular-1(SmithChannelPPC-1)"},{"$f":"REFERENTES!S275","v":55546}]
[null,null,null,null,null,null,null,null,null,null,null,null,{"$f":"IF(ISNUMBER(FIND(\"RES\",REFERENTES!$Q$628:$Q$1125,1)),REFERENTES!Q918,\"\")","v":""},{"$f":"REFERENTES!S297","v":45839},292,0,1131,"X",null,null,null,null,null,null,null,null,null,{"$f":"CONCATENATE(REFERENTES!Q276,\"(\",REFERENTES!R276,\")\")","v":"Sound Bay parcela circular-1(SoundBayPPC-1)"},{"$f":"REFERENTES!S276","v":55558}]
[null,null,null,null,null,null,null,null,null,null,null,null,{"$f":"IF(ISNUMBER(FIND(\"RES\",REFERENTES!$Q$628:$Q$1125,1)),REFERENTES!Q919,\"\")","v":""},{"$f":"REFERENTES!S298","v":48442},293,0,1131,"X",null,null,null,null,null,null,null,null,null,{"$f":"CONCATENATE(REFERENTES!Q277,\"(\",REFERENTES!R277,\")\")","v":"Sound Bay parcela circular-2(SoundBayPPC-2)"},{"$f":"REFERENTES!S277","v":55559}]
[null,null,null,null,null,null,null,null,null,null,null,null,{"$f":"IF(ISNUMBER(FIND(\"RES\",REFERENTES!$Q$628:$Q$1125,1)),REFERENTES!Q920,\"\")","v":""},{"$f":"REFERENTES!S299","v":48523},294,0,1131,"X",null,null,null,null,null,null,null,null,null,{"$f":"CONCATENATE(REFERENTES!Q278,\"(\",REFERENTES!R278,\")\")","v":"Sound Bay parcela circular-3(SoundBayPPC-3)"},{"$f":"REFERENTES!S278","v":55560}]
[null,null,null,null,null,null,null,null,null,null,null,null,{"$f":"IF(ISNUMBER(FIND(\"RES\",REFERENTES!$Q$628:$Q$1125,1)),REFERENTES!Q921,\"\")","v":""},{"$f":"REFERENTES!S300","v":0},295,0,1131,"X",null,null,null,null,null,null,null,null,null,{"$f":"CONCATENATE(REFERENTES!Q279,\"(\",REFERENTES!R279,\")\")","v":"South West Bay -2(SWBA-ZP3-SWB-2)"},{"$f":"REFERENTES!S279","v":49327}]
[null,null,null,null,null,null,null,null,null,null,null,null,{"$f":"IF(ISNUMBER(FIND(\"RES\",REFERENTES!$Q$628:$Q$1125,1)),REFERENTES!Q922,\"\")","v":""},{"$f":"REFERENTES!S301","v":0},296,0,1131,"X",null,null,null,null,null,null,null,null,null,{"$f":"CONCATENATE(REFERENTES!Q280,\"(\",REFERENTES!R280,\")\")","v":"Suroeste parcela circular-1(SuroestePPC-1)"},{"$f":"REFERENTES!S280","v":55565}]
[null,null,null,null,null,null,null,null,null,null,null,null,{"$f":"IF(ISNUMBER(FIND(\"RES\",REFERENTES!$Q$628:$Q$1125,1)),REFERENTES!Q923,\"\")","v":""},{"$f":"REFERENTES!S302","v":0},297,0,1131,"X",null,null,null,null,null,null,null,null,null,{"$f":"CONCATENATE(REFERENTES!Q281,\"(\",REFERENTES!R281,\")\")","v":"Suroeste parcela circular-2(SuroestePPC-2)"},{"$f":"REFERENTES!S281","v":55566}]
[null,null,null,null,null,null,null,null,null,null,null,null,{"$f":"IF(ISNUMBER(FIND(\"RES\",REFERENTES!$Q$628:$Q$1125,1)),REFERENTES!Q924,\"\")","v":""},{"$f":"REFERENTES!S303","v":0},298,0,1131,"X",null,null,null,null,null,null,null,null,null,{"$f":"CONCATENATE(REFERENTES!Q282,\"(\",REFERENTES!R282,\")\")","v":"Tangarrá(JURA-ZR1-Tangarrá-1)"},{"$f":"REFERENTES!S282","v":45422}]
[null,null,null,null,null,null,null,null,null,null,null,null,{"$f":"IF(ISNUMBER(FIND(\"RES\",REFERENTES!$Q$628:$Q$1125,1)),REFERENTES!Q925,\"\")","v":""},{"$f":"REFERENTES!S304","v":0},299,0,1131,"X",null,null,null,null,null,null,null,null,null,{"$f":"CONCATENATE(REFERENTES!Q283,\"(\",REFERENTES!R283,\")\")","v":"Tijó(BCISEST-ZR1-Tijó-1)"},{"$f":"REFERENTES!S283","v":42103}]
[null,null,null,null,null,null,null,null,null,null,null,null,{"$f":"IF(ISNUMBER(FIND(\"RES\",REFERENTES!$Q$628:$Q$1125,1)),REFERENTES!Q926,\"\")","v":""},{"$f":"REFERENTES!S305","v":0},300,0,1131,"X",null,null,null,null,null,null,null,null,null,{"$f":"CONCATENATE(REFERENTES!Q284,\"(\",REFERENTES!R284,\")\")","v":"Timba(CAJA-ZUS2-CT-1)"},{"$f":"REFERENTES!S284","v":45830}]
[null,null,null,null,null,null,null,null,null,null,null,null,{"$f":"IF(ISNUMBER(FIND(\"RES\",REFERENTES!$Q$628:$Q$1125,1)),REFERENTES!Q927,\"\")","v":""},{"$f":"REFERENTES!S306","v":0},301,0,1131,"X",null,null,null,null,null,null,null,null,null,{"$f":"CONCATENATE(REFERENTES!Q285,\"(\",REFERENTES!R285,\")\")","v":"Totumo Oriental(CNGTOT-ZP1-Totum-1)"},{"$f":"REFERENTES!S285","v":45257}]
[null,null,null,null,null,null,null,null,null,null,null,null,{"$f":"IF(ISNUMBER(FIND(\"RES\",REFERENTES!$Q$628:$Q$1125,1)),REFERENTES!Q928,\"\")","v":""},{"$f":"REFERENTES!S307","v":0},302,0,1131,"X",null,null,null,null,null,null,null,null,null,{"$f":"CONCATENATE(REFERENTES!Q286,\"(\",REFERENTES!R286,\")\")","v":"Totumo Oriental(CNGTOT-ZP1-Totum-2)"},{"$f":"REFERENTES!S286","v":45259}]
[null,null,null,null,null,null,null,null,null,null,null,null,{"$f":"IF(ISNUMBER(FIND(\"RES\",REFERENTES!$Q$628:$Q$1125,1)),REFERENTES!Q929,\"\")","v":""},{"$f":"REFERENTES!S308","v":0},303,0,1131,"X",null,null,null,null,null,null,null,null,null,{"$f":"CONCATENATE(REFERENTES!Q287,\"(\",REFERENTES!R287,\")\")","v":"Trujillo(ENSENADA-ZP1-TRUJI-1)"},{"$f":"REFERENTES!S287","v":45400}]
[null,null,null,null,null,null,null,null,null,null,null,null,{"$f":"IF(ISNUMBER(FIND(\"RES\",REFERENTES!$Q$628:$Q$1125,1)),REFERENTES!Q930,\"\")","v":""},{"$f":"REFERENTES!S309","v":0},304,0,1131,"X",null,null,null,null,null,null,null,null,null,{"$f":"CONCATENATE(REFERENTES!Q288,\"(\",REFERENTES!R288,\")\")","v":"Tumaco(TCO-ZR2-Tuma-1)"},{"$f":"REFERENTES!S288","v":44506}]
[null,null,null,null,null,null,null,null,null,null,null,null,{"$f":"IF(ISNUMBER(FIND(\"RES\",REFERENTES!$Q$628:$Q$1125,1)),REFERENTES!Q931,\"\")","v":""},{"$f":"REFERENTES!S310","v":0},305,0,1131,"X",null,null,null,null,null,null,null,null,null,{"$f":"CONCATENATE(REFERENTES!Q289,\"(\",REFERENTES!R289,\")\")","v":"Tumaco -1(TCO-ZUS1-SANAND-1)"},{"$f":"REFERENTES!S289","v":45395}]
[null,null,null,null,null,null,null,null,null,null,null,null,{"$f":"IF(ISNUMBER(FIND(\"RES\",REFERENTES!$Q$628:$Q$1125,1)),REFERENTES!Q932,\"\")","v":""},{"$f":"REFERENTES!S311","v":0},306,0,1131,"X",null,null,null,null,null,null,null,null,null,{"$f":"CONCATENATE(REFERENTES!Q290,\"(\",REFERENTES!R290,\")\")","v":"Ultima Boca(BCISLIT-ZR1-UltBoca-1)"},{"$f":"REFERENTES!S290","v":48762}]
[null,null,null,null,null,null,null,null,null,null,null,null,{"$f":"IF(ISNUMBER(FIND(\"RES\",REFERENTES!$Q$628:$Q$1125,1)),REFERENTES!Q933,\"\")","v":""},{"$f":"REFERENTES!S312","v":0},307,0,1131,"X",null,null,null,null,null,null,null,null,null,{"$f":"CONCATENATE(REFERENTES!Q291,\"(\",REFERENTES!R291,\")\")","v":"Valle de los Cangrejos -1(VCAN-ZR1-CANG-1)"},{"$f":"REFERENTES!S291","v":41390}]
[null,null,null,null,null,null,null,null,null,null,null,null,{"$f":"IF(ISNUMBER(FIND(\"RES\",REFERENTES!$Q$628:$Q$1125,1)),REFERENTES!Q934,\"\")","v":""},{"$f":"REFERENTES!S313","v":0},308,0,1131,"X",null,null,null,null,null,null,null,null,null,{"$f":"CONCATENATE(REFERENTES!Q292,\"(\",REFERENTES!R292,\")\")","v":"Valle de los Cangrejos -2(VCAN-ZR1-CANG-2)"},{"$f":"REFERENTES!S292","v":41392}]
[null,null,null,null,null,null,null,null,null,null,null,null,{"$f":"IF(ISNUMBER(FIND(\"RES\",REFERENTES!$Q$628:$Q$1125,1)),REFERENTES!Q935,\"\")","v":""},{"$f":"REFERENTES!S314","v":0},309,0,1131,"X",null,null,null,null,null,null,null,null,null,{"$f":"CONCATENATE(REFERENTES!Q293,\"(\",REFERENTES!R293,\")\")","v":"Valle de los Cangrejos -3(VCAN-ZR1-CANG-3)"},{"$f":"REFERENTES!S293","v":41394}]
[null,null,null,null,null,null,null,null,null,null,null,null,{"$f":"IF(ISNUMBER(FIND(\"RES\",REFERENTES!$Q$628:$Q$1125,1)),REFERENTES!Q936,\"\")","v":""},{"$f":"REFERENTES!S315","v":0},310,0,1131,"X",null,null,null,null,null,null,null,null,null,{"$f":"CONCATENATE(REFERENTES!Q294,\"(\",REFERENTES!R294,\")\")","v":"Velero-1(PVEL-ZP2-VelP-1)"},{"$f":"REFERENTES!S294","v":45157}]
[null,null,null,null,null,null,null,null,null,null,null,null,{"$f":"IF(ISNUMBER(FIND(\"RES\",REFERENTES!$Q$628:$Q$1125,1)),REFERENTES!Q937,\"\")","v":""},{"$f":"REFERENTES!S316","v":0},311,0,1131,"X",null,null,null,null,null,null,null,null,null,{"$f":"CONCATENATE(REFERENTES!Q295,\"(\",REFERENTES!R295,\")\")","v":"Velodia Road parcela circular-1(VelodiaRoadPPC-1)"},{"$f":"REFERENTES!S295","v":55557}]
[null,null,null,null,null,null,null,null,null,null,null,null,{"$f":"IF(ISNUMBER(FIND(\"RES\",REFERENTES!$Q$628:$Q$1125,1)),REFERENTES!Q938,\"\")","v":""},{"$f":"REFERENTES!S317","v":0},312,0,1131,"X",null,null,null,null,null,null,null,null,null,{"$f":"CONCATENATE(REFERENTES!Q296,\"(\",REFERENTES!R296,\")\")","v":"Vía al Mar(JPVI-ZUS1-VíaMar-1)"},{"$f":"REFERENTES!S296","v":44627}]
[null,null,null,null,null,null,null,null,null,null,null,null,{"$f":"IF(ISNUMBER(FIND(\"RES\",REFERENTES!$Q$628:$Q$1125,1)),REFERENTES!Q939,\"\")","v":""},{"$f":"REFERENTES!S318","v":0},313,0,1131,"X",null,null,null,null,null,null,null,null,null,{"$f":"CONCATENATE(REFERENTES!Q297,\"(\",REFERENTES!R297,\")\")","v":"Waipare(MAYO-ZR3-MWA-1)"},{"$f":"REFERENTES!S297","v":45839}]
[null,null,null,null,null,null,null,null,null,null,null,null,{"$f":"IF(ISNUMBER(FIND(\"RES\",REFERENTES!$Q$628:$Q$1125,1)),REFERENTES!Q940,\"\")","v":""},{"$f":"REFERENTES!S319","v":0},314,0,1131,"X",null,null,null,null,null,null,null,null,null,{"$f":"CONCATENATE(REFERENTES!Q298,\"(\",REFERENTES!R298,\")\")","v":"Yaru-1(CORI-ZUS1-Yaru-1)"},{"$f":"REFERENTES!S298","v":48442}]
[null,null,null,null,null,null,null,null,null,null,null,null,{"$f":"IF(ISNUMBER(FIND(\"RES\",REFERENTES!$Q$628:$Q$1125,1)),REFERENTES!Q941,\"\")","v":""},{"$f":"REFERENTES!S320","v":0},315,0,1131,"X",null,null,null,null,null,null,null,null,null,{"$f":"CONCATENATE(REFERENTES!Q299,\"(\",REFERENTES!R299,\")\")","v":"Yerbasal -1(DRATR-ZR1-Yerb-1)"},{"$f":"REFERENTES!S299","v":48523}]
[null,null,null,null,null,null,null,null,null,null,null,null,{"$f":"IF(ISNUMBER(FIND(\"RES\",REFERENTES!$Q$628:$Q$1125,1)),REFERENTES!Q942,\"\")","v":""},{"$f":"REFERENTES!S321","v":0},316,0,1131,"X",null,null,null,null,null,null,null,null,null,{"$f":"CONCATENATE(REFERENTES!Q300,\"(\",REFERENTES!R300,\")\")","v":"()"},{"$f":"REFERENTES!S300","v":0}]
[null,null,null,null,null,null,null,null,null,null,null,null,{"$f":"IF(ISNUMBER(FIND(\"RES\",REFERENTES!$Q$628:$Q$1125,1)),REFERENTES!Q943,\"\")","v":""},{"$f":"REFERENTES!S322","v":0},317,0,1131,"X",null,null,null,null,null,null,null,null,null,{"$f":"CONCATENATE(REFERENTES!Q301,\"(\",REFERENTES!R301,\")\")","v":"()"},{"$f":"REFERENTES!S301","v":0}]
[null,null,null,null,null,null,null,null,null,null,null,null,{"$f":"IF(ISNUMBER(FIND(\"RES\",REFERENTES!$Q$628:$Q$1125,1)),REFERENTES!Q944,\"\")","v":""},{"$f":"REFERENTES!S323","v":0},318,0,1131,"X",null,null,null,null,null,null,null,null,null,{"$f":"CONCATENATE(REFERENTES!Q302,\"(\",REFERENTES!R302,\")\")","v":"()"},{"$f":"REFERENTES!S302","v":0}]
[null,null,null,null,null,null,null,null,null,null,null,null,{"$f":"IF(ISNUMBER(FIND(\"RES\",REFERENTES!$Q$628:$Q$1125,1)),REFERENTES!Q945,\"\")","v":""},{"$f":"REFERENTES!S324","v":0},319,0,1131,"X",null,null,null,null,null,null,null,null,null,{"$f":"CONCATENATE(REFERENTES!Q303,\"(\",REFERENTES!R303,\")\")","v":"()"},{"$f":"REFERENTES!S303","v":0}]
[null,null,null,null,null,null,null,null,null,null,null,null,{"$f":"IF(ISNUMBER(FIND(\"RES\",REFERENTES!$Q$628:$Q$1125,1)),REFERENTES!Q946,\"\")","v":""},{"$f":"REFERENTES!S325","v":0},320,0,1131,"X",null,null,null,null,null,null,null,null,null,{"$f":"CONCATENATE(REFERENTES!Q304,\"(\",REFERENTES!R304,\")\")","v":"()"},{"$f":"REFERENTES!S304","v":0}]
[null,null,null,null,null,null,null,null,null,null,null,null,{"$f":"IF(ISNUMBER(FIND(\"RES\",REFERENTES!$Q$628:$Q$1125,1)),REFERENTES!Q947,\"\")","v":""},{"$f":"REFERENTES!S326","v":0},321,0,1131,"X",null,null,null,null,null,null,null,null,null,{"$f":"CONCATENATE(REFERENTES!Q305,\"(\",REFERENTES!R305,\")\")","v":"()"},{"$f":"REFERENTES!S305","v":0}]
[null,null,null,null,null,null,null,null,null,null,null,null,{"$f":"IF(ISNUMBER(FIND(\"RES\",REFERENTES!$Q$628:$Q$1125,1)),REFERENTES!Q948,\"\")","v":""},{"$f":"REFERENTES!S327","v":0},322,0,{"$f":"IF(P327=0,MAX($O$6:$O$1135)+1,O327)","v":1131},{"$f":"IFERROR(VLOOKUP(SMALL($Q$6:$Q$1135,O327),$O$6:$P$1135,2,FALSE),\"X\")","v":"X"},null,null,null,null,null,null,null,null,null,{"$f":"CONCATENATE(REFERENTES!Q306,\"(\",REFERENTES!R306,\")\")","v":"()"},{"$f":"REFERENTES!S306","v":0}]
[null,null,null,null,null,null,null,null,null,null,null,null,{"$f":"IF(ISNUMBER(FIND(\"RES\",REFERENTES!$Q$628:$Q$1125,1)),REFERENTES!Q949,\"\")","v":""},{"$f":"REFERENTES!S328","v":0},323,0,1131,"X",null,null,null,null,null,null,null,null,null,{"$f":"CONCATENATE(REFERENTES!Q307,\"(\",REFERENTES!R307,\")\")","v":"()"},{"$f":"REFERENTES!S307","v":0}]
[null,null,null,null,null,null,null,null,null,null,null,null,{"$f":"IF(ISNUMBER(FIND(\"RES\",REFERENTES!$Q$628:$Q$1125,1)),REFERENTES!Q950,\"\")","v":""},{"$f":"REFERENTES!S329","v":0},324,{"$f":"IF(M329=\"\",0,M329)","v":0},1131,"X",null,null,null,null,null,null,null,null,null,{"$f":"CONCATENATE(REFERENTES!Q308,\"(\",REFERENTES!R308,\")\")","v":"()"},{"$f":"REFERENTES!S308","v":0}]
[null,null,null,null,null,null,null,null,null,null,null,null,{"$f":"IF(ISNUMBER(FIND(\"RES\",REFERENTES!$Q$628:$Q$1125,1)),REFERENTES!Q951,\"\")","v":""},{"$f":"REFERENTES!S330","v":0},325,0,1131,"X",null,null,null,null,null,null,null,null,null,{"$f":"CONCATENATE(REFERENTES!Q309,\"(\",REFERENTES!R309,\")\")","v":"()"},{"$f":"REFERENTES!S309","v":0}]
[null,null,null,null,null,null,null,null,null,null,null,null,{"$f":"IF(ISNUMBER(FIND(\"RES\",REFERENTES!$Q$628:$Q$1125,1)),REFERENTES!Q952,\"\")","v":""},{"$f":"REFERENTES!S331","v":0},326,0,1131,"X",null,null,null,null,null,null,null,null,null,{"$f":"CONCATENATE(REFERENTES!Q310,\"(\",REFERENTES!R310,\")\")","v":"()"},{"$f":"REFERENTES!S310","v":0}]
[null,null,null,null,null,null,null,null,null,null,null,null,{"$f":"IF(ISNUMBER(FIND(\"RES\",REFERENTES!$Q$628:$Q$1125,1)),REFERENTES!Q953,\"\")","v":""},{"$f":"REFERENTES!S332","v":0},327,0,1131,"X",null,null,null,null,null,null,null,null,null,{"$f":"CONCATENATE(REFERENTES!Q311,\"(\",REFERENTES!R311,\")\")","v":"()"},{"$f":"REFERENTES!S311","v":0}]
[null,null,null,null,null,null,null,null,null,null,null,null,{"$f":"IF(ISNUMBER(FIND(\"RES\",REFERENTES!$Q$628:$Q$1125,1)),REFERENTES!Q954,\"\")","v":""},{"$f":"REFERENTES!S333","v":0},328,0,1131,"X",null,null,null,null,null,null,null,null,null,{"$f":"CONCATENATE(REFERENTES!Q312,\"(\",REFERENTES!R312,\")\")","v":"()"},{"$f":"REFERENTES!S312","v":0}]
[null,null,null,null,null,null,null,null,null,null,null,null,{"$f":"IF(ISNUMBER(FIND(\"RES\",REFERENTES!$Q$628:$Q$1125,1)),REFERENTES!Q955,\"\")","v":""},{"$f":"REFERENTES!S334","v":0},329,0,1131,"X",null,null,null,null,null,null,null,null,null,{"$f":"CONCATENATE(REFERENTES!Q313,\"(\",REFERENTES!R313,\")\")","v":"()"},{"$f":"REFERENTES!S313","v":0}]
[null,null,null,null,null,null,null,null,null,null,null,null,{"$f":"IF(ISNUMBER(FIND(\"RES\",REFERENTES!$Q$628:$Q$1125,1)),REFERENTES!Q956,\"\")","v":""},{"$f":"REFERENTES!S335","v":0},330,0,1131,"X",null,null,null,null,null,null,null,null,null,{"$f":"CONCATENATE(REFERENTES!Q314,\"(\",REFERENTES!R314,\")\")","v":"()"},{"$f":"REFERENTES!S314","v":0}]
[null,null,null,null,null,null,null,null,null,null,null,null,{"$f":"IF(ISNUMBER(FIND(\"RES\",REFERENTES!$Q$628:$Q$1125,1)),REFERENTES!Q957,\"\")","v":""},{"$f":"REFERENTES!S336","v":0},331,0,1131,"X",null,null,null,null,null,null,null,null,null,{"$f":"CONCATENATE(REFERENTES!Q315,\"(\",REFERENTES!R315,\")\")","v":"()"},{"$f":"REFERENTES!S315","v":0}]
[null,null,null,null,null,null,null,null,null,null,null,null,{"$f":"IF(ISNUMBER(FIND(\"RES\",REFERENTES!$Q$628:$Q$1125,1)),REFERENTES!Q958,\"\")","v":""},{"$f":"REFERENTES!S337","v":0},332,0,1131,"X",null,null,null,null,null,null,null,null,null,{"$f":"CONCATENATE(REFERENTES!Q316,\"(\",REFERENTES!R316,\")\")","v":"()"},{"$f":"REFERENTES!S316","v":0}]
[null,null,null,null,null,null,null,null,null,null,null,null,{"$f":"IF(ISNUMBER(FIND(\"RES\",REFERENTES!$Q$628:$Q$1125,1)),REFERENTES!Q959,\"\")","v":""},{"$f":"REFERENTES!S338","v":0},333,0,1131,"X",null,null,null,null,null,null,null,null,null,{"$f":"CONCATENATE(REFERENTES!Q317,\"(\",REFERENTES!R317,\")\")","v":"()"},{"$f":"REFERENTES!S317","v":0}]
[null,null,null,null,null,null,null,null,null,null,null,null,{"$f":"IF(ISNUMBER(FIND(\"RES\",REFERENTES!$Q$628:$Q$1125,1)),REFERENTES!Q960,\"\")","v":""},{"$f":"REFERENTES!S339","v":0},334,0,1131,"X",null,null,null,null,null,null,null,null,null,{"$f":"CONCATENATE(REFERENTES!Q318,\"(\",REFERENTES!R318,\")\")","v":"()"},{"$f":"REFERENTES!S318","v":0}]
[null,null,null,null,null,null,null,null,null,null,null,null,{"$f":"IF(ISNUMBER(FIND(\"RES\",REFERENTES!$Q$628:$Q$1125,1)),REFERENTES!Q961,\"\")","v":""},{"$f":"REFERENTES!S340","v":0},335,0,1131,"X",null,null,null,null,null,null,null,null,null,{"$f":"CONCATENATE(REFERENTES!Q319,\"(\",REFERENTES!R319,\")\")","v":"()"},{"$f":"REFERENTES!S319","v":0}]
[null,null,null,null,null,null,null,null,null,null,null,null,{"$f":"IF(ISNUMBER(FIND(\"RES\",REFERENTES!$Q$628:$Q$1125,1)),REFERENTES!Q962,\"\")","v":""},{"$f":"REFERENTES!S341","v":0},336,0,1131,"X",null,null,null,null,null,null,null,null,null,{"$f":"CONCATENATE(REFERENTES!Q320,\"(\",REFERENTES!R320,\")\")","v":"()"},{"$f":"REFERENTES!S320","v":0}]
[null,null,null,null,null,null,null,null,null,null,null,null,{"$f":"IF(ISNUMBER(FIND(\"RES\",REFERENTES!$Q$628:$Q$1125,1)),REFERENTES!Q963,\"\")","v":""},{"$f":"REFERENTES!S342","v":0},337,0,1131,"X",null,null,null,null,null,null,null,null,null,{"$f":"CONCATENATE(REFERENTES!Q321,\"(\",REFERENTES!R321,\")\")","v":"()"},{"$f":"REFERENTES!S321","v":0}]
[null,null,null,null,null,null,null,null,null,null,null,null,{"$f":"IF(ISNUMBER(FIND(\"RES\",REFERENTES!$Q$628:$Q$1125,1)),REFERENTES!Q964,\"\")","v":""},{"$f":"REFERENTES!S343","v":0},338,0,1131,"X",null,null,null,null,null,null,null,null,null,{"$f":"CONCATENATE(REFERENTES!Q322,\"(\",REFERENTES!R322,\")\")","v":"()"},{"$f":"REFERENTES!S322","v":0}]
[null,null,null,null,null,null,null,null,null,null,null,null,{"$f":"IF(ISNUMBER(FIND(\"RES\",REFERENTES!$Q$628:$Q$1125,1)),REFERENTES!Q965,\"\")","v":""},{"$f":"REFERENTES!S344","v":0},339,0,1131,"X",null,null,null,null,null,null,null,null,null,{"$f":"CONCATENATE(REFERENTES!Q323,\"(\",REFERENTES!R323,\")\")","v":"()"},{"$f":"REFERENTES!S323","v":0}]
[null,null,null,null,null,null,null,null,null,null,null,null,{"$f":"IF(ISNUMBER(FIND(\"RES\",REFERENTES!$Q$628:$Q$1125,1)),REFERENTES!Q966,\"\")","v":""},{"$f":"REFERENTES!S345","v":0},340,0,1131,"X",null,null,null,null,null,null,null,null,null,{"$f":"CONCATENATE(REFERENTES!Q324,\"(\",REFERENTES!R324,\")\")","v":"()"},{"$f":"REFERENTES!S324","v":0}]
[null,null,null,null,null,null,null,null,null,null,null,null,{"$f":"IF(ISNUMBER(FIND(\"RES\",REFERENTES!$Q$628:$Q$1125,1)),REFERENTES!Q967,\"\")","v":""},{"$f":"REFERENTES!S346","v":0},341,0,1131,"X",null,null,null,null,null,null,null,null,null,{"$f":"CONCATENATE(REFERENTES!Q325,\"(\",REFERENTES!R325,\")\")","v":"()"},{"$f":"REFERENTES!S325","v":0}]
[null,null,null,null,null,null,null,null,null,null,null,null,{"$f":"IF(ISNUMBER(FIND(\"RES\",REFERENTES!$Q$628:$Q$1125,1)),REFERENTES!Q968,\"\")","v":""},{"$f":"REFERENTES!S347","v":0},342,0,1131,"X",null,null,null,null,null,null,null,null,null,{"$f":"CONCATENATE(REFERENTES!Q326,\"(\",REFERENTES!R326,\")\")","v":"()"},{"$f":"REFERENTES!S326","v":0}]
[null,null,null,null,null,null,null,null,null,null,null,null,{"$f":"IF(ISNUMBER(FIND(\"RES\",REFERENTES!$Q$628:$Q$1125,1)),REFERENTES!Q969,\"\")","v":""},{"$f":"REFERENTES!S348","v":0},343,0,1131,"X",null,null,null,null,null,null,null,null,null,{"$f":"CONCATENATE(REFERENTES!Q327,\"(\",REFERENTES!R327,\")\")","v":"()"},{"$f":"REFERENTES!S327","v":0}]
[null,null,null,null,null,null,null,null,null,null,null,null,{"$f":"IF(ISNUMBER(FIND(\"RES\",REFERENTES!$Q$628:$Q$1125,1)),REFERENTES!Q970,\"\")","v":""},{"$f":"REFERENTES!S349","v":0},344,0,1131,"X",null,null,null,null,null,null,null,null,null,{"$f":"CONCATENATE(REFERENTES!Q328,\"(\",REFERENTES!R328,\")\")","v":"()"},{"$f":"REFERENTES!S328","v":0}]
[null,null,null,null,null,null,null,null,null,null,null,null,{"$f":"IF(ISNUMBER(FIND(\"RES\",REFERENTES!$Q$628:$Q$1125,1)),REFERENTES!Q971,\"\")","v":""},{"$f":"REFERENTES!S350","v":0},345,0,1131,"X",null,null,null,null,null,null,null,null,null,{"$f":"CONCATENATE(REFERENTES!Q329,\"(\",REFERENTES!R329,\")\")","v":"()"},{"$f":"REFERENTES!S329","v":0}]
[null,null,null,null,null,null,null,null,null,null,null,null,{"$f":"IF(ISNUMBER(FIND(\"RES\",REFERENTES!$Q$628:$Q$1125,1)),REFERENTES!Q972,\"\")","v":""},{"$f":"REFERENTES!S351","v":0},346,0,1131,"X",null,null,null,null,null,null,null,null,null,{"$f":"CONCATENATE(REFERENTES!Q330,\"(\",REFERENTES!R330,\")\")","v":"()"},{"$f":"REFERENTES!S330","v":0}]
[null,null,null,null,null,null,null,null,null,null,null,null,{"$f":"IF(ISNUMBER(FIND(\"RES\",REFERENTES!$Q$628:$Q$1125,1)),REFERENTES!Q973,\"\")","v":""},{"$f":"REFERENTES!S352","v":0},347,0,1131,"X",null,null,null,null,null,null,null,null,null,{"$f":"CONCATENATE(REFERENTES!Q331,\"(\",REFERENTES!R331,\")\")","v":"()"},{"$f":"REFERENTES!S331","v":0}]
[null,null,null,null,null,null,null,null,null,null,null,null,{"$f":"IF(ISNUMBER(FIND(\"RES\",REFERENTES!$Q$628:$Q$1125,1)),REFERENTES!Q974,\"\")","v":""},{"$f":"REFERENTES!S353","v":0},348,0,1131,"X",null,null,null,null,null,null,null,null,null,{"$f":"CONCATENATE(REFERENTES!Q332,\"(\",REFERENTES!R332,\")\")","v":"()"},{"$f":"REFERENTES!S332","v":0}]
[null,null,null,null,null,null,null,null,null,null,null,null,{"$f":"IF(ISNUMBER(FIND(\"RES\",REFERENTES!$Q$628:$Q$1125,1)),REFERENTES!Q975,\"\")","v":""},{"$f":"REFERENTES!S354","v":0},349,0,1131,"X",null,null,null,null,null,null,null,null,null,{"$f":"CONCATENATE(REFERENTES!Q333,\"(\",REFERENTES!R333,\")\")","v":"()"},{"$f":"REFERENTES!S333","v":0}]
[null,null,null,null,null,null,null,null,null,null,null,null,{"$f":"IF(ISNUMBER(FIND(\"RES\",REFERENTES!$Q$628:$Q$1125,1)),REFERENTES!Q976,\"\")","v":""},{"$f":"REFERENTES!S355","v":0},350,0,1131,"X",null,null,null,null,null,null,null,null,null,{"$f":"CONCATENATE(REFERENTES!Q334,\"(\",REFERENTES!R334,\")\")","v":"()"},{"$f":"REFERENTES!S334","v":0}]
[null,null,null,null,null,null,null,null,null,null,null,null,{"$f":"IF(ISNUMBER(FIND(\"RES\",REFERENTES!$Q$628:$Q$1125,1)),REFERENTES!Q977,\"\")","v":""},{"$f":"REFERENTES!S356","v":0},351,0,1131,"X",null,null,null,null,null,null,null,null,null,{"$f":"CONCATENATE(REFERENTES!Q335,\"(\",REFERENTES!R335,\")\")","v":"()"},{"$f":"REFERENTES!S335","v":0}]
[null,null,null,null,null,null,null,null,null,null,null,null,{"$f":"IF(ISNUMBER(FIND(\"RES\",REFERENTES!$Q$628:$Q$1125,1)),REFERENTES!Q978,\"\")","v":""},{"$f":"REFERENTES!S357","v":0},352,0,1131,"X",null,null,null,null,null,null,null,null,null,{"$f":"CONCATENATE(REFERENTES!Q336,\"(\",REFERENTES!R336,\")\")","v":"()"},{"$f":"REFERENTES!S336","v":0}]
[null,null,null,null,null,null,null,null,null,null,null,null,{"$f":"IF(ISNUMBER(FIND(\"RES\",REFERENTES!$Q$628:$Q$1125,1)),REFERENTES!Q979,\"\")","v":""},{"$f":"REFERENTES!S358","v":0},353,0,1131,"X",null,null,null,null,null,null,null,null,null,{"$f":"CONCATENATE(REFERENTES!Q337,\"(\",REFERENTES!R337,\")\")","v":"()"},{"$f":"REFERENTES!S337","v":0}]
[null,null,null,null,null,null,null,null,null,null,null,null,{"$f":"IF(ISNUMBER(FIND(\"RES\",REFERENTES!$Q$628:$Q$1125,1)),REFERENTES!Q980,\"\")","v":""},{"$f":"REFERENTES!S359","v":0},354,0,1131,"X",null,null,null,null,null,null,null,null,null,{"$f":"CONCATENATE(REFERENTES!Q338,\"(\",REFERENTES!R338,\")\")","v":"()"},{"$f":"REFERENTES!S338","v":0}]
[null,null,null,null,null,null,null,null,null,null,null,null,{"$f":"IF(ISNUMBER(FIND(\"RES\",REFERENTES!$Q$628:$Q$1125,1)),REFERENTES!Q981,\"\")","v":""},{"$f":"REFERENTES!S360","v":0},355,0,1131,"X",null,null,null,null,null,null,null,null,null,{"$f":"CONCATENATE(REFERENTES!Q339,\"(\",REFERENTES!R339,\")\")","v":"()"},{"$f":"REFERENTES!S339","v":0}]
[null,null,null,null,null,null,null,null,null,null,null,null,{"$f":"IF(ISNUMBER(FIND(\"RES\",REFERENTES!$Q$628:$Q$1125,1)),REFERENTES!Q982,\"\")","v":""},{"$f":"REFERENTES!S361","v":0},356,0,1131,"X",null,null,null,null,null,null,null,null,null,{"$f":"CONCATENATE(REFERENTES!Q340,\"(\",REFERENTES!R340,\")\")","v":"()"},{"$f":"REFERENTES!S340","v":0}]
[null,null,null,null,null,null,null,null,null,null,null,null,{"$f":"IF(ISNUMBER(FIND(\"RES\",REFERENTES!$Q$628:$Q$1125,1)),REFERENTES!Q983,\"\")","v":""},{"$f":"REFERENTES!S362","v":0},357,0,1131,"X",null,null,null,null,null,null,null,null,null,{"$f":"CONCATENATE(REFERENTES!Q341,\"(\",REFERENTES!R341,\")\")","v":"()"},{"$f":"REFERENTES!S341","v":0}]
[null,null,null,null,null,null,null,null,null,null,null,null,{"$f":"IF(ISNUMBER(FIND(\"RES\",REFERENTES!$Q$628:$Q$1125,1)),REFERENTES!Q984,\"\")","v":""},{"$f":"REFERENTES!S363","v":0},358,0,1131,"X",null,null,null,null,null,null,null,null,null,{"$f":"CONCATENATE(REFERENTES!Q342,\"(\",REFERENTES!R342,\")\")","v":"()"},{"$f":"REFERENTES!S342","v":0}]
[null,null,null,null,null,null,null,null,null,null,null,null,{"$f":"IF(ISNUMBER(FIND(\"RES\",REFERENTES!$Q$628:$Q$1125,1)),REFERENTES!Q985,\"\")","v":""},{"$f":"REFERENTES!S364","v":0},359,0,1131,"X",null,null,null,null,null,null,null,null,null,{"$f":"CONCATENATE(REFERENTES!Q343,\"(\",REFERENTES!R343,\")\")","v":"()"},{"$f":"REFERENTES!S343","v":0}]
[null,null,null,null,null,null,null,null,null,null,null,null,{"$f":"IF(ISNUMBER(FIND(\"RES\",REFERENTES!$Q$628:$Q$1125,1)),REFERENTES!Q986,\"\")","v":""},{"$f":"REFERENTES!S365","v":0},360,0,1131,"X",null,null,null,null,null,null,null,null,null,{"$f":"CONCATENATE(REFERENTES!Q344,\"(\",REFERENTES!R344,\")\")","v":"()"},{"$f":"REFERENTES!S344","v":0}]
[null,null,null,null,null,null,null,null,null,null,null,null,{"$f":"IF(ISNUMBER(FIND(\"RES\",REFERENTES!$Q$628:$Q$1125,1)),REFERENTES!Q987,\"\")","v":""},{"$f":"REFERENTES!S366","v":0},361,0,1131,"X",null,null,null,null,null,null,null,null,null,{"$f":"CONCATENATE(REFERENTES!Q345,\"(\",REFERENTES!R345,\")\")","v":"()"},{"$f":"REFERENTES!S345","v":0}]
[null,null,null,null,null,null,null,null,null,null,null,null,{"$f":"IF(ISNUMBER(FIND(\"RES\",REFERENTES!$Q$628:$Q$1125,1)),REFERENTES!Q988,\"\")","v":""},{"$f":"REFERENTES!S367","v":0},362,0,1131,"X",null,null,null,null,null,null,null,null,null,{"$f":"CONCATENATE(REFERENTES!Q346,\"(\",REFERENTES!R346,\")\")","v":"()"},{"$f":"REFERENTES!S346","v":0}]
[null,null,null,null,null,null,null,null,null,null,null,null,{"$f":"IF(ISNUMBER(FIND(\"RES\",REFERENTES!$Q$628:$Q$1125,1)),REFERENTES!Q989,\"\")","v":""},{"$f":"REFERENTES!S368","v":0},363,0,1131,"X",null,null,null,null,null,null,null,null,null,{"$f":"CONCATENATE(REFERENTES!Q347,\"(\",REFERENTES!R347,\")\")","v":"()"},{"$f":"REFERENTES!S347","v":0}]
[null,null,null,null,null,null,null,null,null,null,null,null,{"$f":"IF(ISNUMBER(FIND(\"RES\",REFERENTES!$Q$628:$Q$1125,1)),REFERENTES!Q990,\"\")","v":""},{"$f":"REFERENTES!S369","v":0},364,0,1131,"X",null,null,null,null,null,null,null,null,null,{"$f":"CONCATENATE(REFERENTES!Q348,\"(\",REFERENTES!R348,\")\")","v":"()"},{"$f":"REFERENTES!S348","v":0}]
[null,null,null,null,null,null,null,null,null,null,null,null,{"$f":"IF(ISNUMBER(FIND(\"RES\",REFERENTES!$Q$628:$Q$1125,1)),REFERENTES!Q991,\"\")","v":""},{"$f":"REFERENTES!S370","v":0},365,0,1131,"X",null,null,null,null,null,null,null,null,null,{"$f":"CONCATENATE(REFERENTES!Q349,\"(\",REFERENTES!R349,\")\")","v":"()"},{"$f":"REFERENTES!S349","v":0}]
[null,null,null,null,null,null,null,null,null,null,null,null,{"$f":"IF(ISNUMBER(FIND(\"RES\",REFERENTES!$Q$628:$Q$1125,1)),REFERENTES!Q992,\"\")","v":""},{"$f":"REFERENTES!S371","v":0},366,0,1131,"X",null,null,null,null,null,null,null,null,null,{"$f":"CONCATENATE(REFERENTES!Q350,\"(\",REFERENTES!R350,\")\")","v":"()"},{"$f":"REFERENTES!S350","v":0}]
[null,null,null,null,null,null,null,null,null,null,null,null,{"$f":"IF(ISNUMBER(FIND(\"RES\",REFERENTES!$Q$628:$Q$1125,1)),REFERENTES!Q993,\"\")","v":""},{"$f":"REFERENTES!S372","v":0},367,0,1131,"X",null,null,null,null,null,null,null,null,null,{"$f":"CONCATENATE(REFERENTES!Q351,\"(\",REFERENTES!R351,\")\")","v":"()"},{"$f":"REFERENTES!S351","v":0}]
[null,null,null,null,null,null,null,null,null,null,null,null,{"$f":"IF(ISNUMBER(FIND(\"RES\",REFERENTES!$Q$628:$Q$1125,1)),REFERENTES!Q994,\"\")","v":""},{"$f":"REFERENTES!S373","v":0},368,0,1131,"X",null,null,null,null,null,null,null,null,null,{"$f":"CONCATENATE(REFERENTES!Q352,\"(\",REFERENTES!R352,\")\")","v":"()"},{"$f":"REFERENTES!S352","v":0}]
[null,null,null,null,null,null,null,null,null,null,null,null,{"$f":"IF(ISNUMBER(FIND(\"RES\",REFERENTES!$Q$628:$Q$1125,1)),REFERENTES!Q995,\"\")","v":""},{"$f":"REFERENTES!S374","v":0},369,0,1131,"X",null,null,null,null,null,null,null,null,null,{"$f":"CONCATENATE(REFERENTES!Q353,\"(\",REFERENTES!R353,\")\")","v":"()"},{"$f":"REFERENTES!S353","v":0}]
[null,null,null,null,null,null,null,null,null,null,null,null,{"$f":"IF(ISNUMBER(FIND(\"RES\",REFERENTES!$Q$628:$Q$1125,1)),REFERENTES!Q996,\"\")","v":""},{"$f":"REFERENTES!S375","v":0},370,0,1131,"X",null,null,null,null,null,null,null,null,null,{"$f":"CONCATENATE(REFERENTES!Q354,\"(\",REFERENTES!R354,\")\")","v":"()"},{"$f":"REFERENTES!S354","v":0}]
[null,null,null,null,null,null,null,null,null,null,null,null,{"$f":"IF(ISNUMBER(FIND(\"RES\",REFERENTES!$Q$628:$Q$1125,1)),REFERENTES!Q997,\"\")","v":""},{"$f":"REFERENTES!S376","v":0},371,0,1131,"X",null,null,null,null,null,null,null,null,null,{"$f":"CONCATENATE(REFERENTES!Q355,\"(\",REFERENTES!R355,\")\")","v":"()"},{"$f":"REFERENTES!S355","v":0}]
[null,null,null,null,null,null,null,null,null,null,null,null,{"$f":"IF(ISNUMBER(FIND(\"RES\",REFERENTES!$Q$628:$Q$1125,1)),REFERENTES!Q998,\"\")","v":""},{"$f":"REFERENTES!S377","v":0},372,0,1131,"X",null,null,null,null,null,null,null,null,null,{"$f":"CONCATENATE(REFERENTES!Q356,\"(\",REFERENTES!R356,\")\")","v":"()"},{"$f":"REFERENTES!S356","v":0}]
[null,null,null,null,null,null,null,null,null,null,null,null,{"$f":"IF(ISNUMBER(FIND(\"RES\",REFERENTES!$Q$628:$Q$1125,1)),REFERENTES!Q999,\"\")","v":""},{"$f":"REFERENTES!S378","v":0},373,0,1131,"X",null,null,null,null,null,null,null,null,null,{"$f":"CONCATENATE(REFERENTES!Q357,\"(\",REFERENTES!R357,\")\")","v":"()"},{"$f":"REFERENTES!S357","v":0}]
[null,null,null,null,null,null,null,null,null,null,null,null,{"$f":"IF(ISNUMBER(FIND(\"RES\",REFERENTES!$Q$628:$Q$1125,1)),REFERENTES!Q1000,\"\")","v":""},{"$f":"REFERENTES!S379","v":0},374,0,1131,"X",null,null,null,null,null,null,null,null,null,{"$f":"CONCATENATE(REFERENTES!Q358,\"(\",REFERENTES!R358,\")\")","v":"()"},{"$f":"REFERENTES!S358","v":0}]
[null,null,null,null,null,null,null,null,null,null,null,null,{"$f":"IF(ISNUMBER(FIND(\"RES\",REFERENTES!$Q$628:$Q$1125,1)),REFERENTES!Q1001,\"\")","v":""},{"$f":"REFERENTES!S380","v":0},375,0,1131,"X",null,null,null,null,null,null,null,null,null,{"$f":"CONCATENATE(REFERENTES!Q359,\"(\",REFERENTES!R359,\")\")","v":"()"},{"$f":"REFERENTES!S359","v":0}]
[null,null,null,null,null,null,null,null,null,null,null,null,{"$f":"IF(ISNUMBER(FIND(\"RES\",REFERENTES!$Q$628:$Q$1125,1)),REFERENTES!Q1002,\"\")","v":""},{"$f":"REFERENTES!S381","v":0},376,0,1131,"X",null,null,null,null,null,null,null,null,null,{"$f":"CONCATENATE(REFERENTES!Q360,\"(\",REFERENTES!R360,\")\")","v":"()"},{"$f":"REFERENTES!S360","v":0}]
[null,null,null,null,null,null,null,null,null,null,null,null,{"$f":"IF(ISNUMBER(FIND(\"RES\",REFERENTES!$Q$628:$Q$1125,1)),REFERENTES!Q1003,\"\")","v":""},{"$f":"REFERENTES!S382","v":0},377,0,1131,"X",null,null,null,null,null,null,null,null,null,{"$f":"CONCATENATE(REFERENTES!Q361,\"(\",REFERENTES!R361,\")\")","v":"()"},{"$f":"REFERENTES!S361","v":0}]
[null,null,null,null,null,null,null,null,null,null,null,null,{"$f":"IF(ISNUMBER(FIND(\"RES\",REFERENTES!$Q$628:$Q$1125,1)),REFERENTES!Q1004,\"\")","v":""},{"$f":"REFERENTES!S383","v":0},378,0,1131,"X",null,null,null,null,null,null,null,null,null,{"$f":"CONCATENATE(REFERENTES!Q362,\"(\",REFERENTES!R362,\")\")","v":"()"},{"$f":"REFERENTES!S362","v":0}]
[null,null,null,null,null,null,null,null,null,null,null,null,{"$f":"IF(ISNUMBER(FIND(\"RES\",REFERENTES!$Q$628:$Q$1125,1)),REFERENTES!Q1005,\"\")","v":""},{"$f":"REFERENTES!S384","v":0},379,0,1131,"X",null,null,null,null,null,null,null,null,null,{"$f":"CONCATENATE(REFERENTES!Q363,\"(\",REFERENTES!R363,\")\")","v":"()"},{"$f":"REFERENTES!S363","v":0}]
[null,null,null,null,null,null,null,null,null,null,null,null,{"$f":"IF(ISNUMBER(FIND(\"RES\",REFERENTES!$Q$628:$Q$1125,1)),REFERENTES!Q1006,\"\")","v":""},{"$f":"REFERENTES!S385","v":0},380,0,1131,"X",null,null,null,null,null,null,null,null,null,{"$f":"CONCATENATE(REFERENTES!Q364,\"(\",REFERENTES!R364,\")\")","v":"()"},{"$f":"REFERENTES!S364","v":0}]
[null,null,null,null,null,null,null,null,null,null,null,null,{"$f":"IF(ISNUMBER(FIND(\"RES\",REFERENTES!$Q$628:$Q$1125,1)),REFERENTES!Q1007,\"\")","v":""},{"$f":"REFERENTES!S386","v":0},381,0,1131,"X",null,null,null,null,null,null,null,null,null,{"$f":"CONCATENATE(REFERENTES!Q365,\"(\",REFERENTES!R365,\")\")","v":"()"},{"$f":"REFERENTES!S365","v":0}]
[null,null,null,null,null,null,null,null,null,null,null,null,{"$f":"IF(ISNUMBER(FIND(\"RES\",REFERENTES!$Q$628:$Q$1125,1)),REFERENTES!Q1008,\"\")","v":""},{"$f":"REFERENTES!S387","v":0},382,0,1131,"X",null,null,null,null,null,null,null,null,null,{"$f":"CONCATENATE(REFERENTES!Q366,\"(\",REFERENTES!R366,\")\")","v":"()"},{"$f":"REFERENTES!S366","v":0}]
[null,null,null,null,null,null,null,null,null,null,null,null,{"$f":"IF(ISNUMBER(FIND(\"RES\",REFERENTES!$Q$628:$Q$1125,1)),REFERENTES!Q1009,\"\")","v":""},{"$f":"REFERENTES!S388","v":0},383,0,1131,"X",null,null,null,null,null,null,null,null,null,{"$f":"CONCATENATE(REFERENTES!Q367,\"(\",REFERENTES!R367,\")\")","v":"()"},{"$f":"REFERENTES!S367","v":0}]
[null,null,null,null,null,null,null,null,null,null,null,null,{"$f":"IF(ISNUMBER(FIND(\"RES\",REFERENTES!$Q$628:$Q$1125,1)),REFERENTES!Q1010,\"\")","v":""},{"$f":"REFERENTES!S389","v":0},384,0,1131,"X",null,null,null,null,null,null,null,null,null,{"$f":"CONCATENATE(REFERENTES!Q368,\"(\",REFERENTES!R368,\")\")","v":"()"},{"$f":"REFERENTES!S368","v":0}]
[null,null,null,null,null,null,null,null,null,null,null,null,{"$f":"IF(ISNUMBER(FIND(\"RES\",REFERENTES!$Q$628:$Q$1125,1)),REFERENTES!Q1011,\"\")","v":""},{"$f":"REFERENTES!S390","v":0},385,0,1131,"X",null,null,null,null,null,null,null,null,null,{"$f":"CONCATENATE(REFERENTES!Q369,\"(\",REFERENTES!R369,\")\")","v":"()"},{"$f":"REFERENTES!S369","v":0}]
[null,null,null,null,null,null,null,null,null,null,null,null,{"$f":"IF(ISNUMBER(FIND(\"RES\",REFERENTES!$Q$628:$Q$1125,1)),REFERENTES!Q1012,\"\")","v":""},{"$f":"REFERENTES!S391","v":0},386,0,{"$f":"IF(P391=0,MAX($O$6:$O$1135)+1,O391)","v":1131},{"$f":"IFERROR(VLOOKUP(SMALL($Q$6:$Q$1135,O391),$O$6:$P$1135,2,FALSE),\"X\")","v":"X"},null,null,null,null,null,null,null,null,null,{"$f":"CONCATENATE(REFERENTES!Q370,\"(\",REFERENTES!R370,\")\")","v":"()"},{"$f":"REFERENTES!S370","v":0}]
[null,null,null,null,null,null,null,null,null,null,null,null,{"$f":"IF(ISNUMBER(FIND(\"RES\",REFERENTES!$Q$628:$Q$1125,1)),REFERENTES!Q1013,\"\")","v":""},{"$f":"REFERENTES!S392","v":0},387,0,1131,"X",null,null,null,null,null,null,null,null,null,{"$f":"CONCATENATE(REFERENTES!Q371,\"(\",REFERENTES!R371,\")\")","v":"()"},{"$f":"REFERENTES!S371","v":0}]
[null,null,null,null,null,null,null,null,null,null,null,null,{"$f":"IF(ISNUMBER(FIND(\"RES\",REFERENTES!$Q$628:$Q$1125,1)),REFERENTES!Q1014,\"\")","v":""},{"$f":"REFERENTES!S393","v":0},388,{"$f":"IF(M393=\"\",0,M393)","v":0},1131,"X",null,null,null,null,null,null,null,null,null,{"$f":"CONCATENATE(REFERENTES!Q372,\"(\",REFERENTES!R372,\")\")","v":"()"},{"$f":"REFERENTES!S372","v":0}]
[null,null,null,null,null,null,null,null,null,null,null,null,{"$f":"IF(ISNUMBER(FIND(\"RES\",REFERENTES!$Q$628:$Q$1125,1)),REFERENTES!Q1015,\"\")","v":""},{"$f":"REFERENTES!S394","v":0},389,0,1131,"X",null,null,null,null,null,null,null,null,null,{"$f":"CONCATENATE(REFERENTES!Q373,\"(\",REFERENTES!R373,\")\")","v":"()"},{"$f":"REFERENTES!S373","v":0}]
[null,null,null,null,null,null,null,null,null,null,null,null,{"$f":"IF(ISNUMBER(FIND(\"RES\",REFERENTES!$Q$628:$Q$1125,1)),REFERENTES!Q1016,\"\")","v":""},{"$f":"REFERENTES!S395","v":0},390,0,1131,"X",null,null,null,null,null,null,null,null,null,{"$f":"CONCATENATE(REFERENTES!Q374,\"(\",REFERENTES!R374,\")\")","v":"()"},{"$f":"REFERENTES!S374","v":0}]
[null,null,null,null,null,null,null,null,null,null,null,null,{"$f":"IF(ISNUMBER(FIND(\"RES\",REFERENTES!$Q$628:$Q$1125,1)),REFERENTES!Q1017,\"\")","v":""},{"$f":"REFERENTES!S396","v":0},391,0,1131,"X",null,null,null,null,null,null,null,null,null,{"$f":"CONCATENATE(REFERENTES!Q375,\"(\",REFERENTES!R375,\")\")","v":"()"},{"$f":"REFERENTES!S375","v":0}]
[null,null,null,null,null,null,null,null,null,null,null,null,{"$f":"IF(ISNUMBER(FIND(\"RES\",REFERENTES!$Q$628:$Q$1125,1)),REFERENTES!Q1018,\"\")","v":""},{"$f":"REFERENTES!S397","v":0},392,0,1131,"X",null,null,null,null,null,null,null,null,null,{"$f":"CONCATENATE(REFERENTES!Q376,\"(\",REFERENTES!R376,\")\")","v":"()"},{"$f":"REFERENTES!S376","v":0}]
[null,null,null,null,null,null,null,null,null,null,null,null,{"$f":"IF(ISNUMBER(FIND(\"RES\",REFERENTES!$Q$628:$Q$1125,1)),REFERENTES!Q1019,\"\")","v":""},{"$f":"REFERENTES!S398","v":0},393,0,1131,"X",null,null,null,null,null,null,null,null,null,{"$f":"CONCATENATE(REFERENTES!Q377,\"(\",REFERENTES!R377,\")\")","v":"()"},{"$f":"REFERENTES!S377","v":0}]
[null,null,null,null,null,null,null,null,null,null,null,null,{"$f":"IF(ISNUMBER(FIND(\"RES\",REFERENTES!$Q$628:$Q$1125,1)),REFERENTES!Q1020,\"\")","v":""},{"$f":"REFERENTES!S399","v":0},394,0,1131,"X",null,null,null,null,null,null,null,null,null,{"$f":"CONCATENATE(REFERENTES!Q378,\"(\",REFERENTES!R378,\")\")","v":"()"},{"$f":"REFERENTES!S378","v":0}]
[null,null,null,null,null,null,null,null,null,null,null,null,{"$f":"IF(ISNUMBER(FIND(\"RES\",REFERENTES!$Q$628:$Q$1125,1)),REFERENTES!Q1021,\"\")","v":""},{"$f":"REFERENTES!S400","v":0},395,0,1131,"X",null,null,null,null,null,null,null,null,null,{"$f":"CONCATENATE(REFERENTES!Q379,\"(\",REFERENTES!R379,\")\")","v":"()"},{"$f":"REFERENTES!S379","v":0}]
[null,null,null,null,null,null,null,null,null,null,null,null,{"$f":"IF(ISNUMBER(FIND(\"RES\",REFERENTES!$Q$628:$Q$1125,1)),REFERENTES!Q1022,\"\")","v":""},{"$f":"REFERENTES!S401","v":0},396,0,1131,"X",null,null,null,null,null,null,null,null,null,{"$f":"CONCATENATE(REFERENTES!Q380,\"(\",REFERENTES!R380,\")\")","v":"()"},{"$f":"REFERENTES!S380","v":0}]
[null,null,null,null,null,null,null,null,null,null,null,null,{"$f":"IF(ISNUMBER(FIND(\"RES\",REFERENTES!$Q$628:$Q$1125,1)),REFERENTES!Q1023,\"\")","v":""},{"$f":"REFERENTES!S402","v":0},397,0,1131,"X",null,null,null,null,null,null,null,null,null,{"$f":"CONCATENATE(REFERENTES!Q381,\"(\",REFERENTES!R381,\")\")","v":"()"},{"$f":"REFERENTES!S381","v":0}]
[null,null,null,null,null,null,null,null,null,null,null,null,{"$f":"IF(ISNUMBER(FIND(\"RES\",REFERENTES!$Q$628:$Q$1125,1)),REFERENTES!Q1024,\"\")","v":""},{"$f":"REFERENTES!S403","v":0},398,0,1131,"X",null,null,null,null,null,null,null,null,null,{"$f":"CONCATENATE(REFERENTES!Q382,\"(\",REFERENTES!R382,\")\")","v":"()"},{"$f":"REFERENTES!S382","v":0}]
[null,null,null,null,null,null,null,null,null,null,null,null,{"$f":"IF(ISNUMBER(FIND(\"RES\",REFERENTES!$Q$628:$Q$1125,1)),REFERENTES!Q1025,\"\")","v":""},{"$f":"REFERENTES!S404","v":0},399,0,1131,"X",null,null,null,null,null,null,null,null,null,{"$f":"CONCATENATE(REFERENTES!Q383,\"(\",REFERENTES!R383,\")\")","v":"()"},{"$f":"REFERENTES!S383","v":0}]
[null,null,null,null,null,null,null,null,null,null,null,null,{"$f":"IF(ISNUMBER(FIND(\"RES\",REFERENTES!$Q$628:$Q$1125,1)),REFERENTES!Q1026,\"\")","v":""},{"$f":"REFERENTES!S405","v":0},400,0,1131,"X",null,null,null,null,null,null,null,null,null,{"$f":"CONCATENATE(REFERENTES!Q384,\"(\",REFERENTES!R384,\")\")","v":"()"},{"$f":"REFERENTES!S384","v":0}]
[null,null,null,null,null,null,null,null,null,null,null,null,{"$f":"IF(ISNUMBER(FIND(\"RES\",REFERENTES!$Q$628:$Q$1125,1)),REFERENTES!Q1027,\"\")","v":""},{"$f":"REFERENTES!S406","v":0},401,0,1131,"X",null,null,null,null,null,null,null,null,null,{"$f":"CONCATENATE(REFERENTES!Q385,\"(\",REFERENTES!R385,\")\")","v":"()"},{"$f":"REFERENTES!S385","v":0}]
[null,null,null,null,null,null,null,null,null,null,null,null,{"$f":"IF(ISNUMBER(FIND(\"RES\",REFERENTES!$Q$628:$Q$1125,1)),REFERENTES!Q1028,\"\")","v":""},{"$f":"REFERENTES!S407","v":0},402,0,1131,"X",null,null,null,null,null,null,null,null,null,{"$f":"CONCATENATE(REFERENTES!Q386,\"(\",REFERENTES!R386,\")\")","v":"()"},{"$f":"REFERENTES!S386","v":0}]
[null,null,null,null,null,null,null,null,null,null,null,null,{"$f":"IF(ISNUMBER(FIND(\"RES\",REFERENTES!$Q$628:$Q$1125,1)),REFERENTES!Q1029,\"\")","v":""},{"$f":"REFERENTES!S408","v":0},403,0,1131,"X",null,null,null,null,null,null,null,null,null,{"$f":"CONCATENATE(REFERENTES!Q387,\"(\",REFERENTES!R387,\")\")","v":"()"},{"$f":"REFERENTES!S387","v":0}]
[null,null,null,null,null,null,null,null,null,null,null,null,{"$f":"IF(ISNUMBER(FIND(\"RES\",REFERENTES!$Q$628:$Q$1125,1)),REFERENTES!Q1030,\"\")","v":""},{"$f":"REFERENTES!S409","v":0},404,0,1131,"X",null,null,null,null,null,null,null,null,null,{"$f":"CONCATENATE(REFERENTES!Q388,\"(\",REFERENTES!R388,\")\")","v":"()"},{"$f":"REFERENTES!S388","v":0}]
[null,null,null,null,null,null,null,null,null,null,null,null,{"$f":"IF(ISNUMBER(FIND(\"RES\",REFERENTES!$Q$628:$Q$1125,1)),REFERENTES!Q1031,\"\")","v":""},{"$f":"REFERENTES!S410","v":0},405,0,1131,"X",null,null,null,null,null,null,null,null,null,{"$f":"CONCATENATE(REFERENTES!Q389,\"(\",REFERENTES!R389,\")\")","v":"()"},{"$f":"REFERENTES!S389","v":0}]
[null,null,null,null,null,null,null,null,null,null,null,null,{"$f":"IF(ISNUMBER(FIND(\"RES\",REFERENTES!$Q$628:$Q$1125,1)),REFERENTES!Q1032,\"\")","v":""},{"$f":"REFERENTES!S411","v":0},406,0,1131,"X",null,null,null,null,null,null,null,null,null,{"$f":"CONCATENATE(REFERENTES!Q390,\"(\",REFERENTES!R390,\")\")","v":"()"},{"$f":"REFERENTES!S390","v":0}]
[null,null,null,null,null,null,null,null,null,null,null,null,{"$f":"IF(ISNUMBER(FIND(\"RES\",REFERENTES!$Q$628:$Q$1125,1)),REFERENTES!Q1033,\"\")","v":""},{"$f":"REFERENTES!S412","v":0},407,0,1131,"X",null,null,null,null,null,null,null,null,null,{"$f":"CONCATENATE(REFERENTES!Q391,\"(\",REFERENTES!R391,\")\")","v":"()"},{"$f":"REFERENTES!S391","v":0}]
[null,null,null,null,null,null,null,null,null,null,null,null,{"$f":"IF(ISNUMBER(FIND(\"RES\",REFERENTES!$Q$628:$Q$1125,1)),REFERENTES!Q1034,\"\")","v":""},{"$f":"REFERENTES!S413","v":0},408,0,1131,"X",null,null,null,null,null,null,null,null,null,{"$f":"CONCATENATE(REFERENTES!Q392,\"(\",REFERENTES!R392,\")\")","v":"()"},{"$f":"REFERENTES!S392","v":0}]
[null,null,null,null,null,null,null,null,null,null,null,null,{"$f":"IF(ISNUMBER(FIND(\"RES\",REFERENTES!$Q$628:$Q$1125,1)),REFERENTES!Q1035,\"\")","v":""},{"$f":"REFERENTES!S414","v":0},409,0,1131,"X",null,null,null,null,null,null,null,null,null,{"$f":"CONCATENATE(REFERENTES!Q393,\"(\",REFERENTES!R393,\")\")","v":"()"},{"$f":"REFERENTES!S393","v":0}]
[null,null,null,null,null,null,null,null,null,null,null,null,{"$f":"IF(ISNUMBER(FIND(\"RES\",REFERENTES!$Q$628:$Q$1125,1)),REFERENTES!Q1036,\"\")","v":""},{"$f":"REFERENTES!S415","v":0},410,0,1131,"X",null,null,null,null,null,null,null,null,null,{"$f":"CONCATENATE(REFERENTES!Q394,\"(\",REFERENTES!R394,\")\")","v":"()"},{"$f":"REFERENTES!S394","v":0}]
[null,null,null,null,null,null,null,null,null,null,null,null,{"$f":"IF(ISNUMBER(FIND(\"RES\",REFERENTES!$Q$628:$Q$1125,1)),REFERENTES!Q1037,\"\")","v":""},{"$f":"REFERENTES!S416","v":0},411,0,1131,"X",null,null,null,null,null,null,null,null,null,{"$f":"CONCATENATE(REFERENTES!Q395,\"(\",REFERENTES!R395,\")\")","v":"()"},{"$f":"REFERENTES!S395","v":0}]
[null,null,null,null,null,null,null,null,null,null,null,null,{"$f":"IF(ISNUMBER(FIND(\"RES\",REFERENTES!$Q$628:$Q$1125,1)),REFERENTES!Q1038,\"\")","v":""},{"$f":"REFERENTES!S417","v":0},412,0,1131,"X",null,null,null,null,null,null,null,null,null,{"$f":"CONCATENATE(REFERENTES!Q396,\"(\",REFERENTES!R396,\")\")","v":"()"},{"$f":"REFERENTES!S396","v":0}]
[null,null,null,null,null,null,null,null,null,null,null,null,{"$f":"IF(ISNUMBER(FIND(\"RES\",REFERENTES!$Q$628:$Q$1125,1)),REFERENTES!Q1039,\"\")","v":""},{"$f":"REFERENTES!S418","v":0},413,0,1131,"X",null,null,null,null,null,null,null,null,null,{"$f":"CONCATENATE(REFERENTES!Q397,\"(\",REFERENTES!R397,\")\")","v":"()"},{"$f":"REFERENTES!S397","v":0}]
[null,null,null,null,null,null,null,null,null,null,null,null,{"$f":"IF(ISNUMBER(FIND(\"RES\",REFERENTES!$Q$628:$Q$1125,1)),REFERENTES!Q1040,\"\")","v":""},{"$f":"REFERENTES!S419","v":0},414,0,1131,"X",null,null,null,null,null,null,null,null,null,{"$f":"CONCATENATE(REFERENTES!Q398,\"(\",REFERENTES!R398,\")\")","v":"()"},{"$f":"REFERENTES!S398","v":0}]
[null,null,null,null,null,null,null,null,null,null,null,null,{"$f":"IF(ISNUMBER(FIND(\"RES\",REFERENTES!$Q$628:$Q$1125,1)),REFERENTES!Q1041,\"\")","v":""},{"$f":"REFERENTES!S420","v":0},415,0,1131,"X",null,null,null,null,null,null,null,null,null,{"$f":"CONCATENATE(REFERENTES!Q399,\"(\",REFERENTES!R399,\")\")","v":"()"},{"$f":"REFERENTES!S399","v":0}]
[null,null,null,null,null,null,null,null,null,null,null,null,{"$f":"IF(ISNUMBER(FIND(\"RES\",REFERENTES!$Q$628:$Q$1125,1)),REFERENTES!Q1042,\"\")","v":""},{"$f":"REFERENTES!S421","v":0},416,0,1131,"X",null,null,null,null,null,null,null,null,null,{"$f":"CONCATENATE(REFERENTES!Q400,\"(\",REFERENTES!R400,\")\")","v":"()"},{"$f":"REFERENTES!S400","v":0}]
[null,null,null,null,null,null,null,null,null,null,null,null,{"$f":"IF(ISNUMBER(FIND(\"RES\",REFERENTES!$Q$628:$Q$1125,1)),REFERENTES!Q1043,\"\")","v":""},{"$f":"REFERENTES!S422","v":0},417,0,1131,"X",null,null,null,null,null,null,null,null,null,{"$f":"CONCATENATE(REFERENTES!Q401,\"(\",REFERENTES!R401,\")\")","v":"()"},{"$f":"REFERENTES!S401","v":0}]
[null,null,null,null,null,null,null,null,null,null,null,null,{"$f":"IF(ISNUMBER(FIND(\"RES\",REFERENTES!$Q$628:$Q$1125,1)),REFERENTES!Q1044,\"\")","v":""},{"$f":"REFERENTES!S423","v":0},418,0,1131,"X",null,null,null,null,null,null,null,null,null,{"$f":"CONCATENATE(REFERENTES!Q402,\"(\",REFERENTES!R402,\")\")","v":"()"},{"$f":"REFERENTES!S402","v":0}]
[null,null,null,null,null,null,null,null,null,null,null,null,{"$f":"IF(ISNUMBER(FIND(\"RES\",REFERENTES!$Q$628:$Q$1125,1)),REFERENTES!Q1045,\"\")","v":""},{"$f":"REFERENTES!S424","v":0},419,0,1131,"X",null,null,null,null,null,null,null,null,null,{"$f":"CONCATENATE(REFERENTES!Q403,\"(\",REFERENTES!R403,\")\")","v":"()"},{"$f":"REFERENTES!S403","v":0}]
[null,null,null,null,null,null,null,null,null,null,null,null,{"$f":"IF(ISNUMBER(FIND(\"RES\",REFERENTES!$Q$628:$Q$1125,1)),REFERENTES!Q1046,\"\")","v":""},{"$f":"REFERENTES!S425","v":0},420,0,1131,"X",null,null,null,null,null,null,null,null,null,{"$f":"CONCATENATE(REFERENTES!Q404,\"(\",REFERENTES!R404,\")\")","v":"()"},{"$f":"REFERENTES!S404","v":0}]
[null,null,null,null,null,null,null,null,null,null,null,null,{"$f":"IF(ISNUMBER(FIND(\"RES\",REFERENTES!$Q$628:$Q$1125,1)),REFERENTES!Q1047,\"\")","v":""},{"$f":"REFERENTES!S426","v":0},421,0,1131,"X",null,null,null,null,null,null,null,null,null,{"$f":"CONCATENATE(REFERENTES!Q405,\"(\",REFERENTES!R405,\")\")","v":"()"},{"$f":"REFERENTES!S405","v":0}]
[null,null,null,null,null,null,null,null,null,null,null,null,{"$f":"IF(ISNUMBER(FIND(\"RES\",REFERENTES!$Q$628:$Q$1125,1)),REFERENTES!Q1048,\"\")","v":""},{"$f":"REFERENTES!S427","v":0},422,0,1131,"X",null,null,null,null,null,null,null,null,null,{"$f":"CONCATENATE(REFERENTES!Q406,\"(\",REFERENTES!R406,\")\")","v":"()"},{"$f":"REFERENTES!S406","v":0}]
[null,null,null,null,null,null,null,null,null,null,null,null,{"$f":"IF(ISNUMBER(FIND(\"RES\",REFERENTES!$Q$628:$Q$1125,1)),REFERENTES!Q1049,\"\")","v":""},{"$f":"REFERENTES!S428","v":0},423,0,1131,"X",null,null,null,null,null,null,null,null,null,{"$f":"CONCATENATE(REFERENTES!Q407,\"(\",REFERENTES!R407,\")\")","v":"()"},{"$f":"REFERENTES!S407","v":0}]
[null,null,null,null,null,null,null,null,null,null,null,null,{"$f":"IF(ISNUMBER(FIND(\"RES\",REFERENTES!$Q$628:$Q$1125,1)),REFERENTES!Q1050,\"\")","v":""},{"$f":"REFERENTES!S429","v":0},424,0,1131,"X",null,null,null,null,null,null,null,null,null,{"$f":"CONCATENATE(REFERENTES!Q408,\"(\",REFERENTES!R408,\")\")","v":"()"},{"$f":"REFERENTES!S408","v":0}]
[null,null,null,null,null,null,null,null,null,null,null,null,{"$f":"IF(ISNUMBER(FIND(\"RES\",REFERENTES!$Q$628:$Q$1125,1)),REFERENTES!Q1051,\"\")","v":""},{"$f":"REFERENTES!S430","v":0},425,0,1131,"X",null,null,null,null,null,null,null,null,null,{"$f":"CONCATENATE(REFERENTES!Q409,\"(\",REFERENTES!R409,\")\")","v":"()"},{"$f":"REFERENTES!S409","v":0}]
[null,null,null,null,null,null,null,null,null,null,null,null,{"$f":"IF(ISNUMBER(FIND(\"RES\",REFERENTES!$Q$628:$Q$1125,1)),REFERENTES!Q1052,\"\")","v":""},{"$f":"REFERENTES!S431","v":0},426,0,1131,"X",null,null,null,null,null,null,null,null,null,{"$f":"CONCATENATE(REFERENTES!Q410,\"(\",REFERENTES!R410,\")\")","v":"()"},{"$f":"REFERENTES!S410","v":0}]
[null,null,null,null,null,null,null,null,null,null,null,null,{"$f":"IF(ISNUMBER(FIND(\"RES\",REFERENTES!$Q$628:$Q$1125,1)),REFERENTES!Q1053,\"\")","v":""},{"$f":"REFERENTES!S432","v":0},427,0,1131,"X",null,null,null,null,null,null,null,null,null,{"$f":"CONCATENATE(REFERENTES!Q411,\"(\",REFERENTES!R411,\")\")","v":"()"},{"$f":"REFERENTES!S411","v":0}]
[null,null,null,null,null,null,null,null,null,null,null,null,{"$f":"IF(ISNUMBER(FIND(\"RES\",REFERENTES!$Q$628:$Q$1125,1)),REFERENTES!Q1054,\"\")","v":""},{"$f":"REFERENTES!S433","v":0},428,0,1131,"X",null,null,null,null,null,null,null,null,null,{"$f":"CONCATENATE(REFERENTES!Q412,\"(\",REFERENTES!R412,\")\")","v":"()"},{"$f":"REFERENTES!S412","v":0}]
[null,null,null,null,null,null,null,null,null,null,null,null,{"$f":"IF(ISNUMBER(FIND(\"RES\",REFERENTES!$Q$628:$Q$1125,1)),REFERENTES!Q1055,\"\")","v":""},{"$f":"REFERENTES!S434","v":0},429,0,1131,"X",null,null,null,null,null,null,null,null,null,{"$f":"CONCATENATE(REFERENTES!Q413,\"(\",REFERENTES!R413,\")\")","v":"()"},{"$f":"REFERENTES!S413","v":0}]
[null,null,null,null,null,null,null,null,null,null,null,null,{"$f":"IF(ISNUMBER(FIND(\"RES\",REFERENTES!$Q$628:$Q$1125,1)),REFERENTES!Q1056,\"\")","v":""},{"$f":"REFERENTES!S435","v":0},430,0,1131,"X",null,null,null,null,null,null,null,null,null,{"$f":"CONCATENATE(REFERENTES!Q414,\"(\",REFERENTES!R414,\")\")","v":"()"},{"$f":"REFERENTES!S414","v":0}]
[null,null,null,null,null,null,null,null,null,null,null,null,{"$f":"IF(ISNUMBER(FIND(\"RES\",REFERENTES!$Q$628:$Q$1125,1)),REFERENTES!Q1057,\"\")","v":""},{"$f":"REFERENTES!S436","v":0},431,0,1131,"X",null,null,null,null,null,null,null,null,null,{"$f":"CONCATENATE(REFERENTES!Q415,\"(\",REFERENTES!R415,\")\")","v":"()"},{"$f":"REFERENTES!S415","v":0}]
[null,null,null,null,null,null,null,null,null,null,null,null,{"$f":"IF(ISNUMBER(FIND(\"RES\",REFERENTES!$Q$628:$Q$1125,1)),REFERENTES!Q1058,\"\")","v":""},{"$f":"REFERENTES!S437","v":0},432,0,1131,"X",null,null,null,null,null,null,null,null,null,{"$f":"CONCATENATE(REFERENTES!Q416,\"(\",REFERENTES!R416,\")\")","v":"()"},{"$f":"REFERENTES!S416","v":0}]
[null,null,null,null,null,null,null,null,null,null,null,null,{"$f":"IF(ISNUMBER(FIND(\"RES\",REFERENTES!$Q$628:$Q$1125,1)),REFERENTES!Q1059,\"\")","v":""},{"$f":"REFERENTES!S438","v":0},433,0,1131,"X",null,null,null,null,null,null,null,null,null,{"$f":"CONCATENATE(REFERENTES!Q417,\"(\",REFERENTES!R417,\")\")","v":"()"},{"$f":"REFERENTES!S417","v":0}]
[null,null,null,null,null,null,null,null,null,null,null,null,{"$f":"IF(ISNUMBER(FIND(\"RES\",REFERENTES!$Q$628:$Q$1125,1)),REFERENTES!Q1060,\"\")","v":""},{"$f":"REFERENTES!S439","v":0},434,0,1131,"X",null,null,null,null,null,null,null,null,null,{"$f":"CONCATENATE(REFERENTES!Q418,\"(\",REFERENTES!R418,\")\")","v":"()"},{"$f":"REFERENTES!S418","v":0}]
[null,null,null,null,null,null,null,null,null,null,null,null,{"$f":"IF(ISNUMBER(FIND(\"RES\",REFERENTES!$Q$628:$Q$1125,1)),REFERENTES!Q1061,\"\")","v":""},{"$f":"REFERENTES!S440","v":0},435,0,1131,"X",null,null,null,null,null,null,null,null,null,{"$f":"CONCATENATE(REFERENTES!Q419,\"(\",REFERENTES!R419,\")\")","v":"()"},{"$f":"REFERENTES!S419","v":0}]
[null,null,null,null,null,null,null,null,null,null,null,null,{"$f":"IF(ISNUMBER(FIND(\"RES\",REFERENTES!$Q$628:$Q$1125,1)),REFERENTES!Q1062,\"\")","v":""},{"$f":"REFERENTES!S441","v":0},436,0,1131,"X",null,null,null,null,null,null,null,null,null,{"$f":"CONCATENATE(REFERENTES!Q420,\"(\",REFERENTES!R420,\")\")","v":"()"},{"$f":"REFERENTES!S420","v":0}]
[null,null,null,null,null,null,null,null,null,null,null,null,{"$f":"IF(ISNUMBER(FIND(\"RES\",REFERENTES!$Q$628:$Q$1125,1)),REFERENTES!Q1063,\"\")","v":""},{"$f":"REFERENTES!S442","v":0},437,0,1131,"X",null,null,null,null,null,null,null,null,null,{"$f":"CONCATENATE(REFERENTES!Q421,\"(\",REFERENTES!R421,\")\")","v":"()"},{"$f":"REFERENTES!S421","v":0}]
[null,null,null,null,null,null,null,null,null,null,null,null,{"$f":"IF(ISNUMBER(FIND(\"RES\",REFERENTES!$Q$628:$Q$1125,1)),REFERENTES!Q1064,\"\")","v":""},{"$f":"REFERENTES!S443","v":0},438,0,1131,"X",null,null,null,null,null,null,null,null,null,{"$f":"CONCATENATE(REFERENTES!Q422,\"(\",REFERENTES!R422,\")\")","v":"()"},{"$f":"REFERENTES!S422","v":0}]
[null,null,null,null,null,null,null,null,null,null,null,null,{"$f":"IF(ISNUMBER(FIND(\"RES\",REFERENTES!$Q$628:$Q$1125,1)),REFERENTES!Q1065,\"\")","v":""},{"$f":"REFERENTES!S444","v":0},439,0,1131,"X",null,null,null,null,null,null,null,null,null,{"$f":"CONCATENATE(REFERENTES!Q423,\"(\",REFERENTES!R423,\")\")","v":"()"},{"$f":"REFERENTES!S423","v":0}]
[null,null,null,null,null,null,null,null,null,null,null,null,{"$f":"IF(ISNUMBER(FIND(\"RES\",REFERENTES!$Q$628:$Q$1125,1)),REFERENTES!Q1066,\"\")","v":""},{"$f":"REFERENTES!S445","v":0},440,0,1131,"X",null,null,null,null,null,null,null,null,null,{"$f":"CONCATENATE(REFERENTES!Q424,\"(\",REFERENTES!R424,\")\")","v":"()"},{"$f":"REFERENTES!S424","v":0}]
[null,null,null,null,null,null,null,null,null,null,null,null,{"$f":"IF(ISNUMBER(FIND(\"RES\",REFERENTES!$Q$628:$Q$1125,1)),REFERENTES!Q1067,\"\")","v":""},{"$f":"REFERENTES!S446","v":0},441,0,1131,"X",null,null,null,null,null,null,null,null,null,{"$f":"CONCATENATE(REFERENTES!Q425,\"(\",REFERENTES!R425,\")\")","v":"()"},{"$f":"REFERENTES!S425","v":0}]
[null,null,null,null,null,null,null,null,null,null,null,null,{"$f":"IF(ISNUMBER(FIND(\"RES\",REFERENTES!$Q$628:$Q$1125,1)),REFERENTES!Q1068,\"\")","v":""},{"$f":"REFERENTES!S447","v":0},442,0,1131,"X",null,null,null,null,null,null,null,null,null,{"$f":"CONCATENATE(REFERENTES!Q426,\"(\",REFERENTES!R426,\")\")","v":"()"},{"$f":"REFERENTES!S426","v":0}]
[null,null,null,null,null,null,null,null,null,null,null,null,{"$f":"IF(ISNUMBER(FIND(\"RES\",REFERENTES!$Q$628:$Q$1125,1)),REFERENTES!Q1069,\"\")","v":""},{"$f":"REFERENTES!S448","v":0},443,0,1131,"X",null,null,null,null,null,null,null,null,null,{"$f":"CONCATENATE(REFERENTES!Q427,\"(\",REFERENTES!R427,\")\")","v":"()"},{"$f":"REFERENTES!S427","v":0}]
[null,null,null,null,null,null,null,null,null,null,null,null,{"$f":"IF(ISNUMBER(FIND(\"RES\",REFERENTES!$Q$628:$Q$1125,1)),REFERENTES!Q1070,\"\")","v":""},{"$f":"REFERENTES!S449","v":0},444,0,1131,"X",null,null,null,null,null,null,null,null,null,{"$f":"CONCATENATE(REFERENTES!Q428,\"(\",REFERENTES!R428,\")\")","v":"()"},{"$f":"REFERENTES!S428","v":0}]
[null,null,null,null,null,null,null,null,null,null,null,null,{"$f":"IF(ISNUMBER(FIND(\"RES\",REFERENTES!$Q$628:$Q$1125,1)),REFERENTES!Q1071,\"\")","v":""},{"$f":"REFERENTES!S450","v":0},445,0,1131,"X",null,null,null,null,null,null,null,null,null,{"$f":"CONCATENATE(REFERENTES!Q429,\"(\",REFERENTES!R429,\")\")","v":"()"},{"$f":"REFERENTES!S429","v":0}]
[null,null,null,null,null,null,null,null,null,null,null,null,{"$f":"IF(ISNUMBER(FIND(\"RES\",REFERENTES!$Q$628:$Q$1125,1)),REFERENTES!Q1072,\"\")","v":""},{"$f":"REFERENTES!S451","v":0},446,0,1131,"X",null,null,null,null,null,null,null,null,null,{"$f":"CONCATENATE(REFERENTES!Q430,\"(\",REFERENTES!R430,\")\")","v":"()"},{"$f":"REFERENTES!S430","v":0}]
[null,null,null,null,null,null,null,null,null,null,null,null,{"$f":"IF(ISNUMBER(FIND(\"RES\",REFERENTES!$Q$628:$Q$1125,1)),REFERENTES!Q1073,\"\")","v":""},{"$f":"REFERENTES!S452","v":0},447,0,1131,"X",null,null,null,null,null,null,null,null,null,{"$f":"CONCATENATE(REFERENTES!Q431,\"(\",REFERENTES!R431,\")\")","v":"()"},{"$f":"REFERENTES!S431","v":0}]
[null,null,null,null,null,null,null,null,null,null,null,null,{"$f":"IF(ISNUMBER(FIND(\"RES\",REFERENTES!$Q$628:$Q$1125,1)),REFERENTES!Q1074,\"\")","v":""},{"$f":"REFERENTES!S453","v":0},448,0,1131,"X",null,null,null,null,null,null,null,null,null,{"$f":"CONCATENATE(REFERENTES!Q432,\"(\",REFERENTES!R432,\")\")","v":"()"},{"$f":"REFERENTES!S432","v":0}]
[null,null,null,null,null,null,null,null,null,null,null,null,{"$f":"IF(ISNUMBER(FIND(\"RES\",REFERENTES!$Q$628:$Q$1125,1)),REFERENTES!Q1075,\"\")","v":""},{"$f":"REFERENTES!S454","v":0},449,0,1131,"X",null,null,null,null,null,null,null,null,null,{"$f":"CONCATENATE(REFERENTES!Q433,\"(\",REFERENTES!R433,\")\")","v":"()"},{"$f":"REFERENTES!S433","v":0}]
[null,null,null,null,null,null,null,null,null,null,null,null,{"$f":"IF(ISNUMBER(FIND(\"RES\",REFERENTES!$Q$628:$Q$1125,1)),REFERENTES!Q1076,\"\")","v":""},{"$f":"REFERENTES!S455","v":0},450,0,{"$f":"IF(P455=0,MAX($O$6:$O$1135)+1,O455)","v":1131},{"$f":"IFERROR(VLOOKUP(SMALL($Q$6:$Q$1135,O455),$O$6:$P$1135,2,FALSE),\"X\")","v":"X"},null,null,null,null,null,null,null,null,null,{"$f":"CONCATENATE(REFERENTES!Q434,\"(\",REFERENTES!R434,\")\")","v":"()"},{"$f":"REFERENTES!S434","v":0}]
[null,null,null,null,null,null,null,null,null,null,null,null,{"$f":"IF(ISNUMBER(FIND(\"RES\",REFERENTES!$Q$628:$Q$1125,1)),REFERENTES!Q1077,\"\")","v":""},{"$f":"REFERENTES!S456","v":0},451,0,1131,"X",null,null,null,null,null,null,null,null,null,{"$f":"CONCATENATE(REFERENTES!Q435,\"(\",REFERENTES!R435,\")\")","v":"()"},{"$f":"REFERENTES!S435","v":0}]
[null,null,null,null,null,null,null,null,null,null,null,null,{"$f":"IF(ISNUMBER(FIND(\"RES\",REFERENTES!$Q$628:$Q$1125,1)),REFERENTES!Q1078,\"\")","v":""},{"$f":"REFERENTES!S457","v":0},452,{"$f":"IF(M457=\"\",0,M457)","v":0},1131,"X",null,null,null,null,null,null,null,null,null,{"$f":"CONCATENATE(REFERENTES!Q436,\"(\",REFERENTES!R436,\")\")","v":"()"},{"$f":"REFERENTES!S436","v":0}]
[null,null,null,null,null,null,null,null,null,null,null,null,{"$f":"IF(ISNUMBER(FIND(\"RES\",REFERENTES!$Q$628:$Q$1125,1)),REFERENTES!Q1079,\"\")","v":""},{"$f":"REFERENTES!S458","v":0},453,0,1131,"X",null,null,null,null,null,null,null,null,null,{"$f":"CONCATENATE(REFERENTES!Q437,\"(\",REFERENTES!R437,\")\")","v":"()"},{"$f":"REFERENTES!S437","v":0}]
[null,null,null,null,null,null,null,null,null,null,null,null,{"$f":"IF(ISNUMBER(FIND(\"RES\",REFERENTES!$Q$628:$Q$1125,1)),REFERENTES!Q1080,\"\")","v":""},{"$f":"REFERENTES!S459","v":0},454,0,1131,"X",null,null,null,null,null,null,null,null,null,{"$f":"CONCATENATE(REFERENTES!Q438,\"(\",REFERENTES!R438,\")\")","v":"()"},{"$f":"REFERENTES!S438","v":0}]
[null,null,null,null,null,null,null,null,null,null,null,null,{"$f":"IF(ISNUMBER(FIND(\"RES\",REFERENTES!$Q$628:$Q$1125,1)),REFERENTES!Q1081,\"\")","v":""},{"$f":"REFERENTES!S460","v":0},455,0,1131,"X",null,null,null,null,null,null,null,null,null,{"$f":"CONCATENATE(REFERENTES!Q439,\"(\",REFERENTES!R439,\")\")","v":"()"},{"$f":"REFERENTES!S439","v":0}]
[null,null,null,null,null,null,null,null,null,null,null,null,{"$f":"IF(ISNUMBER(FIND(\"RES\",REFERENTES!$Q$628:$Q$1125,1)),REFERENTES!Q1082,\"\")","v":""},{"$f":"REFERENTES!S461","v":0},456,0,1131,"X",null,null,null,null,null,null,null,null,null,{"$f":"CONCATENATE(REFERENTES!Q440,\"(\",REFERENTES!R440,\")\")","v":"()"},{"$f":"REFERENTES!S440","v":0}]
[null,null,null,null,null,null,null,null,null,null,null,null,{"$f":"IF(ISNUMBER(FIND(\"RES\",REFERENTES!$Q$628:$Q$1125,1)),REFERENTES!Q1083,\"\")","v":""},{"$f":"REFERENTES!S462","v":0},457,0,1131,"X",null,null,null,null,null,null,null,null,null,{"$f":"CONCATENATE(REFERENTES!Q441,\"(\",REFERENTES!R441,\")\")","v":"()"},{"$f":"REFERENTES!S441","v":0}]
[null,null,null,null,null,null,null,null,null,null,null,null,{"$f":"IF(ISNUMBER(FIND(\"RES\",REFERENTES!$Q$628:$Q$1125,1)),REFERENTES!Q1084,\"\")","v":""},{"$f":"REFERENTES!S463","v":0},458,0,1131,"X",null,null,null,null,null,null,null,null,null,{"$f":"CONCATENATE(REFERENTES!Q442,\"(\",REFERENTES!R442,\")\")","v":"()"},{"$f":"REFERENTES!S442","v":0}]
[null,null,null,null,null,null,null,null,null,null,null,null,{"$f":"IF(ISNUMBER(FIND(\"RES\",REFERENTES!$Q$628:$Q$1125,1)),REFERENTES!Q1085,\"\")","v":""},{"$f":"REFERENTES!S464","v":0},459,0,1131,"X",null,null,null,null,null,null,null,null,null,{"$f":"CONCATENATE(REFERENTES!Q443,\"(\",REFERENTES!R443,\")\")","v":"()"},{"$f":"REFERENTES!S443","v":0}]
[null,null,null,null,null,null,null,null,null,null,null,null,{"$f":"IF(ISNUMBER(FIND(\"RES\",REFERENTES!$Q$628:$Q$1125,1)),REFERENTES!Q1086,\"\")","v":""},{"$f":"REFERENTES!S465","v":0},460,0,1131,"X",null,null,null,null,null,null,null,null,null,{"$f":"CONCATENATE(REFERENTES!Q444,\"(\",REFERENTES!R444,\")\")","v":"()"},{"$f":"REFERENTES!S444","v":0}]
[null,null,null,null,null,null,null,null,null,null,null,null,{"$f":"IF(ISNUMBER(FIND(\"RES\",REFERENTES!$Q$628:$Q$1125,1)),REFERENTES!Q1087,\"\")","v":""},{"$f":"REFERENTES!S466","v":0},461,0,1131,"X",null,null,null,null,null,null,null,null,null,{"$f":"CONCATENATE(REFERENTES!Q445,\"(\",REFERENTES!R445,\")\")","v":"()"},{"$f":"REFERENTES!S445","v":0}]
[null,null,null,null,null,null,null,null,null,null,null,null,{"$f":"IF(ISNUMBER(FIND(\"RES\",REFERENTES!$Q$628:$Q$1125,1)),REFERENTES!Q1088,\"\")","v":""},{"$f":"REFERENTES!S467","v":0},462,0,1131,"X",null,null,null,null,null,null,null,null,null,{"$f":"CONCATENATE(REFERENTES!Q446,\"(\",REFERENTES!R446,\")\")","v":"()"},{"$f":"REFERENTES!S446","v":0}]
[null,null,null,null,null,null,null,null,null,null,null,null,{"$f":"IF(ISNUMBER(FIND(\"RES\",REFERENTES!$Q$628:$Q$1125,1)),REFERENTES!Q1089,\"\")","v":""},{"$f":"REFERENTES!S468","v":0},463,0,1131,"X",null,null,null,null,null,null,null,null,null,{"$f":"CONCATENATE(REFERENTES!Q447,\"(\",REFERENTES!R447,\")\")","v":"()"},{"$f":"REFERENTES!S447","v":0}]
[null,null,null,null,null,null,null,null,null,null,null,null,{"$f":"IF(ISNUMBER(FIND(\"RES\",REFERENTES!$Q$628:$Q$1125,1)),REFERENTES!Q1090,\"\")","v":""},{"$f":"REFERENTES!S469","v":0},464,0,1131,"X",null,null,null,null,null,null,null,null,null,{"$f":"CONCATENATE(REFERENTES!Q448,\"(\",REFERENTES!R448,\")\")","v":"()"},{"$f":"REFERENTES!S448","v":0}]
[null,null,null,null,null,null,null,null,null,null,null,null,{"$f":"IF(ISNUMBER(FIND(\"RES\",REFERENTES!$Q$628:$Q$1125,1)),REFERENTES!Q1091,\"\")","v":""},{"$f":"REFERENTES!S470","v":0},465,0,1131,"X",null,null,null,null,null,null,null,null,null,{"$f":"CONCATENATE(REFERENTES!Q449,\"(\",REFERENTES!R449,\")\")","v":"()"},{"$f":"REFERENTES!S449","v":0}]
[null,null,null,null,null,null,null,null,null,null,null,null,{"$f":"IF(ISNUMBER(FIND(\"RES\",REFERENTES!$Q$628:$Q$1125,1)),REFERENTES!Q1092,\"\")","v":""},{"$f":"REFERENTES!S471","v":0},466,0,1131,"X",null,null,null,null,null,null,null,null,null,{"$f":"CONCATENATE(REFERENTES!Q450,\"(\",REFERENTES!R450,\")\")","v":"()"},{"$f":"REFERENTES!S450","v":0}]
[null,null,null,null,null,null,null,null,null,null,null,null,{"$f":"IF(ISNUMBER(FIND(\"RES\",REFERENTES!$Q$628:$Q$1125,1)),REFERENTES!Q1093,\"\")","v":""},{"$f":"REFERENTES!S472","v":0},467,0,1131,"X",null,null,null,null,null,null,null,null,null,{"$f":"CONCATENATE(REFERENTES!Q451,\"(\",REFERENTES!R451,\")\")","v":"()"},{"$f":"REFERENTES!S451","v":0}]
[null,null,null,null,null,null,null,null,null,null,null,null,{"$f":"IF(ISNUMBER(FIND(\"RES\",REFERENTES!$Q$628:$Q$1125,1)),REFERENTES!Q1094,\"\")","v":""},{"$f":"REFERENTES!S473","v":0},468,0,1131,"X",null,null,null,null,null,null,null,null,null,{"$f":"CONCATENATE(REFERENTES!Q452,\"(\",REFERENTES!R452,\")\")","v":"()"},{"$f":"REFERENTES!S452","v":0}]
[null,null,null,null,null,null,null,null,null,null,null,null,{"$f":"IF(ISNUMBER(FIND(\"RES\",REFERENTES!$Q$628:$Q$1125,1)),REFERENTES!Q1095,\"\")","v":""},{"$f":"REFERENTES!S474","v":0},469,0,1131,"X",null,null,null,null,null,null,null,null,null,{"$f":"CONCATENATE(REFERENTES!Q453,\"(\",REFERENTES!R453,\")\")","v":"()"},{"$f":"REFERENTES!S453","v":0}]
[null,null,null,null,null,null,null,null,null,null,null,null,{"$f":"IF(ISNUMBER(FIND(\"RES\",REFERENTES!$Q$628:$Q$1125,1)),REFERENTES!Q1096,\"\")","v":""},{"$f":"REFERENTES!S475","v":0},470,0,1131,"X",null,null,null,null,null,null,null,null,null,{"$f":"CONCATENATE(REFERENTES!Q454,\"(\",REFERENTES!R454,\")\")","v":"()"},{"$f":"REFERENTES!S454","v":0}]
[null,null,null,null,null,null,null,null,null,null,null,null,{"$f":"IF(ISNUMBER(FIND(\"RES\",REFERENTES!$Q$628:$Q$1125,1)),REFERENTES!Q1097,\"\")","v":""},{"$f":"REFERENTES!S476","v":0},471,0,1131,"X",null,null,null,null,null,null,null,null,null,{"$f":"CONCATENATE(REFERENTES!Q455,\"(\",REFERENTES!R455,\")\")","v":"()"},{"$f":"REFERENTES!S455","v":0}]
[null,null,null,null,null,null,null,null,null,null,null,null,{"$f":"IF(ISNUMBER(FIND(\"RES\",REFERENTES!$Q$628:$Q$1125,1)),REFERENTES!Q1098,\"\")","v":""},{"$f":"REFERENTES!S477","v":0},472,0,1131,"X",null,null,null,null,null,null,null,null,null,{"$f":"CONCATENATE(REFERENTES!Q456,\"(\",REFERENTES!R456,\")\")","v":"()"},{"$f":"REFERENTES!S456","v":0}]
[null,null,null,null,null,null,null,null,null,null,null,null,{"$f":"IF(ISNUMBER(FIND(\"RES\",REFERENTES!$Q$628:$Q$1125,1)),REFERENTES!Q1099,\"\")","v":""},{"$f":"REFERENTES!S478","v":0},473,0,1131,"X",null,null,null,null,null,null,null,null,null,{"$f":"CONCATENATE(REFERENTES!Q457,\"(\",REFERENTES!R457,\")\")","v":"()"},{"$f":"REFERENTES!S457","v":0}]
[null,null,null,null,null,null,null,null,null,null,null,null,{"$f":"IF(ISNUMBER(FIND(\"RES\",REFERENTES!$Q$628:$Q$1125,1)),REFERENTES!Q1100,\"\")","v":""},{"$f":"REFERENTES!S479","v":0},474,0,1131,"X",null,null,null,null,null,null,null,null,null,{"$f":"CONCATENATE(REFERENTES!Q458,\"(\",REFERENTES!R458,\")\")","v":"()"},{"$f":"REFERENTES!S458","v":0}]
[null,null,null,null,null,null,null,null,null,null,null,null,{"$f":"IF(ISNUMBER(FIND(\"RES\",REFERENTES!$Q$628:$Q$1125,1)),REFERENTES!Q1101,\"\")","v":""},{"$f":"REFERENTES!S480","v":0},475,0,1131,"X",null,null,null,null,null,null,null,null,null,{"$f":"CONCATENATE(REFERENTES!Q459,\"(\",REFERENTES!R459,\")\")","v":"()"},{"$f":"REFERENTES!S459","v":0}]
[null,null,null,null,null,null,null,null,null,null,null,null,{"$f":"IF(ISNUMBER(FIND(\"RES\",REFERENTES!$Q$628:$Q$1125,1)),REFERENTES!Q1102,\"\")","v":""},{"$f":"REFERENTES!S481","v":0},476,0,1131,"X",null,null,null,null,null,null,null,null,null,{"$f":"CONCATENATE(REFERENTES!Q460,\"(\",REFERENTES!R460,\")\")","v":"()"},{"$f":"REFERENTES!S460","v":0}]
[null,null,null,null,null,null,null,null,null,null,null,null,{"$f":"IF(ISNUMBER(FIND(\"RES\",REFERENTES!$Q$628:$Q$1125,1)),REFERENTES!Q1103,\"\")","v":""},{"$f":"REFERENTES!S482","v":0},477,0,1131,"X",null,null,null,null,null,null,null,null,null,{"$f":"CONCATENATE(REFERENTES!Q461,\"(\",REFERENTES!R461,\")\")","v":"()"},{"$f":"REFERENTES!S461","v":0}]
[null,null,null,null,null,null,null,null,null,null,null,null,{"$f":"IF(ISNUMBER(FIND(\"RES\",REFERENTES!$Q$628:$Q$1125,1)),REFERENTES!Q1104,\"\")","v":""},{"$f":"REFERENTES!S483","v":0},478,0,1131,"X",null,null,null,null,null,null,null,null,null,{"$f":"CONCATENATE(REFERENTES!Q462,\"(\",REFERENTES!R462,\")\")","v":"()"},{"$f":"REFERENTES!S462","v":0}]
[null,null,null,null,null,null,null,null,null,null,null,null,{"$f":"IF(ISNUMBER(FIND(\"RES\",REFERENTES!$Q$628:$Q$1125,1)),REFERENTES!Q1105,\"\")","v":""},{"$f":"REFERENTES!S484","v":0},479,0,1131,"X",null,null,null,null,null,null,null,null,null,{"$f":"CONCATENATE(REFERENTES!Q463,\"(\",REFERENTES!R463,\")\")","v":"()"},{"$f":"REFERENTES!S463","v":0}]
[null,null,null,null,null,null,null,null,null,null,null,null,{"$f":"IF(ISNUMBER(FIND(\"RES\",REFERENTES!$Q$628:$Q$1125,1)),REFERENTES!Q1106,\"\")","v":""},{"$f":"REFERENTES!S485","v":0},480,0,1131,"X",null,null,null,null,null,null,null,null,null,{"$f":"CONCATENATE(REFERENTES!Q464,\"(\",REFERENTES!R464,\")\")","v":"()"},{"$f":"REFERENTES!S464","v":0}]
[null,null,null,null,null,null,null,null,null,null,null,null,{"$f":"IF(ISNUMBER(FIND(\"RES\",REFERENTES!$Q$628:$Q$1125,1)),REFERENTES!Q1107,\"\")","v":""},{"$f":"REFERENTES!S486","v":0},481,0,1131,"X",null,null,null,null,null,null,null,null,null,{"$f":"CONCATENATE(REFERENTES!Q465,\"(\",REFERENTES!R465,\")\")","v":"()"},{"$f":"REFERENTES!S465","v":0}]
[null,null,null,null,null,null,null,null,null,null,null,null,{"$f":"IF(ISNUMBER(FIND(\"RES\",REFERENTES!$Q$628:$Q$1125,1)),REFERENTES!Q1108,\"\")","v":""},{"$f":"REFERENTES!S487","v":0},482,0,1131,"X",null,null,null,null,null,null,null,null,null,{"$f":"CONCATENATE(REFERENTES!Q466,\"(\",REFERENTES!R466,\")\")","v":"()"},{"$f":"REFERENTES!S466","v":0}]
[null,null,null,null,null,null,null,null,null,null,null,null,{"$f":"IF(ISNUMBER(FIND(\"RES\",REFERENTES!$Q$628:$Q$1125,1)),REFERENTES!Q1109,\"\")","v":""},{"$f":"REFERENTES!S488","v":0},483,0,1131,"X",null,null,null,null,null,null,null,null,null,{"$f":"CONCATENATE(REFERENTES!Q467,\"(\",REFERENTES!R467,\")\")","v":"()"},{"$f":"REFERENTES!S467","v":0}]
[null,null,null,null,null,null,null,null,null,null,null,null,{"$f":"IF(ISNUMBER(FIND(\"RES\",REFERENTES!$Q$628:$Q$1125,1)),REFERENTES!Q1110,\"\")","v":""},{"$f":"REFERENTES!S489","v":0},484,0,1131,"X",null,null,null,null,null,null,null,null,null,{"$f":"CONCATENATE(REFERENTES!Q468,\"(\",REFERENTES!R468,\")\")","v":"()"},{"$f":"REFERENTES!S468","v":0}]
[null,null,null,null,null,null,null,null,null,null,null,null,{"$f":"IF(ISNUMBER(FIND(\"RES\",REFERENTES!$Q$628:$Q$1125,1)),REFERENTES!Q1111,\"\")","v":""},{"$f":"REFERENTES!S490","v":0},485,0,1131,"X",null,null,null,null,null,null,null,null,null,{"$f":"CONCATENATE(REFERENTES!Q469,\"(\",REFERENTES!R469,\")\")","v":"()"},{"$f":"REFERENTES!S469","v":0}]
[null,null,null,null,null,null,null,null,null,null,null,null,{"$f":"IF(ISNUMBER(FIND(\"RES\",REFERENTES!$Q$628:$Q$1125,1)),REFERENTES!Q1112,\"\")","v":""},{"$f":"REFERENTES!S491","v":0},486,0,1131,"X",null,null,null,null,null,null,null,null,null,{"$f":"CONCATENATE(REFERENTES!Q470,\"(\",REFERENTES!R470,\")\")","v":"()"},{"$f":"REFERENTES!S470","v":0}]
[null,null,null,null,null,null,null,null,null,null,null,null,{"$f":"IF(ISNUMBER(FIND(\"RES\",REFERENTES!$Q$628:$Q$1125,1)),REFERENTES!Q1113,\"\")","v":""},{"$f":"REFERENTES!S492","v":0},487,0,1131,"X",null,null,null,null,null,null,null,null,null,{"$f":"CONCATENATE(REFERENTES!Q471,\"(\",REFERENTES!R471,\")\")","v":"()"},{"$f":"REFERENTES!S471","v":0}]
[null,null,null,null,null,null,null,null,null,null,null,null,{"$f":"IF(ISNUMBER(FIND(\"RES\",REFERENTES!$Q$628:$Q$1125,1)),REFERENTES!Q1114,\"\")","v":""},{"$f":"REFERENTES!S493","v":0},488,0,1131,"X",null,null,null,null,null,null,null,null,null,{"$f":"CONCATENATE(REFERENTES!Q472,\"(\",REFERENTES!R472,\")\")","v":"()"},{"$f":"REFERENTES!S472","v":0}]
[null,null,null,null,null,null,null,null,null,null,null,null,{"$f":"IF(ISNUMBER(FIND(\"RES\",REFERENTES!$Q$628:$Q$1125,1)),REFERENTES!Q1115,\"\")","v":""},{"$f":"REFERENTES!S494","v":0},489,0,1131,"X",null,null,null,null,null,null,null,null,null,{"$f":"CONCATENATE(REFERENTES!Q473,\"(\",REFERENTES!R473,\")\")","v":"()"},{"$f":"REFERENTES!S473","v":0}]
[null,null,null,null,null,null,null,null,null,null,null,null,{"$f":"IF(ISNUMBER(FIND(\"RES\",REFERENTES!$Q$628:$Q$1125,1)),REFERENTES!Q1116,\"\")","v":""},{"$f":"REFERENTES!S495","v":0},490,0,1131,"X",null,null,null,null,null,null,null,null,null,{"$f":"CONCATENATE(REFERENTES!Q474,\"(\",REFERENTES!R474,\")\")","v":"()"},{"$f":"REFERENTES!S474","v":0}]
[null,null,null,null,null,null,null,null,null,null,null,null,{"$f":"IF(ISNUMBER(FIND(\"RES\",REFERENTES!$Q$628:$Q$1125,1)),REFERENTES!Q1117,\"\")","v":""},{"$f":"REFERENTES!S496","v":0},491,0,1131,"X",null,null,null,null,null,null,null,null,null,{"$f":"CONCATENATE(REFERENTES!Q475,\"(\",REFERENTES!R475,\")\")","v":"()"},{"$f":"REFERENTES!S475","v":0}]
[null,null,null,null,null,null,null,null,null,null,null,null,{"$f":"IF(ISNUMBER(FIND(\"RES\",REFERENTES!$Q$628:$Q$1125,1)),REFERENTES!Q1118,\"\")","v":""},{"$f":"REFERENTES!S497","v":0},492,0,1131,"X",null,null,null,null,null,null,null,null,null,{"$f":"CONCATENATE(REFERENTES!Q476,\"(\",REFERENTES!R476,\")\")","v":"()"},{"$f":"REFERENTES!S476","v":0}]
[null,null,null,null,null,null,null,null,null,null,null,null,{"$f":"IF(ISNUMBER(FIND(\"RES\",REFERENTES!$Q$628:$Q$1125,1)),REFERENTES!Q1119,\"\")","v":""},{"$f":"REFERENTES!S498","v":0},493,0,1131,"X",null,null,null,null,null,null,null,null,null,{"$f":"CONCATENATE(REFERENTES!Q477,\"(\",REFERENTES!R477,\")\")","v":"()"},{"$f":"REFERENTES!S477","v":0}]
[null,null,null,null,null,null,null,null,null,null,null,null,{"$f":"IF(ISNUMBER(FIND(\"RES\",REFERENTES!$Q$628:$Q$1125,1)),REFERENTES!Q1120,\"\")","v":""},{"$f":"REFERENTES!S499","v":0},494,0,1131,"X",null,null,null,null,null,null,null,null,null,{"$f":"CONCATENATE(REFERENTES!Q478,\"(\",REFERENTES!R478,\")\")","v":"()"},{"$f":"REFERENTES!S478","v":0}]
[null,null,null,null,null,null,null,null,null,null,null,null,{"$f":"IF(ISNUMBER(FIND(\"RES\",REFERENTES!$Q$628:$Q$1125,1)),REFERENTES!Q1121,\"\")","v":""},{"$f":"REFERENTES!S500","v":0},495,0,1131,"X",null,null,null,null,null,null,null,null,null,{"$f":"CONCATENATE(REFERENTES!Q479,\"(\",REFERENTES!R479,\")\")","v":"()"},{"$f":"REFERENTES!S479","v":0}]
[null,null,null,null,null,null,null,null,null,null,null,null,{"$f":"IF(ISNUMBER(FIND(\"RES\",REFERENTES!$Q$628:$Q$1125,1)),REFERENTES!Q1122,\"\")","v":""},{"$f":"REFERENTES!S501","v":0},496,0,1131,"X",null,null,null,null,null,null,null,null,null,{"$f":"CONCATENATE(REFERENTES!Q480,\"(\",REFERENTES!R480,\")\")","v":"()"},{"$f":"REFERENTES!S480","v":0}]
[null,null,null,null,null,null,null,null,null,null,null,null,{"$f":"IF(ISNUMBER(FIND(\"RES\",REFERENTES!$Q$628:$Q$1125,1)),REFERENTES!Q1123,\"\")","v":""},{"$f":"REFERENTES!S502","v":0},497,0,1131,"X",null,null,null,null,null,null,null,null,null,{"$f":"CONCATENATE(REFERENTES!Q481,\"(\",REFERENTES!R481,\")\")","v":"()"},{"$f":"REFERENTES!S481","v":0}]
[null,null,null,null,null,null,null,null,null,null,null,null,{"$f":"IF(ISNUMBER(FIND(\"RES\",REFERENTES!$Q$628:$Q$1125,1)),REFERENTES!Q1124,\"\")","v":""},{"$f":"REFERENTES!S503","v":0},498,0,1131,"X",null,null,null,null,null,null,null,null,null,{"$f":"CONCATENATE(REFERENTES!Q482,\"(\",REFERENTES!R482,\")\")","v":"()"},{"$f":"REFERENTES!S482","v":0}]
[null,null,null,null,null,null,null,null,null,null,null,null,{"$f":"IF(ISNUMBER(FIND(\"RES\",REFERENTES!$Q$628:$Q$1125,1)),REFERENTES!Q1125,\"\")","v":""},{"$f":"REFERENTES!S504","v":0},499,0,1131,"X",null,null,null,null,null,null,null,null,null,{"$f":"CONCATENATE(REFERENTES!Q483,\"(\",REFERENTES!R483,\")\")","v":"()"},{"$f":"REFERENTES!S483","v":0}]
[null,null,null,null,null,null,null,null,null,null,null,null,{"$f":"IF(ISNUMBER(FIND(\"RES\",REFERENTES!$Q$628:$Q$1125,1)),REFERENTES!Q1126,\"\")","v":""},{"$f":"REFERENTES!S505","v":0},500,0,1131,"X",null,null,null,null,null,null,null,null,null,{"$f":"CONCATENATE(REFERENTES!Q484,\"(\",REFERENTES!R484,\")\")","v":"()"},{"$f":"REFERENTES!S484","v":0}]
[null,null,null,null,null,null,null,null,null,null,null,null,{"$f":"IF(ISNUMBER(FIND(\"RES\",REFERENTES!$Q$628:$Q$1125,1)),REFERENTES!Q1127,\"\")","v":""},{"$f":"REFERENTES!S506","v":0},501,0,1131,"X",null,null,null,null,null,null,null,null,null,{"$f":"CONCATENATE(REFERENTES!Q485,\"(\",REFERENTES!R485,\")\")","v":"()"},{"$f":"REFERENTES!S485","v":0}]
[null,null,null,null,null,null,null,null,null,null,null,null,{"$f":"IF(ISNUMBER(FIND(\"RES\",REFERENTES!$Q$628:$Q$1125,1)),REFERENTES!Q1128,\"\")","v":""},{"$f":"REFERENTES!S507","v":0},502,0,1131,"X",null,null,null,null,null,null,null,null,null,{"$f":"CONCATENATE(REFERENTES!Q486,\"(\",REFERENTES!R486,\")\")","v":"()"},{"$f":"REFERENTES!S486","v":0}]
[null,null,null,null,null,null,null,null,null,null,null,null,{"$f":"IF(ISNUMBER(FIND(\"RES\",REFERENTES!$Q$628:$Q$1125,1)),REFERENTES!Q1129,\"\")","v":""},{"$f":"REFERENTES!S508","v":0},503,0,1131,"X",null,null,null,null,null,null,null,null,null,{"$f":"CONCATENATE(REFERENTES!Q487,\"(\",REFERENTES!R487,\")\")","v":"()"},{"$f":"REFERENTES!S487","v":0}]
[null,null,null,null,null,null,null,null,null,null,null,null,{"$f":"IF(ISNUMBER(FIND(\"RES\",REFERENTES!$Q$628:$Q$1125,1)),REFERENTES!Q1130,\"\")","v":""},{"$f":"REFERENTES!S509","v":0},504,0,1131,"X",null,null,null,null,null,null,null,null,null,{"$f":"CONCATENATE(REFERENTES!Q488,\"(\",REFERENTES!R488,\")\")","v":"()"},{"$f":"REFERENTES!S488","v":0}]
[null,null,null,null,null,null,null,null,null,null,null,null,{"$f":"IF(ISNUMBER(FIND(\"RES\",REFERENTES!$Q$628:$Q$1125,1)),REFERENTES!Q1131,\"\")","v":""},{"$f":"REFERENTES!S510","v":0},505,0,1131,"X",null,null,null,null,null,null,null,null,null,{"$f":"CONCATENATE(REFERENTES!Q489,\"(\",REFERENTES!R489,\")\")","v":"()"},{"$f":"REFERENTES!S489","v":0}]
[null,null,null,null,null,null,null,null,null,null,null,null,{"$f":"IF(ISNUMBER(FIND(\"RES\",REFERENTES!$Q$628:$Q$1125,1)),REFERENTES!Q1132,\"\")","v":""},{"$f":"REFERENTES!S511","v":0},506,0,1131,"X",null,null,null,null,null,null,null,null,null,{"$f":"CONCATENATE(REFERENTES!Q490,\"(\",REFERENTES!R490,\")\")","v":"()"},{"$f":"REFERENTES!S490","v":0}]
[null,null,null,null,null,null,null,null,null,null,null,null,{"$f":"IF(ISNUMBER(FIND(\"RES\",REFERENTES!$Q$628:$Q$1125,1)),REFERENTES!Q1133,\"\")","v":""},{"$f":"REFERENTES!S512","v":0},507,0,1131,"X",null,null,null,null,null,null,null,null,null,{"$f":"CONCATENATE(REFERENTES!Q491,\"(\",REFERENTES!R491,\")\")","v":"()"},{"$f":"REFERENTES!S491","v":0}]
[null,null,null,null,null,null,null,null,null,null,null,null,{"$f":"IF(ISNUMBER(FIND(\"RES\",REFERENTES!$Q$628:$Q$1125,1)),REFERENTES!Q1134,\"\")","v":""},{"$f":"REFERENTES!S513","v":0},508,0,1131,"X",null,null,null,null,null,null,null,null,null,{"$f":"CONCATENATE(REFERENTES!Q492,\"(\",REFERENTES!R492,\")\")","v":"()"},{"$f":"REFERENTES!S492","v":0}]
[null,null,null,null,null,null,null,null,null,null,null,null,{"$f":"IF(ISNUMBER(FIND(\"RES\",REFERENTES!$Q$628:$Q$1125,1)),REFERENTES!Q1135,\"\")","v":""},{"$f":"REFERENTES!S514","v":0},509,0,1131,"X",null,null,null,null,null,null,null,null,null,{"$f":"CONCATENATE(REFERENTES!Q493,\"(\",REFERENTES!R493,\")\")","v":"()"},{"$f":"REFERENTES!S493","v":0}]
[null,null,null,null,null,null,null,null,null,null,null,null,{"$f":"IF(ISNUMBER(FIND(\"RES\",REFERENTES!$Q$628:$Q$1125,1)),REFERENTES!Q1136,\"\")","v":""},{"$f":"REFERENTES!S515","v":0},510,0,1131,"X",null,null,null,null,null,null,null,null,null,{"$f":"CONCATENATE(REFERENTES!Q494,\"(\",REFERENTES!R494,\")\")","v":"()"},{"$f":"REFERENTES!S494","v":0}]
[null,null,null,null,null,null,null,null,null,null,null,null,{"$f":"IF(ISNUMBER(FIND(\"RES\",REFERENTES!$Q$628:$Q$1125,1)),REFERENTES!Q1137,\"\")","v":""},{"$f":"REFERENTES!S516","v":0},511,0,1131,"X",null,null,null,null,null,null,null,null,null,{"$f":"CONCATENATE(REFERENTES!Q495,\"(\",REFERENTES!R495,\")\")","v":"()"},{"$f":"REFERENTES!S495","v":0}]
[null,null,null,null,null,null,null,null,null,null,null,null,{"$f":"IF(ISNUMBER(FIND(\"RES\",REFERENTES!$Q$628:$Q$1125,1)),REFERENTES!Q1138,\"\")","v":""},{"$f":"REFERENTES!S517","v":0},512,0,1131,"X",null,null,null,null,null,null,null,null,null,{"$f":"CONCATENATE(REFERENTES!Q496,\"(\",REFERENTES!R496,\")\")","v":"()"},{"$f":"REFERENTES!S496","v":0}]
[null,null,null,null,null,null,null,null,null,null,null,null,{"$f":"IF(ISNUMBER(FIND(\"RES\",REFERENTES!$Q$628:$Q$1125,1)),REFERENTES!Q1139,\"\")","v":""},{"$f":"REFERENTES!S518","v":0},513,0,1131,"X",null,null,null,null,null,null,null,null,null,{"$f":"CONCATENATE(REFERENTES!Q497,\"(\",REFERENTES!R497,\")\")","v":"()"},{"$f":"REFERENTES!S497","v":0}]
[null,null,null,null,null,null,null,null,null,null,null,null,{"$f":"IF(ISNUMBER(FIND(\"RES\",REFERENTES!$Q$628:$Q$1125,1)),REFERENTES!Q1140,\"\")","v":""},{"$f":"REFERENTES!S519","v":0},514,0,{"$f":"IF(P519=0,MAX($O$6:$O$1135)+1,O519)","v":1131},{"$f":"IFERROR(VLOOKUP(SMALL($Q$6:$Q$1135,O519),$O$6:$P$1135,2,FALSE),\"X\")","v":"X"},null,null,null,null,null,null,null,null,null,{"$f":"CONCATENATE(REFERENTES!Q498,\"(\",REFERENTES!R498,\")\")","v":"()"},{"$f":"REFERENTES!S498","v":0}]
[null,null,null,null,null,null,null,null,null,null,null,null,{"$f":"IF(ISNUMBER(FIND(\"RES\",REFERENTES!$Q$628:$Q$1125,1)),REFERENTES!Q1141,\"\")","v":""},{"$f":"REFERENTES!S520","v":0},515,0,1131,"X",null,null,null,null,null,null,null,null,null,{"$f":"CONCATENATE(REFERENTES!Q499,\"(\",REFERENTES!R499,\")\")","v":"()"},{"$f":"REFERENTES!S499","v":0}]
[null,null,null,null,null,null,null,null,null,null,null,null,{"$f":"IF(ISNUMBER(FIND(\"RES\",REFERENTES!$Q$628:$Q$1125,1)),REFERENTES!Q1142,\"\")","v":""},{"$f":"REFERENTES!S521","v":0},516,{"$f":"IF(M521=\"\",0,M521)","v":0},1131,"X",null,null,null,null,null,null,null,null,null,{"$f":"CONCATENATE(REFERENTES!Q500,\"(\",REFERENTES!R500,\")\")","v":"()"},{"$f":"REFERENTES!S500","v":0}]
[null,null,null,null,null,null,null,null,null,null,null,null,{"$f":"IF(ISNUMBER(FIND(\"RES\",REFERENTES!$Q$628:$Q$1125,1)),REFERENTES!Q1143,\"\")","v":""},{"$f":"REFERENTES!S522","v":0},517,0,1131,"X",null,null,null,null,null,null,null,null,null,{"$f":"CONCATENATE(REFERENTES!Q501,\"(\",REFERENTES!R501,\")\")","v":"()"},{"$f":"REFERENTES!S501","v":0}]
[null,null,null,null,null,null,null,null,null,null,null,null,{"$f":"IF(ISNUMBER(FIND(\"RES\",REFERENTES!$Q$628:$Q$1125,1)),REFERENTES!Q1144,\"\")","v":""},{"$f":"REFERENTES!S523","v":0},518,0,1131,"X",null,null,null,null,null,null,null,null,null,{"$f":"CONCATENATE(REFERENTES!Q502,\"(\",REFERENTES!R502,\")\")","v":"()"},{"$f":"REFERENTES!S502","v":0}]
[null,null,null,null,null,null,null,null,null,null,null,null,{"$f":"IF(ISNUMBER(FIND(\"RES\",REFERENTES!$Q$628:$Q$1125,1)),REFERENTES!Q1145,\"\")","v":""},{"$f":"REFERENTES!S524","v":0},519,0,1131,"X",null,null,null,null,null,null,null,null,null,{"$f":"CONCATENATE(REFERENTES!Q503,\"(\",REFERENTES!R503,\")\")","v":"()"},{"$f":"REFERENTES!S503","v":0}]
[null,null,null,null,null,null,null,null,null,null,null,null,{"$f":"IF(ISNUMBER(FIND(\"RES\",REFERENTES!$Q$628:$Q$1125,1)),REFERENTES!Q1146,\"\")","v":""},{"$f":"REFERENTES!S525","v":0},520,0,1131,"X",null,null,null,null,null,null,null,null,null,{"$f":"CONCATENATE(REFERENTES!Q504,\"(\",REFERENTES!R504,\")\")","v":"()"},{"$f":"REFERENTES!S504","v":0}]
[null,null,null,null,null,null,null,null,null,null,null,null,{"$f":"IF(ISNUMBER(FIND(\"RES\",REFERENTES!$Q$628:$Q$1125,1)),REFERENTES!Q1147,\"\")","v":""},{"$f":"REFERENTES!S526","v":0},521,0,1131,"X",null,null,null,null,null,null,null,null,null,{"$f":"CONCATENATE(REFERENTES!Q505,\"(\",REFERENTES!R505,\")\")","v":"()"},{"$f":"REFERENTES!S505","v":0}]
[null,null,null,null,null,null,null,null,null,null,null,null,{"$f":"IF(ISNUMBER(FIND(\"RES\",REFERENTES!$Q$628:$Q$1125,1)),REFERENTES!Q1148,\"\")","v":""},{"$f":"REFERENTES!S527","v":0},522,0,1131,"X",null,null,null,null,null,null,null,null,null,{"$f":"CONCATENATE(REFERENTES!Q506,\"(\",REFERENTES!R506,\")\")","v":"()"},{"$f":"REFERENTES!S506","v":0}]
[null,null,null,null,null,null,null,null,null,null,null,null,{"$f":"IF(ISNUMBER(FIND(\"RES\",REFERENTES!$Q$628:$Q$1125,1)),REFERENTES!Q1149,\"\")","v":""},{"$f":"REFERENTES!S528","v":0},523,0,1131,"X",null,null,null,null,null,null,null,null,null,{"$f":"CONCATENATE(REFERENTES!Q507,\"(\",REFERENTES!R507,\")\")","v":"()"},{"$f":"REFERENTES!S507","v":0}]
[null,null,null,null,null,null,null,null,null,null,null,null,{"$f":"IF(ISNUMBER(FIND(\"RES\",REFERENTES!$Q$628:$Q$1125,1)),REFERENTES!Q1150,\"\")","v":""},{"$f":"REFERENTES!S529","v":0},524,0,1131,"X",null,null,null,null,null,null,null,null,null,{"$f":"CONCATENATE(REFERENTES!Q508,\"(\",REFERENTES!R508,\")\")","v":"()"},{"$f":"REFERENTES!S508","v":0}]
[null,null,null,null,null,null,null,null,null,null,null,null,{"$f":"IF(ISNUMBER(FIND(\"RES\",REFERENTES!$Q$628:$Q$1125,1)),REFERENTES!Q1151,\"\")","v":""},{"$f":"REFERENTES!S530","v":0},525,0,1131,"X",null,null,null,null,null,null,null,null,null,{"$f":"CONCATENATE(REFERENTES!Q509,\"(\",REFERENTES!R509,\")\")","v":"()"},{"$f":"REFERENTES!S509","v":0}]
[null,null,null,null,null,null,null,null,null,null,null,null,{"$f":"IF(ISNUMBER(FIND(\"RES\",REFERENTES!$Q$628:$Q$1125,1)),REFERENTES!Q1152,\"\")","v":""},{"$f":"REFERENTES!S531","v":0},526,0,1131,"X",null,null,null,null,null,null,null,null,null,{"$f":"CONCATENATE(REFERENTES!Q510,\"(\",REFERENTES!R510,\")\")","v":"()"},{"$f":"REFERENTES!S510","v":0}]
[null,null,null,null,null,null,null,null,null,null,null,null,{"$f":"IF(ISNUMBER(FIND(\"RES\",REFERENTES!$Q$628:$Q$1125,1)),REFERENTES!Q1153,\"\")","v":""},{"$f":"REFERENTES!S532","v":0},527,0,1131,"X",null,null,null,null,null,null,null,null,null,{"$f":"CONCATENATE(REFERENTES!Q511,\"(\",REFERENTES!R511,\")\")","v":"()"},{"$f":"REFERENTES!S511","v":0}]
[null,null,null,null,null,null,null,null,null,null,null,null,{"$f":"IF(ISNUMBER(FIND(\"RES\",REFERENTES!$Q$628:$Q$1125,1)),REFERENTES!Q1154,\"\")","v":""},{"$f":"REFERENTES!S533","v":0},528,0,1131,"X",null,null,null,null,null,null,null,null,null,{"$f":"CONCATENATE(REFERENTES!Q512,\"(\",REFERENTES!R512,\")\")","v":"()"},{"$f":"REFERENTES!S512","v":0}]
[null,null,null,null,null,null,null,null,null,null,null,null,{"$f":"IF(ISNUMBER(FIND(\"RES\",REFERENTES!$Q$628:$Q$1125,1)),REFERENTES!Q1155,\"\")","v":""},{"$f":"REFERENTES!S534","v":0},529,0,1131,"X",null,null,null,null,null,null,null,null,null,{"$f":"CONCATENATE(REFERENTES!Q513,\"(\",REFERENTES!R513,\")\")","v":"()"},{"$f":"REFERENTES!S513","v":0}]
[null,null,null,null,null,null,null,null,null,null,null,null,{"$f":"IF(ISNUMBER(FIND(\"RES\",REFERENTES!$Q$628:$Q$1125,1)),REFERENTES!Q1156,\"\")","v":""},{"$f":"REFERENTES!S535","v":0},530,0,1131,"X",null,null,null,null,null,null,null,null,null,{"$f":"CONCATENATE(REFERENTES!Q514,\"(\",REFERENTES!R514,\")\")","v":"()"},{"$f":"REFERENTES!S514","v":0}]
[null,null,null,null,null,null,null,null,null,null,null,null,{"$f":"IF(ISNUMBER(FIND(\"RES\",REFERENTES!$Q$628:$Q$1125,1)),REFERENTES!Q1157,\"\")","v":""},{"$f":"REFERENTES!S536","v":0},531,0,1131,"X",null,null,null,null,null,null,null,null,null,{"$f":"CONCATENATE(REFERENTES!Q515,\"(\",REFERENTES!R515,\")\")","v":"()"},{"$f":"REFERENTES!S515","v":0}]
[null,null,null,null,null,null,null,null,null,null,null,null,{"$f":"IF(ISNUMBER(FIND(\"RES\",REFERENTES!$Q$628:$Q$1125,1)),REFERENTES!Q1158,\"\")","v":""},{"$f":"REFERENTES!S537","v":0},532,0,1131,"X",null,null,null,null,null,null,null,null,null,{"$f":"CONCATENATE(REFERENTES!Q516,\"(\",REFERENTES!R516,\")\")","v":"()"},{"$f":"REFERENTES!S516","v":0}]
[null,null,null,null,null,null,null,null,null,null,null,null,{"$f":"IF(ISNUMBER(FIND(\"RES\",REFERENTES!$Q$628:$Q$1125,1)),REFERENTES!Q1159,\"\")","v":""},{"$f":"REFERENTES!S538","v":0},533,0,1131,"X",null,null,null,null,null,null,null,null,null,{"$f":"CONCATENATE(REFERENTES!Q517,\"(\",REFERENTES!R517,\")\")","v":"()"},{"$f":"REFERENTES!S517","v":0}]
[null,null,null,null,null,null,null,null,null,null,null,null,{"$f":"IF(ISNUMBER(FIND(\"RES\",REFERENTES!$Q$628:$Q$1125,1)),REFERENTES!Q1160,\"\")","v":""},{"$f":"REFERENTES!S539","v":0},534,0,1131,"X",null,null,null,null,null,null,null,null,null,{"$f":"CONCATENATE(REFERENTES!Q518,\"(\",REFERENTES!R518,\")\")","v":"()"},{"$f":"REFERENTES!S518","v":0}]
[null,null,null,null,null,null,null,null,null,null,null,null,{"$f":"IF(ISNUMBER(FIND(\"RES\",REFERENTES!$Q$628:$Q$1125,1)),REFERENTES!Q1161,\"\")","v":""},{"$f":"REFERENTES!S540","v":0},535,0,1131,"X",null,null,null,null,null,null,null,null,null,{"$f":"CONCATENATE(REFERENTES!Q519,\"(\",REFERENTES!R519,\")\")","v":"()"},{"$f":"REFERENTES!S519","v":0}]
[null,null,null,null,null,null,null,null,null,null,null,null,{"$f":"IF(ISNUMBER(FIND(\"RES\",REFERENTES!$Q$628:$Q$1125,1)),REFERENTES!Q1162,\"\")","v":""},{"$f":"REFERENTES!S541","v":0},536,0,1131,"X",null,null,null,null,null,null,null,null,null,{"$f":"CONCATENATE(REFERENTES!Q520,\"(\",REFERENTES!R520,\")\")","v":"()"},{"$f":"REFERENTES!S520","v":0}]
[null,null,null,null,null,null,null,null,null,null,null,null,{"$f":"IF(ISNUMBER(FIND(\"RES\",REFERENTES!$Q$628:$Q$1125,1)),REFERENTES!Q1163,\"\")","v":""},{"$f":"REFERENTES!S542","v":0},537,0,1131,"X",null,null,null,null,null,null,null,null,null,{"$f":"CONCATENATE(REFERENTES!Q521,\"(\",REFERENTES!R521,\")\")","v":"()"},{"$f":"REFERENTES!S521","v":0}]
[null,null,null,null,null,null,null,null,null,null,null,null,{"$f":"IF(ISNUMBER(FIND(\"RES\",REFERENTES!$Q$628:$Q$1125,1)),REFERENTES!Q1164,\"\")","v":""},{"$f":"REFERENTES!S543","v":0},538,0,1131,"X",null,null,null,null,null,null,null,null,null,{"$f":"CONCATENATE(REFERENTES!Q522,\"(\",REFERENTES!R522,\")\")","v":"()"},{"$f":"REFERENTES!S522","v":0}]
[null,null,null,null,null,null,null,null,null,null,null,null,{"$f":"IF(ISNUMBER(FIND(\"RES\",REFERENTES!$Q$628:$Q$1125,1)),REFERENTES!Q1165,\"\")","v":""},{"$f":"REFERENTES!S544","v":0},539,0,1131,"X",null,null,null,null,null,null,null,null,null,{"$f":"CONCATENATE(REFERENTES!Q523,\"(\",REFERENTES!R523,\")\")","v":"()"},{"$f":"REFERENTES!S523","v":0}]
[null,null,null,null,null,null,null,null,null,null,null,null,{"$f":"IF(ISNUMBER(FIND(\"RES\",REFERENTES!$Q$628:$Q$1125,1)),REFERENTES!Q1166,\"\")","v":""},{"$f":"REFERENTES!S545","v":0},540,0,1131,"X",null,null,null,null,null,null,null,null,null,{"$f":"CONCATENATE(REFERENTES!Q524,\"(\",REFERENTES!R524,\")\")","v":"()"},{"$f":"REFERENTES!S524","v":0}]
[null,null,null,null,null,null,null,null,null,null,null,null,{"$f":"IF(ISNUMBER(FIND(\"RES\",REFERENTES!$Q$628:$Q$1125,1)),REFERENTES!Q1167,\"\")","v":""},{"$f":"REFERENTES!S546","v":0},541,0,1131,"X",null,null,null,null,null,null,null,null,null,{"$f":"CONCATENATE(REFERENTES!Q525,\"(\",REFERENTES!R525,\")\")","v":"()"},{"$f":"REFERENTES!S525","v":0}]
[null,null,null,null,null,null,null,null,null,null,null,null,{"$f":"IF(ISNUMBER(FIND(\"RES\",REFERENTES!$Q$628:$Q$1125,1)),REFERENTES!Q1168,\"\")","v":""},{"$f":"REFERENTES!S547","v":0},542,0,1131,"X",null,null,null,null,null,null,null,null,null,{"$f":"CONCATENATE(REFERENTES!Q526,\"(\",REFERENTES!R526,\")\")","v":"()"},{"$f":"REFERENTES!S526","v":0}]
[null,null,null,null,null,null,null,null,null,null,null,null,{"$f":"IF(ISNUMBER(FIND(\"RES\",REFERENTES!$Q$628:$Q$1125,1)),REFERENTES!Q1169,\"\")","v":""},{"$f":"REFERENTES!S548","v":0},543,0,1131,"X",null,null,null,null,null,null,null,null,null,{"$f":"CONCATENATE(REFERENTES!Q527,\"(\",REFERENTES!R527,\")\")","v":"()"},{"$f":"REFERENTES!S527","v":0}]
[null,null,null,null,null,null,null,null,null,null,null,null,{"$f":"IF(ISNUMBER(FIND(\"RES\",REFERENTES!$Q$628:$Q$1125,1)),REFERENTES!Q1170,\"\")","v":""},{"$f":"REFERENTES!S549","v":0},544,0,1131,"X",null,null,null,null,null,null,null,null,null,{"$f":"CONCATENATE(REFERENTES!Q528,\"(\",REFERENTES!R528,\")\")","v":"()"},{"$f":"REFERENTES!S528","v":0}]
[null,null,null,null,null,null,null,null,null,null,null,null,{"$f":"IF(ISNUMBER(FIND(\"RES\",REFERENTES!$Q$628:$Q$1125,1)),REFERENTES!Q1171,\"\")","v":""},{"$f":"REFERENTES!S550","v":0},545,0,1131,"X",null,null,null,null,null,null,null,null,null,{"$f":"CONCATENATE(REFERENTES!Q529,\"(\",REFERENTES!R529,\")\")","v":"()"},{"$f":"REFERENTES!S529","v":0}]
[null,null,null,null,null,null,null,null,null,null,null,null,{"$f":"IF(ISNUMBER(FIND(\"RES\",REFERENTES!$Q$628:$Q$1125,1)),REFERENTES!Q1172,\"\")","v":""},{"$f":"REFERENTES!S551","v":0},546,0,1131,"X",null,null,null,null,null,null,null,null,null,{"$f":"CONCATENATE(REFERENTES!Q530,\"(\",REFERENTES!R530,\")\")","v":"()"},{"$f":"REFERENTES!S530","v":0}]
[null,null,null,null,null,null,null,null,null,null,null,null,{"$f":"IF(ISNUMBER(FIND(\"RES\",REFERENTES!$Q$628:$Q$1125,1)),REFERENTES!Q1173,\"\")","v":""},{"$f":"REFERENTES!S552","v":0},547,0,1131,"X",null,null,null,null,null,null,null,null,null,{"$f":"CONCATENATE(REFERENTES!Q531,\"(\",REFERENTES!R531,\")\")","v":"()"},{"$f":"REFERENTES!S531","v":0}]
[null,null,null,null,null,null,null,null,null,null,null,null,{"$f":"IF(ISNUMBER(FIND(\"RES\",REFERENTES!$Q$628:$Q$1125,1)),REFERENTES!Q1174,\"\")","v":""},{"$f":"REFERENTES!S553","v":0},548,0,1131,"X",null,null,null,null,null,null,null,null,null,{"$f":"CONCATENATE(REFERENTES!Q532,\"(\",REFERENTES!R532,\")\")","v":"()"},{"$f":"REFERENTES!S532","v":0}]
[null,null,null,null,null,null,null,null,null,null,null,null,{"$f":"IF(ISNUMBER(FIND(\"RES\",REFERENTES!$Q$628:$Q$1125,1)),REFERENTES!Q1175,\"\")","v":""},{"$f":"REFERENTES!S554","v":0},549,0,1131,"X",null,null,null,null,null,null,null,null,null,{"$f":"CONCATENATE(REFERENTES!Q533,\"(\",REFERENTES!R533,\")\")","v":"()"},{"$f":"REFERENTES!S533","v":0}]
[null,null,null,null,null,null,null,null,null,null,null,null,{"$f":"IF(ISNUMBER(FIND(\"RES\",REFERENTES!$Q$628:$Q$1125,1)),REFERENTES!Q1176,\"\")","v":""},{"$f":"REFERENTES!S555","v":0},550,0,1131,"X",null,null,null,null,null,null,null,null,null,{"$f":"CONCATENATE(REFERENTES!Q534,\"(\",REFERENTES!R534,\")\")","v":"()"},{"$f":"REFERENTES!S534","v":0}]
[null,null,null,null,null,null,null,null,null,null,null,null,{"$f":"IF(ISNUMBER(FIND(\"RES\",REFERENTES!$Q$628:$Q$1125,1)),REFERENTES!Q1177,\"\")","v":""},{"$f":"REFERENTES!S556","v":0},551,0,1131,"X",null,null,null,null,null,null,null,null,null,{"$f":"CONCATENATE(REFERENTES!Q535,\"(\",REFERENTES!R535,\")\")","v":"()"},{"$f":"REFERENTES!S535","v":0}]
[null,null,null,null,null,null,null,null,null,null,null,null,{"$f":"IF(ISNUMBER(FIND(\"RES\",REFERENTES!$Q$628:$Q$1125,1)),REFERENTES!Q1178,\"\")","v":""},{"$f":"REFERENTES!S557","v":0},552,0,1131,"X",null,null,null,null,null,null,null,null,null,{"$f":"CONCATENATE(REFERENTES!Q536,\"(\",REFERENTES!R536,\")\")","v":"()"},{"$f":"REFERENTES!S536","v":0}]
[null,null,null,null,null,null,null,null,null,null,null,null,{"$f":"IF(ISNUMBER(FIND(\"RES\",REFERENTES!$Q$628:$Q$1125,1)),REFERENTES!Q1179,\"\")","v":""},{"$f":"REFERENTES!S558","v":0},553,0,1131,"X",null,null,null,null,null,null,null,null,null,{"$f":"CONCATENATE(REFERENTES!Q537,\"(\",REFERENTES!R537,\")\")","v":"()"},{"$f":"REFERENTES!S537","v":0}]
[null,null,null,null,null,null,null,null,null,null,null,null,{"$f":"IF(ISNUMBER(FIND(\"RES\",REFERENTES!$Q$628:$Q$1125,1)),REFERENTES!Q1180,\"\")","v":""},{"$f":"REFERENTES!S559","v":0},554,0,1131,"X",null,null,null,null,null,null,null,null,null,{"$f":"CONCATENATE(REFERENTES!Q538,\"(\",REFERENTES!R538,\")\")","v":"()"},{"$f":"REFERENTES!S538","v":0}]
[null,null,null,null,null,null,null,null,null,null,null,null,{"$f":"IF(ISNUMBER(FIND(\"RES\",REFERENTES!$Q$628:$Q$1125,1)),REFERENTES!Q1181,\"\")","v":""},{"$f":"REFERENTES!S560","v":0},555,0,1131,"X",null,null,null,null,null,null,null,null,null,{"$f":"CONCATENATE(REFERENTES!Q539,\"(\",REFERENTES!R539,\")\")","v":"()"},{"$f":"REFERENTES!S539","v":0}]
[null,null,null,null,null,null,null,null,null,null,null,null,{"$f":"IF(ISNUMBER(FIND(\"RES\",REFERENTES!$Q$628:$Q$1125,1)),REFERENTES!Q1182,\"\")","v":""},{"$f":"REFERENTES!S561","v":0},556,0,1131,"X",null,null,null,null,null,null,null,null,null,{"$f":"CONCATENATE(REFERENTES!Q540,\"(\",REFERENTES!R540,\")\")","v":"()"},{"$f":"REFERENTES!S540","v":0}]
[null,null,null,null,null,null,null,null,null,null,null,null,{"$f":"IF(ISNUMBER(FIND(\"RES\",REFERENTES!$Q$628:$Q$1125,1)),REFERENTES!Q1183,\"\")","v":""},{"$f":"REFERENTES!S562","v":0},557,0,1131,"X",null,null,null,null,null,null,null,null,null,{"$f":"CONCATENATE(REFERENTES!Q541,\"(\",REFERENTES!R541,\")\")","v":"()"},{"$f":"REFERENTES!S541","v":0}]
[null,null,null,null,null,null,null,null,null,null,null,null,{"$f":"IF(ISNUMBER(FIND(\"RES\",REFERENTES!$Q$628:$Q$1125,1)),REFERENTES!Q1184,\"\")","v":""},{"$f":"REFERENTES!S563","v":0},558,0,1131,"X",null,null,null,null,null,null,null,null,null,{"$f":"CONCATENATE(REFERENTES!Q542,\"(\",REFERENTES!R542,\")\")","v":"()"},{"$f":"REFERENTES!S542","v":0}]
[null,null,null,null,null,null,null,null,null,null,null,null,{"$f":"IF(ISNUMBER(FIND(\"RES\",REFERENTES!$Q$628:$Q$1125,1)),REFERENTES!Q1185,\"\")","v":""},{"$f":"REFERENTES!S564","v":0},559,0,1131,"X",null,null,null,null,null,null,null,null,null,{"$f":"CONCATENATE(REFERENTES!Q543,\"(\",REFERENTES!R543,\")\")","v":"()"},{"$f":"REFERENTES!S543","v":0}]
[null,null,null,null,null,null,null,null,null,null,null,null,{"$f":"IF(ISNUMBER(FIND(\"RES\",REFERENTES!$Q$628:$Q$1125,1)),REFERENTES!Q1186,\"\")","v":""},{"$f":"REFERENTES!S565","v":0},560,0,1131,"X",null,null,null,null,null,null,null,null,null,{"$f":"CONCATENATE(REFERENTES!Q544,\"(\",REFERENTES!R544,\")\")","v":"()"},{"$f":"REFERENTES!S544","v":0}]
[null,null,null,null,null,null,null,null,null,null,null,null,{"$f":"IF(ISNUMBER(FIND(\"RES\",REFERENTES!$Q$628:$Q$1125,1)),REFERENTES!Q1187,\"\")","v":""},{"$f":"REFERENTES!S566","v":0},561,0,1131,"X",null,null,null,null,null,null,null,null,null,{"$f":"CONCATENATE(REFERENTES!Q545,\"(\",REFERENTES!R545,\")\")","v":"()"},{"$f":"REFERENTES!S545","v":0}]
[null,null,null,null,null,null,null,null,null,null,null,null,{"$f":"IF(ISNUMBER(FIND(\"RES\",REFERENTES!$Q$628:$Q$1125,1)),REFERENTES!Q1188,\"\")","v":""},{"$f":"REFERENTES!S567","v":0},562,0,1131,"X",null,null,null,null,null,null,null,null,null,{"$f":"CONCATENATE(REFERENTES!Q546,\"(\",REFERENTES!R546,\")\")","v":"()"},{"$f":"REFERENTES!S546","v":0}]
[null,null,null,null,null,null,null,null,null,null,null,null,{"$f":"IF(ISNUMBER(FIND(\"RES\",REFERENTES!$Q$628:$Q$1125,1)),REFERENTES!Q1189,\"\")","v":""},{"$f":"REFERENTES!S568","v":0},563,0,1131,"X",null,null,null,null,null,null,null,null,null,{"$f":"CONCATENATE(REFERENTES!Q547,\"(\",REFERENTES!R547,\")\")","v":"()"},{"$f":"REFERENTES!S547","v":0}]
[null,null,null,null,null,null,null,null,null,null,null,null,{"$f":"IF(ISNUMBER(FIND(\"RES\",REFERENTES!$Q$628:$Q$1125,1)),REFERENTES!Q1190,\"\")","v":""},{"$f":"REFERENTES!S569","v":0},564,0,1131,"X",null,null,null,null,null,null,null,null,null,{"$f":"CONCATENATE(REFERENTES!Q548,\"(\",REFERENTES!R548,\")\")","v":"()"},{"$f":"REFERENTES!S548","v":0}]
[null,null,null,null,null,null,null,null,null,null,null,null,{"$f":"IF(ISNUMBER(FIND(\"RES\",REFERENTES!$Q$628:$Q$1125,1)),REFERENTES!Q1191,\"\")","v":""},{"$f":"REFERENTES!S570","v":0},565,0,1131,"X",null,null,null,null,null,null,null,null,null,{"$f":"CONCATENATE(REFERENTES!Q549,\"(\",REFERENTES!R549,\")\")","v":"()"},{"$f":"REFERENTES!S549","v":0}]
[null,null,null,null,null,null,null,null,null,null,null,null,{"$f":"IF(ISNUMBER(FIND(\"RES\",REFERENTES!$Q$628:$Q$1125,1)),REFERENTES!Q1192,\"\")","v":""},{"$f":"REFERENTES!S571","v":0},566,0,1131,"X",null,null,null,null,null,null,null,null,null,{"$f":"CONCATENATE(REFERENTES!Q550,\"(\",REFERENTES!R550,\")\")","v":"()"},{"$f":"REFERENTES!S550","v":0}]
[null,null,null,null,null,null,null,null,null,null,null,null,{"$f":"IF(ISNUMBER(FIND(\"RES\",REFERENTES!$Q$628:$Q$1125,1)),REFERENTES!Q1193,\"\")","v":""},{"$f":"REFERENTES!S572","v":0},567,0,1131,"X",null,null,null,null,null,null,null,null,null,{"$f":"CONCATENATE(REFERENTES!Q551,\"(\",REFERENTES!R551,\")\")","v":"()"},{"$f":"REFERENTES!S551","v":0}]
[null,null,null,null,null,null,null,null,null,null,null,null,{"$f":"IF(ISNUMBER(FIND(\"RES\",REFERENTES!$Q$628:$Q$1125,1)),REFERENTES!Q1194,\"\")","v":""},{"$f":"REFERENTES!S573","v":0},568,0,1131,"X",null,null,null,null,null,null,null,null,null,{"$f":"CONCATENATE(REFERENTES!Q552,\"(\",REFERENTES!R552,\")\")","v":"()"},{"$f":"REFERENTES!S552","v":0}]
[null,null,null,null,null,null,null,null,null,null,null,null,{"$f":"IF(ISNUMBER(FIND(\"RES\",REFERENTES!$Q$628:$Q$1125,1)),REFERENTES!Q1195,\"\")","v":""},{"$f":"REFERENTES!S574","v":0},569,0,1131,"X",null,null,null,null,null,null,null,null,null,{"$f":"CONCATENATE(REFERENTES!Q553,\"(\",REFERENTES!R553,\")\")","v":"()"},{"$f":"REFERENTES!S553","v":0}]
[null,null,null,null,null,null,null,null,null,null,null,null,{"$f":"IF(ISNUMBER(FIND(\"RES\",REFERENTES!$Q$628:$Q$1125,1)),REFERENTES!Q1196,\"\")","v":""},{"$f":"REFERENTES!S575","v":0},570,0,1131,"X",null,null,null,null,null,null,null,null,null,{"$f":"CONCATENATE(REFERENTES!Q554,\"(\",REFERENTES!R554,\")\")","v":"()"},{"$f":"REFERENTES!S554","v":0}]
[null,null,null,null,null,null,null,null,null,null,null,null,{"$f":"IF(ISNUMBER(FIND(\"RES\",REFERENTES!$Q$628:$Q$1125,1)),REFERENTES!Q1197,\"\")","v":""},{"$f":"REFERENTES!S576","v":0},571,0,1131,"X",null,null,null,null,null,null,null,null,null,{"$f":"CONCATENATE(REFERENTES!Q555,\"(\",REFERENTES!R555,\")\")","v":"()"},{"$f":"REFERENTES!S555","v":0}]
[null,null,null,null,null,null,null,null,null,null,null,null,{"$f":"IF(ISNUMBER(FIND(\"RES\",REFERENTES!$Q$628:$Q$1125,1)),REFERENTES!Q1198,\"\")","v":""},{"$f":"REFERENTES!S577","v":0},572,0,1131,"X",null,null,null,null,null,null,null,null,null,{"$f":"CONCATENATE(REFERENTES!Q556,\"(\",REFERENTES!R556,\")\")","v":"()"},{"$f":"REFERENTES!S556","v":0}]
[null,null,null,null,null,null,null,null,null,null,null,null,{"$f":"IF(ISNUMBER(FIND(\"RES\",REFERENTES!$Q$628:$Q$1125,1)),REFERENTES!Q1199,\"\")","v":""},{"$f":"REFERENTES!S578","v":0},573,0,1131,"X",null,null,null,null,null,null,null,null,null,{"$f":"CONCATENATE(REFERENTES!Q557,\"(\",REFERENTES!R557,\")\")","v":"()"},{"$f":"REFERENTES!S557","v":0}]
[null,null,null,null,null,null,null,null,null,null,null,null,{"$f":"IF(ISNUMBER(FIND(\"RES\",REFERENTES!$Q$628:$Q$1125,1)),REFERENTES!Q1200,\"\")","v":""},{"$f":"REFERENTES!S579","v":0},574,0,1131,"X",null,null,null,null,null,null,null,null,null,{"$f":"CONCATENATE(REFERENTES!Q558,\"(\",REFERENTES!R558,\")\")","v":"()"},{"$f":"REFERENTES!S558","v":0}]
[null,null,null,null,null,null,null,null,null,null,null,null,{"$f":"IF(ISNUMBER(FIND(\"RES\",REFERENTES!$Q$628:$Q$1125,1)),REFERENTES!Q1201,\"\")","v":""},{"$f":"REFERENTES!S580","v":0},575,0,1131,"X",null,null,null,null,null,null,null,null,null,{"$f":"CONCATENATE(REFERENTES!Q559,\"(\",REFERENTES!R559,\")\")","v":"()"},{"$f":"REFERENTES!S559","v":0}]
[null,null,null,null,null,null,null,null,null,null,null,null,{"$f":"IF(ISNUMBER(FIND(\"RES\",REFERENTES!$Q$628:$Q$1125,1)),REFERENTES!Q1202,\"\")","v":""},{"$f":"REFERENTES!S581","v":0},576,0,1131,"X",null,null,null,null,null,null,null,null,null,{"$f":"CONCATENATE(REFERENTES!Q560,\"(\",REFERENTES!R560,\")\")","v":"()"},{"$f":"REFERENTES!S560","v":0}]
[null,null,null,null,null,null,null,null,null,null,null,null,{"$f":"IF(ISNUMBER(FIND(\"RES\",REFERENTES!$Q$628:$Q$1125,1)),REFERENTES!Q1203,\"\")","v":""},{"$f":"REFERENTES!S582","v":0},577,0,1131,"X",null,null,null,null,null,null,null,null,null,{"$f":"CONCATENATE(REFERENTES!Q561,\"(\",REFERENTES!R561,\")\")","v":"()"},{"$f":"REFERENTES!S561","v":0}]
[null,null,null,null,null,null,null,null,null,null,null,null,{"$f":"IF(ISNUMBER(FIND(\"RES\",REFERENTES!$Q$628:$Q$1125,1)),REFERENTES!Q1204,\"\")","v":""},{"$f":"REFERENTES!S583","v":0},578,0,{"$f":"IF(P583=0,MAX($O$6:$O$1135)+1,O583)","v":1131},{"$f":"IFERROR(VLOOKUP(SMALL($Q$6:$Q$1135,O583),$O$6:$P$1135,2,FALSE),\"X\")","v":"X"},null,null,null,null,null,null,null,null,null,{"$f":"CONCATENATE(REFERENTES!Q562,\"(\",REFERENTES!R562,\")\")","v":"()"},{"$f":"REFERENTES!S562","v":0}]
[null,null,null,null,null,null,null,null,null,null,null,null,{"$f":"IF(ISNUMBER(FIND(\"RES\",REFERENTES!$Q$628:$Q$1125,1)),REFERENTES!Q1205,\"\")","v":""},{"$f":"REFERENTES!S584","v":0},579,0,1131,"X",null,null,null,null,null,null,null,null,null,{"$f":"CONCATENATE(REFERENTES!Q563,\"(\",REFERENTES!R563,\")\")","v":"()"},{"$f":"REFERENTES!S563","v":0}]
[null,null,null,null,null,null,null,null,null,null,null,null,{"$f":"IF(ISNUMBER(FIND(\"RES\",REFERENTES!$Q$628:$Q$1125,1)),REFERENTES!Q1206,\"\")","v":""},{"$f":"REFERENTES!S585","v":0},580,{"$f":"IF(M585=\"\",0,M585)","v":0},1131,"X",null,null,null,null,null,null,null,null,null,{"$f":"CONCATENATE(REFERENTES!Q564,\"(\",REFERENTES!R564,\")\")","v":"()"},{"$f":"REFERENTES!S564","v":0}]
[null,null,null,null,null,null,null,null,null,null,null,null,{"$f":"IF(ISNUMBER(FIND(\"RES\",REFERENTES!$Q$628:$Q$1125,1)),REFERENTES!Q1207,\"\")","v":""},{"$f":"REFERENTES!S586","v":0},581,0,1131,"X",null,null,null,null,null,null,null,null,null,{"$f":"CONCATENATE(REFERENTES!Q565,\"(\",REFERENTES!R565,\")\")","v":"()"},{"$f":"REFERENTES!S565","v":0}]
[null,null,null,null,null,null,null,null,null,null,null,null,{"$f":"IF(ISNUMBER(FIND(\"RES\",REFERENTES!$Q$628:$Q$1125,1)),REFERENTES!Q1208,\"\")","v":""},{"$f":"REFERENTES!S587","v":0},582,0,1131,"X",null,null,null,null,null,null,null,null,null,{"$f":"CONCATENATE(REFERENTES!Q566,\"(\",REFERENTES!R566,\")\")","v":"()"},{"$f":"REFERENTES!S566","v":0}]
[null,null,null,null,null,null,null,null,null,null,null,null,{"$f":"IF(ISNUMBER(FIND(\"RES\",REFERENTES!$Q$628:$Q$1125,1)),REFERENTES!Q1209,\"\")","v":""},{"$f":"REFERENTES!S588","v":0},583,0,1131,"X",null,null,null,null,null,null,null,null,null,{"$f":"CONCATENATE(REFERENTES!Q567,\"(\",REFERENTES!R567,\")\")","v":"()"},{"$f":"REFERENTES!S567","v":0}]
[null,null,null,null,null,null,null,null,null,null,null,null,{"$f":"IF(ISNUMBER(FIND(\"RES\",REFERENTES!$Q$628:$Q$1125,1)),REFERENTES!Q1210,\"\")","v":""},{"$f":"REFERENTES!S589","v":0},584,0,1131,"X",null,null,null,null,null,null,null,null,null,{"$f":"CONCATENATE(REFERENTES!Q568,\"(\",REFERENTES!R568,\")\")","v":"()"},{"$f":"REFERENTES!S568","v":0}]
[null,null,null,null,null,null,null,null,null,null,null,null,{"$f":"IF(ISNUMBER(FIND(\"RES\",REFERENTES!$Q$628:$Q$1125,1)),REFERENTES!Q1211,\"\")","v":""},{"$f":"REFERENTES!S590","v":0},585,0,1131,"X",null,null,null,null,null,null,null,null,null,{"$f":"CONCATENATE(REFERENTES!Q569,\"(\",REFERENTES!R569,\")\")","v":"()"},{"$f":"REFERENTES!S569","v":0}]
[null,null,null,null,null,null,null,null,null,null,null,null,{"$f":"IF(ISNUMBER(FIND(\"RES\",REFERENTES!$Q$628:$Q$1125,1)),REFERENTES!Q1212,\"\")","v":""},{"$f":"REFERENTES!S591","v":0},586,0,1131,"X",null,null,null,null,null,null,null,null,null,{"$f":"CONCATENATE(REFERENTES!Q570,\"(\",REFERENTES!R570,\")\")","v":"()"},{"$f":"REFERENTES!S570","v":0}]
[null,null,null,null,null,null,null,null,null,null,null,null,{"$f":"IF(ISNUMBER(FIND(\"RES\",REFERENTES!$Q$628:$Q$1125,1)),REFERENTES!Q1213,\"\")","v":""},{"$f":"REFERENTES!S592","v":0},587,0,1131,"X",null,null,null,null,null,null,null,null,null,{"$f":"CONCATENATE(REFERENTES!Q571,\"(\",REFERENTES!R571,\")\")","v":"()"},{"$f":"REFERENTES!S571","v":0}]
[null,null,null,null,null,null,null,null,null,null,null,null,{"$f":"IF(ISNUMBER(FIND(\"RES\",REFERENTES!$Q$628:$Q$1125,1)),REFERENTES!Q1214,\"\")","v":""},{"$f":"REFERENTES!S593","v":0},588,0,1131,"X",null,null,null,null,null,null,null,null,null,{"$f":"CONCATENATE(REFERENTES!Q572,\"(\",REFERENTES!R572,\")\")","v":"()"},{"$f":"REFERENTES!S572","v":0}]
[null,null,null,null,null,null,null,null,null,null,null,null,{"$f":"IF(ISNUMBER(FIND(\"RES\",REFERENTES!$Q$628:$Q$1125,1)),REFERENTES!Q1215,\"\")","v":""},{"$f":"REFERENTES!S594","v":0},589,0,1131,"X",null,null,null,null,null,null,null,null,null,{"$f":"CONCATENATE(REFERENTES!Q573,\"(\",REFERENTES!R573,\")\")","v":"()"},{"$f":"REFERENTES!S573","v":0}]
[null,null,null,null,null,null,null,null,null,null,null,null,{"$f":"IF(ISNUMBER(FIND(\"RES\",REFERENTES!$Q$628:$Q$1125,1)),REFERENTES!Q1216,\"\")","v":""},{"$f":"REFERENTES!S595","v":0},590,0,1131,"X",null,null,null,null,null,null,null,null,null,{"$f":"CONCATENATE(REFERENTES!Q574,\"(\",REFERENTES!R574,\")\")","v":"()"},{"$f":"REFERENTES!S574","v":0}]
[null,null,null,null,null,null,null,null,null,null,null,null,{"$f":"IF(ISNUMBER(FIND(\"RES\",REFERENTES!$Q$628:$Q$1125,1)),REFERENTES!Q1217,\"\")","v":""},{"$f":"REFERENTES!S596","v":0},591,0,1131,"X",null,null,null,null,null,null,null,null,null,{"$f":"CONCATENATE(REFERENTES!Q575,\"(\",REFERENTES!R575,\")\")","v":"()"},{"$f":"REFERENTES!S575","v":0}]
[null,null,null,null,null,null,null,null,null,null,null,null,{"$f":"IF(ISNUMBER(FIND(\"RES\",REFERENTES!$Q$628:$Q$1125,1)),REFERENTES!Q1218,\"\")","v":""},{"$f":"REFERENTES!S597","v":0},592,0,1131,"X",null,null,null,null,null,null,null,null,null,{"$f":"CONCATENATE(REFERENTES!Q576,\"(\",REFERENTES!R576,\")\")","v":"()"},{"$f":"REFERENTES!S576","v":0}]
[null,null,null,null,null,null,null,null,null,null,null,null,{"$f":"IF(ISNUMBER(FIND(\"RES\",REFERENTES!$Q$628:$Q$1125,1)),REFERENTES!Q1219,\"\")","v":""},{"$f":"REFERENTES!S598","v":0},593,0,1131,"X",null,null,null,null,null,null,null,null,null,{"$f":"CONCATENATE(REFERENTES!Q577,\"(\",REFERENTES!R577,\")\")","v":"()"},{"$f":"REFERENTES!S577","v":0}]
[null,null,null,null,null,null,null,null,null,null,null,null,{"$f":"IF(ISNUMBER(FIND(\"RES\",REFERENTES!$Q$628:$Q$1125,1)),REFERENTES!Q1220,\"\")","v":""},{"$f":"REFERENTES!S599","v":0},594,0,1131,"X",null,null,null,null,null,null,null,null,null,{"$f":"CONCATENATE(REFERENTES!Q578,\"(\",REFERENTES!R578,\")\")","v":"()"},{"$f":"REFERENTES!S578","v":0}]
[null,null,null,null,null,null,null,null,null,null,null,null,{"$f":"IF(ISNUMBER(FIND(\"RES\",REFERENTES!$Q$628:$Q$1125,1)),REFERENTES!Q1221,\"\")","v":""},{"$f":"REFERENTES!S600","v":0},595,0,1131,"X",null,null,null,null,null,null,null,null,null,{"$f":"CONCATENATE(REFERENTES!Q579,\"(\",REFERENTES!R579,\")\")","v":"()"},{"$f":"REFERENTES!S579","v":0}]
[null,null,null,null,null,null,null,null,null,null,null,null,{"$f":"IF(ISNUMBER(FIND(\"RES\",REFERENTES!$Q$628:$Q$1125,1)),REFERENTES!Q1222,\"\")","v":""},{"$f":"REFERENTES!S601","v":0},596,0,1131,"X",null,null,null,null,null,null,null,null,null,{"$f":"CONCATENATE(REFERENTES!Q580,\"(\",REFERENTES!R580,\")\")","v":"()"},{"$f":"REFERENTES!S580","v":0}]
[null,null,null,null,null,null,null,null,null,null,null,null,{"$f":"IF(ISNUMBER(FIND(\"RES\",REFERENTES!$Q$628:$Q$1125,1)),REFERENTES!Q1223,\"\")","v":""},{"$f":"REFERENTES!S602","v":0},597,0,1131,"X",null,null,null,null,null,null,null,null,null,{"$f":"CONCATENATE(REFERENTES!Q581,\"(\",REFERENTES!R581,\")\")","v":"()"},{"$f":"REFERENTES!S581","v":0}]
[null,null,null,null,null,null,null,null,null,null,null,null,{"$f":"IF(ISNUMBER(FIND(\"RES\",REFERENTES!$Q$628:$Q$1125,1)),REFERENTES!Q1224,\"\")","v":""},{"$f":"REFERENTES!S603","v":0},598,0,1131,"X",null,null,null,null,null,null,null,null,null,{"$f":"CONCATENATE(REFERENTES!Q582,\"(\",REFERENTES!R582,\")\")","v":"()"},{"$f":"REFERENTES!S582","v":0}]
[null,null,null,null,null,null,null,null,null,null,null,null,{"$f":"IF(ISNUMBER(FIND(\"RES\",REFERENTES!$Q$628:$Q$1125,1)),REFERENTES!Q1225,\"\")","v":""},{"$f":"REFERENTES!S604","v":0},599,0,1131,"X",null,null,null,null,null,null,null,null,null,{"$f":"CONCATENATE(REFERENTES!Q583,\"(\",REFERENTES!R583,\")\")","v":"()"},{"$f":"REFERENTES!S583","v":0}]
[null,null,null,null,null,null,null,null,null,null,null,null,{"$f":"IF(ISNUMBER(FIND(\"RES\",REFERENTES!$Q$628:$Q$1125,1)),REFERENTES!Q1226,\"\")","v":""},{"$f":"REFERENTES!S605","v":0},600,0,1131,"X",null,null,null,null,null,null,null,null,null,{"$f":"CONCATENATE(REFERENTES!Q584,\"(\",REFERENTES!R584,\")\")","v":"()"},{"$f":"REFERENTES!S584","v":0}]
[null,null,null,null,null,null,null,null,null,null,null,null,{"$f":"IF(ISNUMBER(FIND(\"RES\",REFERENTES!$Q$628:$Q$1125,1)),REFERENTES!Q1227,\"\")","v":""},{"$f":"REFERENTES!S606","v":0},601,0,1131,"X",null,null,null,null,null,null,null,null,null,{"$f":"CONCATENATE(REFERENTES!Q585,\"(\",REFERENTES!R585,\")\")","v":"()"},{"$f":"REFERENTES!S585","v":0}]
[null,null,null,null,null,null,null,null,null,null,null,null,{"$f":"IF(ISNUMBER(FIND(\"RES\",REFERENTES!$Q$628:$Q$1125,1)),REFERENTES!Q1228,\"\")","v":""},{"$f":"REFERENTES!S607","v":0},602,0,1131,"X",null,null,null,null,null,null,null,null,null,{"$f":"CONCATENATE(REFERENTES!Q586,\"(\",REFERENTES!R586,\")\")","v":"()"},{"$f":"REFERENTES!S586","v":0}]
[null,null,null,null,null,null,null,null,null,null,null,null,{"$f":"IF(ISNUMBER(FIND(\"RES\",REFERENTES!$Q$628:$Q$1125,1)),REFERENTES!Q1229,\"\")","v":""},{"$f":"REFERENTES!S608","v":0},603,0,1131,"X",null,null,null,null,null,null,null,null,null,{"$f":"CONCATENATE(REFERENTES!Q587,\"(\",REFERENTES!R587,\")\")","v":"()"},{"$f":"REFERENTES!S587","v":0}]
[null,null,null,null,null,null,null,null,null,null,null,null,{"$f":"IF(ISNUMBER(FIND(\"RES\",REFERENTES!$Q$628:$Q$1125,1)),REFERENTES!Q1230,\"\")","v":""},{"$f":"REFERENTES!S609","v":0},604,0,1131,"X",null,null,null,null,null,null,null,null,null,{"$f":"CONCATENATE(REFERENTES!Q588,\"(\",REFERENTES!R588,\")\")","v":"()"},{"$f":"REFERENTES!S588","v":0}]
[null,null,null,null,null,null,null,null,null,null,null,null,{"$f":"IF(ISNUMBER(FIND(\"RES\",REFERENTES!$Q$628:$Q$1125,1)),REFERENTES!Q1231,\"\")","v":""},{"$f":"REFERENTES!S610","v":0},605,0,1131,"X",null,null,null,null,null,null,null,null,null,{"$f":"CONCATENATE(REFERENTES!Q589,\"(\",REFERENTES!R589,\")\")","v":"()"},{"$f":"REFERENTES!S589","v":0}]
[null,null,null,null,null,null,null,null,null,null,null,null,{"$f":"IF(ISNUMBER(FIND(\"RES\",REFERENTES!$Q$628:$Q$1125,1)),REFERENTES!Q1232,\"\")","v":""},{"$f":"REFERENTES!S611","v":0},606,0,1131,"X",null,null,null,null,null,null,null,null,null,{"$f":"CONCATENATE(REFERENTES!Q590,\"(\",REFERENTES!R590,\")\")","v":"()"},{"$f":"REFERENTES!S590","v":0}]
[null,null,null,null,null,null,null,null,null,null,null,null,{"$f":"IF(ISNUMBER(FIND(\"RES\",REFERENTES!$Q$628:$Q$1125,1)),REFERENTES!Q1233,\"\")","v":""},{"$f":"REFERENTES!S612","v":0},607,0,1131,"X",null,null,null,null,null,null,null,null,null,{"$f":"CONCATENATE(REFERENTES!Q591,\"(\",REFERENTES!R591,\")\")","v":"()"},{"$f":"REFERENTES!S591","v":0}]
[null,null,null,null,null,null,null,null,null,null,null,null,{"$f":"IF(ISNUMBER(FIND(\"RES\",REFERENTES!$Q$628:$Q$1125,1)),REFERENTES!Q1234,\"\")","v":""},{"$f":"REFERENTES!S613","v":0},608,0,1131,"X",null,null,null,null,null,null,null,null,null,{"$f":"CONCATENATE(REFERENTES!Q592,\"(\",REFERENTES!R592,\")\")","v":"()"},{"$f":"REFERENTES!S592","v":0}]
[null,null,null,null,null,null,null,null,null,null,null,null,{"$f":"IF(ISNUMBER(FIND(\"RES\",REFERENTES!$Q$628:$Q$1125,1)),REFERENTES!Q1235,\"\")","v":""},{"$f":"REFERENTES!S614","v":0},609,0,1131,"X",null,null,null,null,null,null,null,null,null,{"$f":"CONCATENATE(REFERENTES!Q593,\"(\",REFERENTES!R593,\")\")","v":"()"},{"$f":"REFERENTES!S593","v":0}]
[null,null,null,null,null,null,null,null,null,null,null,null,{"$f":"IF(ISNUMBER(FIND(\"RES\",REFERENTES!$Q$628:$Q$1125,1)),REFERENTES!Q1236,\"\")","v":""},{"$f":"REFERENTES!S615","v":0},610,0,1131,"X",null,null,null,null,null,null,null,null,null,{"$f":"CONCATENATE(REFERENTES!Q594,\"(\",REFERENTES!R594,\")\")","v":"()"},{"$f":"REFERENTES!S594","v":0}]
[null,null,null,null,null,null,null,null,null,null,null,null,{"$f":"IF(ISNUMBER(FIND(\"RES\",REFERENTES!$Q$628:$Q$1125,1)),REFERENTES!Q1237,\"\")","v":""},{"$f":"REFERENTES!S616","v":0},611,0,1131,"X",null,null,null,null,null,null,null,null,null,{"$f":"CONCATENATE(REFERENTES!Q595,\"(\",REFERENTES!R595,\")\")","v":"()"},{"$f":"REFERENTES!S595","v":0}]
[null,null,null,null,null,null,null,null,null,null,null,null,{"$f":"IF(ISNUMBER(FIND(\"RES\",REFERENTES!$Q$628:$Q$1125,1)),REFERENTES!Q1238,\"\")","v":""},{"$f":"REFERENTES!S617","v":0},612,0,1131,"X",null,null,null,null,null,null,null,null,null,{"$f":"CONCATENATE(REFERENTES!Q596,\"(\",REFERENTES!R596,\")\")","v":"()"},{"$f":"REFERENTES!S596","v":0}]
[null,null,null,null,null,null,null,null,null,null,null,null,{"$f":"IF(ISNUMBER(FIND(\"RES\",REFERENTES!$Q$628:$Q$1125,1)),REFERENTES!Q1239,\"\")","v":""},{"$f":"REFERENTES!S618","v":0},613,0,1131,"X",null,null,null,null,null,null,null,null,null,{"$f":"CONCATENATE(REFERENTES!Q597,\"(\",REFERENTES!R597,\")\")","v":"()"},{"$f":"REFERENTES!S597","v":0}]
[null,null,null,null,null,null,null,null,null,null,null,null,{"$f":"IF(ISNUMBER(FIND(\"RES\",REFERENTES!$Q$628:$Q$1125,1)),REFERENTES!Q1240,\"\")","v":""},{"$f":"REFERENTES!S619","v":0},614,0,1131,"X",null,null,null,null,null,null,null,null,null,{"$f":"CONCATENATE(REFERENTES!Q598,\"(\",REFERENTES!R598,\")\")","v":"()"},{"$f":"REFERENTES!S598","v":0}]
[null,null,null,null,null,null,null,null,null,null,null,null,{"$f":"IF(ISNUMBER(FIND(\"RES\",REFERENTES!$Q$628:$Q$1125,1)),REFERENTES!Q1241,\"\")","v":""},{"$f":"REFERENTES!S620","v":0},615,0,1131,"X",null,null,null,null,null,null,null,null,null,{"$f":"CONCATENATE(REFERENTES!Q599,\"(\",REFERENTES!R599,\")\")","v":"()"},{"$f":"REFERENTES!S599","v":0}]
[null,null,null,null,null,null,null,null,null,null,null,null,{"$f":"IF(ISNUMBER(FIND(\"RES\",REFERENTES!$Q$628:$Q$1125,1)),REFERENTES!Q1242,\"\")","v":""},{"$f":"REFERENTES!S621","v":0},616,0,1131,"X",null,null,null,null,null,null,null,null,null,{"$f":"CONCATENATE(REFERENTES!Q600,\"(\",REFERENTES!R600,\")\")","v":"()"},{"$f":"REFERENTES!S600","v":0}]
[null,null,null,null,null,null,null,null,null,null,null,null,{"$f":"IF(ISNUMBER(FIND(\"RES\",REFERENTES!$Q$628:$Q$1125,1)),REFERENTES!Q1243,\"\")","v":""},{"$f":"REFERENTES!S622","v":0},617,0,1131,"X",null,null,null,null,null,null,null,null,null,{"$f":"CONCATENATE(REFERENTES!Q601,\"(\",REFERENTES!R601,\")\")","v":"()"},{"$f":"REFERENTES!S601","v":0}]
[null,null,null,null,null,null,null,null,null,null,null,null,{"$f":"IF(ISNUMBER(FIND(\"RES\",REFERENTES!$Q$628:$Q$1125,1)),REFERENTES!Q1244,\"\")","v":""},{"$f":"REFERENTES!S623","v":0},618,0,1131,"X",null,null,null,null,null,null,null,null,null,{"$f":"CONCATENATE(REFERENTES!Q602,\"(\",REFERENTES!R602,\")\")","v":"()"},{"$f":"REFERENTES!S602","v":0}]
[null,null,null,null,null,null,null,null,null,null,null,null,{"$f":"IF(ISNUMBER(FIND(\"RES\",REFERENTES!$Q$628:$Q$1125,1)),REFERENTES!Q1245,\"\")","v":""},{"$f":"REFERENTES!S624","v":0},619,0,1131,"X",null,null,null,null,null,null,null,null,null,{"$f":"CONCATENATE(REFERENTES!Q603,\"(\",REFERENTES!R603,\")\")","v":"()"},{"$f":"REFERENTES!S603","v":0}]
[null,null,null,null,null,null,null,null,null,null,null,null,{"$f":"IF(ISNUMBER(FIND(\"RES\",REFERENTES!$Q$628:$Q$1125,1)),REFERENTES!Q1246,\"\")","v":""},{"$f":"REFERENTES!S625","v":0},620,0,1131,"X",null,null,null,null,null,null,null,null,null,{"$f":"CONCATENATE(REFERENTES!Q604,\"(\",REFERENTES!R604,\")\")","v":"()"},{"$f":"REFERENTES!S604","v":0}]
[null,null,null,null,null,null,null,null,null,null,null,null,{"$f":"IF(ISNUMBER(FIND(\"RES\",REFERENTES!$Q$628:$Q$1125,1)),REFERENTES!Q1247,\"\")","v":""},{"$f":"REFERENTES!S626","v":0},621,0,1131,"X",null,null,null,null,null,null,null,null,null,{"$f":"CONCATENATE(REFERENTES!Q605,\"(\",REFERENTES!R605,\")\")","v":"()"},{"$f":"REFERENTES!S605","v":0}]
[null,null,null,null,null,null,null,null,null,null,null,null,{"$f":"IF(ISNUMBER(FIND(\"RES\",REFERENTES!$Q$628:$Q$1125,1)),REFERENTES!Q1248,\"\")","v":""},{"$f":"REFERENTES!S627","v":0},622,0,1131,"X",null,null,null,null,null,null,null,null,null,{"$f":"CONCATENATE(REFERENTES!Q606,\"(\",REFERENTES!R606,\")\")","v":"()"},{"$f":"REFERENTES!S606","v":0}]
[null,null,null,null,null,null,null,null,null,null,null,null,{"$f":"IF(ISNUMBER(FIND(\"RES\",REFERENTES!$Q$628:$Q$1125,1)),REFERENTES!Q1249,\"\")","v":""},{"$f":"REFERENTES!S628","v":0},623,0,1131,"X",null,null,null,null,null,null,null,null,null,{"$f":"CONCATENATE(REFERENTES!Q607,\"(\",REFERENTES!R607,\")\")","v":"()"},{"$f":"REFERENTES!S607","v":0}]
[null,null,null,null,null,null,null,null,null,null,null,null,{"$f":"IF(ISNUMBER(FIND(\"RES\",REFERENTES!$Q$628:$Q$1125,1)),REFERENTES!Q1250,\"\")","v":""},{"$f":"REFERENTES!S629","v":0},624,0,1131,"X",null,null,null,null,null,null,null,null,null,{"$f":"CONCATENATE(REFERENTES!Q608,\"(\",REFERENTES!R608,\")\")","v":"()"},{"$f":"REFERENTES!S608","v":0}]
[null,null,null,null,null,null,null,null,null,null,null,null,{"$f":"IF(ISNUMBER(FIND(\"RES\",REFERENTES!$Q$628:$Q$1125,1)),REFERENTES!Q1251,\"\")","v":""},{"$f":"REFERENTES!S630","v":0},625,0,1131,"X",null,null,null,null,null,null,null,null,null,{"$f":"CONCATENATE(REFERENTES!Q609,\"(\",REFERENTES!R609,\")\")","v":"()"},{"$f":"REFERENTES!S609","v":0}]
[null,null,null,null,null,null,null,null,null,null,null,null,{"$f":"IF(ISNUMBER(FIND(\"RES\",REFERENTES!$Q$628:$Q$1125,1)),REFERENTES!Q1252,\"\")","v":""},{"$f":"REFERENTES!S631","v":0},626,0,1131,"X",null,null,null,null,null,null,null,null,null,{"$f":"CONCATENATE(REFERENTES!Q610,\"(\",REFERENTES!R610,\")\")","v":"()"},{"$f":"REFERENTES!S610","v":0}]
[null,null,null,null,null,null,null,null,null,null,null,null,{"$f":"IF(ISNUMBER(FIND(\"RES\",REFERENTES!$Q$628:$Q$1125,1)),REFERENTES!Q1253,\"\")","v":""},{"$f":"REFERENTES!S632","v":0},627,0,1131,"X",null,null,null,null,null,null,null,null,null,{"$f":"CONCATENATE(REFERENTES!Q611,\"(\",REFERENTES!R611,\")\")","v":"()"},{"$f":"REFERENTES!S611","v":0}]
[null,null,null,null,null,null,null,null,null,null,null,null,{"$f":"IF(ISNUMBER(FIND(\"RES\",REFERENTES!$Q$628:$Q$1125,1)),REFERENTES!Q1254,\"\")","v":""},{"$f":"REFERENTES!S633","v":0},628,0,1131,"X",null,null,null,null,null,null,null,null,null,{"$f":"CONCATENATE(REFERENTES!Q612,\"(\",REFERENTES!R612,\")\")","v":"()"},{"$f":"REFERENTES!S612","v":0}]
[null,null,null,null,null,null,null,null,null,null,null,null,{"$f":"IF(ISNUMBER(FIND(\"RES\",REFERENTES!$Q$628:$Q$1125,1)),REFERENTES!Q1255,\"\")","v":""},{"$f":"REFERENTES!S634","v":0},629,0,1131,"X",null,null,null,null,null,null,null,null,null,{"$f":"CONCATENATE(REFERENTES!Q613,\"(\",REFERENTES!R613,\")\")","v":"()"},{"$f":"REFERENTES!S613","v":0}]
[null,null,null,null,null,null,null,null,null,null,null,null,{"$f":"IF(ISNUMBER(FIND(\"RES\",REFERENTES!$Q$628:$Q$1125,1)),REFERENTES!Q1256,\"\")","v":""},{"$f":"REFERENTES!S635","v":0},630,0,1131,"X",null,null,null,null,null,null,null,null,null,{"$f":"CONCATENATE(REFERENTES!Q614,\"(\",REFERENTES!R614,\")\")","v":"()"},{"$f":"REFERENTES!S614","v":0}]
[null,null,null,null,null,null,null,null,null,null,null,null,{"$f":"IF(ISNUMBER(FIND(\"RES\",REFERENTES!$Q$628:$Q$1125,1)),REFERENTES!Q1257,\"\")","v":""},{"$f":"REFERENTES!S636","v":0},631,0,1131,"X",null,null,null,null,null,null,null,null,null,{"$f":"CONCATENATE(REFERENTES!Q615,\"(\",REFERENTES!R615,\")\")","v":"()"},{"$f":"REFERENTES!S615","v":0}]
[null,null,null,null,null,null,null,null,null,null,null,null,{"$f":"IF(ISNUMBER(FIND(\"RES\",REFERENTES!$Q$628:$Q$1125,1)),REFERENTES!Q1258,\"\")","v":""},{"$f":"REFERENTES!S637","v":0},632,0,1131,"X",null,null,null,null,null,null,null,null,null,{"$f":"CONCATENATE(REFERENTES!Q616,\"(\",REFERENTES!R616,\")\")","v":"()"},{"$f":"REFERENTES!S616","v":0}]
[null,null,null,null,null,null,null,null,null,null,null,null,{"$f":"IF(ISNUMBER(FIND(\"RES\",REFERENTES!$Q$628:$Q$1125,1)),REFERENTES!Q1259,\"\")","v":""},{"$f":"REFERENTES!S638","v":0},633,0,1131,"X",null,null,null,null,null,null,null,null,null,{"$f":"CONCATENATE(REFERENTES!Q617,\"(\",REFERENTES!R617,\")\")","v":"()"},{"$f":"REFERENTES!S617","v":0}]
[null,null,null,null,null,null,null,null,null,null,null,null,{"$f":"IF(ISNUMBER(FIND(\"RES\",REFERENTES!$Q$628:$Q$1125,1)),REFERENTES!Q1260,\"\")","v":""},{"$f":"REFERENTES!S639","v":0},634,0,1131,"X",null,null,null,null,null,null,null,null,null,{"$f":"CONCATENATE(REFERENTES!Q618,\"(\",REFERENTES!R618,\")\")","v":"()"},{"$f":"REFERENTES!S618","v":0}]
[null,null,null,null,null,null,null,null,null,null,null,null,{"$f":"IF(ISNUMBER(FIND(\"RES\",REFERENTES!$Q$628:$Q$1125,1)),REFERENTES!Q1261,\"\")","v":""},{"$f":"REFERENTES!S640","v":0},635,0,1131,"X",null,null,null,null,null,null,null,null,null,{"$f":"CONCATENATE(REFERENTES!Q619,\"(\",REFERENTES!R619,\")\")","v":"()"},{"$f":"REFERENTES!S619","v":0}]
[null,null,null,null,null,null,null,null,null,null,null,null,{"$f":"IF(ISNUMBER(FIND(\"RES\",REFERENTES!$Q$628:$Q$1125,1)),REFERENTES!Q1262,\"\")","v":""},{"$f":"REFERENTES!S641","v":0},636,0,1131,"X",null,null,null,null,null,null,null,null,null,{"$f":"CONCATENATE(REFERENTES!Q620,\"(\",REFERENTES!R620,\")\")","v":"()"},{"$f":"REFERENTES!S620","v":0}]
[null,null,null,null,null,null,null,null,null,null,null,null,{"$f":"IF(ISNUMBER(FIND(\"RES\",REFERENTES!$Q$628:$Q$1125,1)),REFERENTES!Q1263,\"\")","v":""},{"$f":"REFERENTES!S642","v":0},637,0,1131,"X",null,null,null,null,null,null,null,null,null,{"$f":"CONCATENATE(REFERENTES!Q621,\"(\",REFERENTES!R621,\")\")","v":"()"},{"$f":"REFERENTES!S621","v":0}]
[null,null,null,null,null,null,null,null,null,null,null,null,{"$f":"IF(ISNUMBER(FIND(\"RES\",REFERENTES!$Q$628:$Q$1125,1)),REFERENTES!Q1264,\"\")","v":""},{"$f":"REFERENTES!S643","v":0},638,0,1131,"X",null,null,null,null,null,null,null,null,null,{"$f":"CONCATENATE(REFERENTES!Q622,\"(\",REFERENTES!R622,\")\")","v":"()"},{"$f":"REFERENTES!S622","v":0}]
[null,null,null,null,null,null,null,null,null,null,null,null,{"$f":"IF(ISNUMBER(FIND(\"RES\",REFERENTES!$Q$628:$Q$1125,1)),REFERENTES!Q1265,\"\")","v":""},{"$f":"REFERENTES!S644","v":0},639,0,1131,"X",null,null,null,null,null,null,null,null,null,{"$f":"CONCATENATE(REFERENTES!Q623,\"(\",REFERENTES!R623,\")\")","v":"()"},{"$f":"REFERENTES!S623","v":0}]
[null,null,null,null,null,null,null,null,null,null,null,null,{"$f":"IF(ISNUMBER(FIND(\"RES\",REFERENTES!$Q$628:$Q$1125,1)),REFERENTES!Q1266,\"\")","v":""},{"$f":"REFERENTES!S645","v":0},640,0,1131,"X",null,null,null,null,null,null,null,null,null,{"$f":"CONCATENATE(REFERENTES!Q624,\"(\",REFERENTES!R624,\")\")","v":"()"},{"$f":"REFERENTES!S624","v":0}]
[null,null,null,null,null,null,null,null,null,null,null,null,{"$f":"IF(ISNUMBER(FIND(\"RES\",REFERENTES!$Q$628:$Q$1125,1)),REFERENTES!Q1267,\"\")","v":""},{"$f":"REFERENTES!S646","v":0},641,0,1131,"X",null,null,null,null,null,null,null,null,null,{"$f":"CONCATENATE(REFERENTES!Q625,\"(\",REFERENTES!R625,\")\")","v":"()"},{"$f":"REFERENTES!S625","v":0}]
[null,null,null,null,null,null,null,null,null,null,null,null,{"$f":"IF(ISNUMBER(FIND(\"RES\",REFERENTES!$Q$628:$Q$1125,1)),REFERENTES!Q1268,\"\")","v":""},{"$f":"REFERENTES!S647","v":0},642,0,{"$f":"IF(P647=0,MAX($O$6:$O$1135)+1,O647)","v":1131},{"$f":"IFERROR(VLOOKUP(SMALL($Q$6:$Q$1135,O647),$O$6:$P$1135,2,FALSE),\"X\")","v":"X"},null,null,null,null,null,null,null,null,null,{"$f":"CONCATENATE(REFERENTES!Q626,\"(\",REFERENTES!R626,\")\")","v":"()"},{"$f":"REFERENTES!S626","v":0}]
[null,null,null,null,null,null,null,null,null,null,null,null,{"$f":"IF(ISNUMBER(FIND(\"RES\",REFERENTES!$Q$628:$Q$1125,1)),REFERENTES!Q1269,\"\")","v":""},{"$f":"REFERENTES!S648","v":0},643,0,1131,"X",null,null,null,null,null,null,null,null,null,{"$f":"CONCATENATE(REFERENTES!Q627,\"(\",REFERENTES!R627,\")\")","v":"()"},{"$f":"REFERENTES!S627","v":0}]
[null,null,null,null,null,null,null,null,null,null,null,null,{"$f":"IF(ISNUMBER(FIND(\"RES\",REFERENTES!$Q$628:$Q$1125,1)),REFERENTES!Q1270,\"\")","v":""},{"$f":"REFERENTES!S649","v":0},644,{"$f":"IF(M649=\"\",0,M649)","v":0},1131,"X",null,null,null,null,null,null,null,null,null,{"$f":"CONCATENATE(REFERENTES!Q628,\"(\",REFERENTES!R628,\")\")","v":"()"},{"$f":"REFERENTES!S628","v":0}]
[null,null,null,null,null,null,null,null,null,null,null,null,{"$f":"IF(ISNUMBER(FIND(\"RES\",REFERENTES!$Q$628:$Q$1125,1)),REFERENTES!Q1271,\"\")","v":""},{"$f":"REFERENTES!S650","v":0},645,0,1131,"X",null,null,null,null,null,null,null,null,null,{"$f":"CONCATENATE(REFERENTES!Q629,\"(\",REFERENTES!R629,\")\")","v":"()"},{"$f":"REFERENTES!S629","v":0}]
[null,null,null,null,null,null,null,null,null,null,null,null,{"$f":"IF(ISNUMBER(FIND(\"RES\",REFERENTES!$Q$628:$Q$1125,1)),REFERENTES!Q1272,\"\")","v":""},{"$f":"REFERENTES!S651","v":0},646,0,1131,"X",null,null,null,null,null,null,null,null,null,{"$f":"CONCATENATE(REFERENTES!Q630,\"(\",REFERENTES!R630,\")\")","v":"()"},{"$f":"REFERENTES!S630","v":0}]
[null,null,null,null,null,null,null,null,null,null,null,null,{"$f":"IF(ISNUMBER(FIND(\"RES\",REFERENTES!$Q$628:$Q$1125,1)),REFERENTES!Q1273,\"\")","v":""},{"$f":"REFERENTES!S652","v":0},647,0,1131,"X",null,null,null,null,null,null,null,null,null,{"$f":"CONCATENATE(REFERENTES!Q631,\"(\",REFERENTES!R631,\")\")","v":"()"},{"$f":"REFERENTES!S631","v":0}]
[null,null,null,null,null,null,null,null,null,null,null,null,{"$f":"IF(ISNUMBER(FIND(\"RES\",REFERENTES!$Q$628:$Q$1125,1)),REFERENTES!Q1274,\"\")","v":""},{"$f":"REFERENTES!S653","v":0},648,0,1131,"X",null,null,null,null,null,null,null,null,null,{"$f":"CONCATENATE(REFERENTES!Q632,\"(\",REFERENTES!R632,\")\")","v":"()"},{"$f":"REFERENTES!S632","v":0}]
[null,null,null,null,null,null,null,null,null,null,null,null,{"$f":"IF(ISNUMBER(FIND(\"RES\",REFERENTES!$Q$628:$Q$1125,1)),REFERENTES!Q1275,\"\")","v":""},{"$f":"REFERENTES!S654","v":0},649,0,1131,"X",null,null,null,null,null,null,null,null,null,{"$f":"CONCATENATE(REFERENTES!Q633,\"(\",REFERENTES!R633,\")\")","v":"()"},{"$f":"REFERENTES!S633","v":0}]
[null,null,null,null,null,null,null,null,null,null,null,null,{"$f":"IF(ISNUMBER(FIND(\"RES\",REFERENTES!$Q$628:$Q$1125,1)),REFERENTES!Q1276,\"\")","v":""},{"$f":"REFERENTES!S655","v":0},650,0,1131,"X",null,null,null,null,null,null,null,null,null,{"$f":"CONCATENATE(REFERENTES!Q634,\"(\",REFERENTES!R634,\")\")","v":"()"},{"$f":"REFERENTES!S634","v":0}]
[null,null,null,null,null,null,null,null,null,null,null,null,{"$f":"IF(ISNUMBER(FIND(\"RES\",REFERENTES!$Q$628:$Q$1125,1)),REFERENTES!Q1277,\"\")","v":""},{"$f":"REFERENTES!S656","v":0},651,0,1131,"X",null,null,null,null,null,null,null,null,null,{"$f":"CONCATENATE(REFERENTES!Q635,\"(\",REFERENTES!R635,\")\")","v":"()"},{"$f":"REFERENTES!S635","v":0}]
[null,null,null,null,null,null,null,null,null,null,null,null,{"$f":"IF(ISNUMBER(FIND(\"RES\",REFERENTES!$Q$628:$Q$1125,1)),REFERENTES!Q1278,\"\")","v":""},{"$f":"REFERENTES!S657","v":0},652,0,1131,"X",null,null,null,null,null,null,null,null,null,{"$f":"CONCATENATE(REFERENTES!Q636,\"(\",REFERENTES!R636,\")\")","v":"()"},{"$f":"REFERENTES!S636","v":0}]
[null,null,null,null,null,null,null,null,null,null,null,null,{"$f":"IF(ISNUMBER(FIND(\"RES\",REFERENTES!$Q$628:$Q$1125,1)),REFERENTES!Q1279,\"\")","v":""},{"$f":"REFERENTES!S658","v":0},653,0,1131,"X",null,null,null,null,null,null,null,null,null,{"$f":"CONCATENATE(REFERENTES!Q637,\"(\",REFERENTES!R637,\")\")","v":"()"},{"$f":"REFERENTES!S637","v":0}]
[null,null,null,null,null,null,null,null,null,null,null,null,{"$f":"IF(ISNUMBER(FIND(\"RES\",REFERENTES!$Q$628:$Q$1125,1)),REFERENTES!Q1280,\"\")","v":""},{"$f":"REFERENTES!S659","v":0},654,0,1131,"X",null,null,null,null,null,null,null,null,null,{"$f":"CONCATENATE(REFERENTES!Q638,\"(\",REFERENTES!R638,\")\")","v":"()"},{"$f":"REFERENTES!S638","v":0}]
[null,null,null,null,null,null,null,null,null,null,null,null,{"$f":"IF(ISNUMBER(FIND(\"RES\",REFERENTES!$Q$628:$Q$1125,1)),REFERENTES!Q1281,\"\")","v":""},{"$f":"REFERENTES!S660","v":0},655,0,1131,"X",null,null,null,null,null,null,null,null,null,{"$f":"CONCATENATE(REFERENTES!Q639,\"(\",REFERENTES!R639,\")\")","v":"()"},{"$f":"REFERENTES!S639","v":0}]
[null,null,null,null,null,null,null,null,null,null,null,null,{"$f":"IF(ISNUMBER(FIND(\"RES\",REFERENTES!$Q$628:$Q$1125,1)),REFERENTES!Q1282,\"\")","v":""},{"$f":"REFERENTES!S661","v":0},656,0,1131,"X",null,null,null,null,null,null,null,null,null,{"$f":"CONCATENATE(REFERENTES!Q640,\"(\",REFERENTES!R640,\")\")","v":"()"},{"$f":"REFERENTES!S640","v":0}]
[null,null,null,null,null,null,null,null,null,null,null,null,{"$f":"IF(ISNUMBER(FIND(\"RES\",REFERENTES!$Q$628:$Q$1125,1)),REFERENTES!Q1283,\"\")","v":""},{"$f":"REFERENTES!S662","v":0},657,0,1131,"X",null,null,null,null,null,null,null,null,null,{"$f":"CONCATENATE(REFERENTES!Q641,\"(\",REFERENTES!R641,\")\")","v":"()"},{"$f":"REFERENTES!S641","v":0}]
[null,null,null,null,null,null,null,null,null,null,null,null,{"$f":"IF(ISNUMBER(FIND(\"RES\",REFERENTES!$Q$628:$Q$1125,1)),REFERENTES!Q1284,\"\")","v":""},{"$f":"REFERENTES!S663","v":0},658,0,1131,"X",null,null,null,null,null,null,null,null,null,{"$f":"CONCATENATE(REFERENTES!Q642,\"(\",REFERENTES!R642,\")\")","v":"()"},{"$f":"REFERENTES!S642","v":0}]
[null,null,null,null,null,null,null,null,null,null,null,null,{"$f":"IF(ISNUMBER(FIND(\"RES\",REFERENTES!$Q$628:$Q$1125,1)),REFERENTES!Q1285,\"\")","v":""},{"$f":"REFERENTES!S664","v":0},659,0,1131,"X",null,null,null,null,null,null,null,null,null,{"$f":"CONCATENATE(REFERENTES!Q643,\"(\",REFERENTES!R643,\")\")","v":"()"},{"$f":"REFERENTES!S643","v":0}]
[null,null,null,null,null,null,null,null,null,null,null,null,{"$f":"IF(ISNUMBER(FIND(\"RES\",REFERENTES!$Q$628:$Q$1125,1)),REFERENTES!Q1286,\"\")","v":""},{"$f":"REFERENTES!S665","v":0},660,0,1131,"X",null,null,null,null,null,null,null,null,null,{"$f":"CONCATENATE(REFERENTES!Q644,\"(\",REFERENTES!R644,\")\")","v":"()"},{"$f":"REFERENTES!S644","v":0}]
[null,null,null,null,null,null,null,null,null,null,null,null,{"$f":"IF(ISNUMBER(FIND(\"RES\",REFERENTES!$Q$628:$Q$1125,1)),REFERENTES!Q1287,\"\")","v":""},{"$f":"REFERENTES!S666","v":0},661,0,1131,"X",null,null,null,null,null,null,null,null,null,{"$f":"CONCATENATE(REFERENTES!Q645,\"(\",REFERENTES!R645,\")\")","v":"()"},{"$f":"REFERENTES!S645","v":0}]
[null,null,null,null,null,null,null,null,null,null,null,null,{"$f":"IF(ISNUMBER(FIND(\"RES\",REFERENTES!$Q$628:$Q$1125,1)),REFERENTES!Q1288,\"\")","v":""},{"$f":"REFERENTES!S667","v":0},662,0,1131,"X",null,null,null,null,null,null,null,null,null,{"$f":"CONCATENATE(REFERENTES!Q646,\"(\",REFERENTES!R646,\")\")","v":"()"},{"$f":"REFERENTES!S646","v":0}]
[null,null,null,null,null,null,null,null,null,null,null,null,{"$f":"IF(ISNUMBER(FIND(\"RES\",REFERENTES!$Q$628:$Q$1125,1)),REFERENTES!Q1289,\"\")","v":""},{"$f":"REFERENTES!S668","v":0},663,0,1131,"X",null,null,null,null,null,null,null,null,null,{"$f":"CONCATENATE(REFERENTES!Q647,\"(\",REFERENTES!R647,\")\")","v":"()"},{"$f":"REFERENTES!S647","v":0}]
[null,null,null,null,null,null,null,null,null,null,null,null,{"$f":"IF(ISNUMBER(FIND(\"RES\",REFERENTES!$Q$628:$Q$1125,1)),REFERENTES!Q1290,\"\")","v":""},{"$f":"REFERENTES!S669","v":0},664,0,1131,"X",null,null,null,null,null,null,null,null,null,{"$f":"CONCATENATE(REFERENTES!Q648,\"(\",REFERENTES!R648,\")\")","v":"()"},{"$f":"REFERENTES!S648","v":0}]
[null,null,null,null,null,null,null,null,null,null,null,null,{"$f":"IF(ISNUMBER(FIND(\"RES\",REFERENTES!$Q$628:$Q$1125,1)),REFERENTES!Q1291,\"\")","v":""},{"$f":"REFERENTES!S670","v":0},665,0,1131,"X",null,null,null,null,null,null,null,null,null,{"$f":"CONCATENATE(REFERENTES!Q649,\"(\",REFERENTES!R649,\")\")","v":"()"},{"$f":"REFERENTES!S649","v":0}]
[null,null,null,null,null,null,null,null,null,null,null,null,{"$f":"IF(ISNUMBER(FIND(\"RES\",REFERENTES!$Q$628:$Q$1125,1)),REFERENTES!Q1292,\"\")","v":""},{"$f":"REFERENTES!S671","v":0},666,0,1131,"X",null,null,null,null,null,null,null,null,null,{"$f":"CONCATENATE(REFERENTES!Q650,\"(\",REFERENTES!R650,\")\")","v":"()"},{"$f":"REFERENTES!S650","v":0}]
[null,null,null,null,null,null,null,null,null,null,null,null,{"$f":"IF(ISNUMBER(FIND(\"RES\",REFERENTES!$Q$628:$Q$1125,1)),REFERENTES!Q1293,\"\")","v":""},{"$f":"REFERENTES!S672","v":0},667,0,1131,"X",null,null,null,null,null,null,null,null,null,{"$f":"CONCATENATE(REFERENTES!Q651,\"(\",REFERENTES!R651,\")\")","v":"()"},{"$f":"REFERENTES!S651","v":0}]
[null,null,null,null,null,null,null,null,null,null,null,null,{"$f":"IF(ISNUMBER(FIND(\"RES\",REFERENTES!$Q$628:$Q$1125,1)),REFERENTES!Q1294,\"\")","v":""},{"$f":"REFERENTES!S673","v":0},668,0,1131,"X",null,null,null,null,null,null,null,null,null,{"$f":"CONCATENATE(REFERENTES!Q652,\"(\",REFERENTES!R652,\")\")","v":"()"},{"$f":"REFERENTES!S652","v":0}]
[null,null,null,null,null,null,null,null,null,null,null,null,{"$f":"IF(ISNUMBER(FIND(\"RES\",REFERENTES!$Q$628:$Q$1125,1)),REFERENTES!Q1295,\"\")","v":""},{"$f":"REFERENTES!S674","v":0},669,0,1131,"X"]
[null,null,null,null,null,null,null,null,null,null,null,null,{"$f":"IF(ISNUMBER(FIND(\"RES\",REFERENTES!$Q$628:$Q$1125,1)),REFERENTES!Q1296,\"\")","v":""},{"$f":"REFERENTES!S675","v":0},670,0,1131,"X"]
[null,null,null,null,null,null,null,null,null,null,null,null,{"$f":"IF(ISNUMBER(FIND(\"RES\",REFERENTES!$Q$628:$Q$1125,1)),REFERENTES!Q1297,\"\")","v":""},{"$f":"REFERENTES!S676","v":0},671,0,1131,"X"]
[null,null,null,null,null,null,null,null,null,null,null,null,{"$f":"IF(ISNUMBER(FIND(\"RES\",REFERENTES!$Q$628:$Q$1125,1)),REFERENTES!Q1298,\"\")","v":""},{"$f":"REFERENTES!S677","v":0},672,0,1131,"X"]
[null,null,null,null,null,null,null,null,null,null,null,null,{"$f":"IF(ISNUMBER(FIND(\"RES\",REFERENTES!$Q$628:$Q$1125,1)),REFERENTES!Q1299,\"\")","v":""},{"$f":"REFERENTES!S678","v":0},673,0,1131,"X"]
[null,null,null,null,null,null,null,null,null,null,null,null,{"$f":"IF(ISNUMBER(FIND(\"RES\",REFERENTES!$Q$628:$Q$1125,1)),REFERENTES!Q1300,\"\")","v":""},{"$f":"REFERENTES!S679","v":0},674,0,1131,"X"]
[null,null,null,null,null,null,null,null,null,null,null,null,{"$f":"IF(ISNUMBER(FIND(\"RES\",REFERENTES!$Q$628:$Q$1125,1)),REFERENTES!Q1301,\"\")","v":""},{"$f":"REFERENTES!S680","v":0},675,0,1131,"X"]
[null,null,null,null,null,null,null,null,null,null,null,null,{"$f":"IF(ISNUMBER(FIND(\"RES\",REFERENTES!$Q$628:$Q$1125,1)),REFERENTES!Q1302,\"\")","v":""},{"$f":"REFERENTES!S681","v":0},676,0,1131,"X"]
[null,null,null,null,null,null,null,null,null,null,null,null,{"$f":"IF(ISNUMBER(FIND(\"RES\",REFERENTES!$Q$628:$Q$1125,1)),REFERENTES!Q1303,\"\")","v":""},{"$f":"REFERENTES!S682","v":0},677,0,1131,"X"]
[null,null,null,null,null,null,null,null,null,null,null,null,{"$f":"IF(ISNUMBER(FIND(\"RES\",REFERENTES!$Q$628:$Q$1125,1)),REFERENTES!Q1304,\"\")","v":""},{"$f":"REFERENTES!S683","v":0},678,0,1131,"X"]
[null,null,null,null,null,null,null,null,null,null,null,null,{"$f":"IF(ISNUMBER(FIND(\"RES\",REFERENTES!$Q$628:$Q$1125,1)),REFERENTES!Q1305,\"\")","v":""},{"$f":"REFERENTES!S684","v":0},679,0,1131,"X"]
[null,null,null,null,null,null,null,null,null,null,null,null,{"$f":"IF(ISNUMBER(FIND(\"RES\",REFERENTES!$Q$628:$Q$1125,1)),REFERENTES!Q1306,\"\")","v":""},{"$f":"REFERENTES!S685","v":0},680,0,1131,"X"]
[null,null,null,null,null,null,null,null,null,null,null,null,{"$f":"IF(ISNUMBER(FIND(\"RES\",REFERENTES!$Q$628:$Q$1125,1)),REFERENTES!Q1307,\"\")","v":""},{"$f":"REFERENTES!S686","v":0},681,0,1131,"X"]
[null,null,null,null,null,null,null,null,null,null,null,null,{"$f":"IF(ISNUMBER(FIND(\"RES\",REFERENTES!$Q$628:$Q$1125,1)),REFERENTES!Q1308,\"\")","v":""},{"$f":"REFERENTES!S687","v":0},682,0,1131,"X"]
[null,null,null,null,null,null,null,null,null,null,null,null,{"$f":"IF(ISNUMBER(FIND(\"RES\",REFERENTES!$Q$628:$Q$1125,1)),REFERENTES!Q1309,\"\")","v":""},{"$f":"REFERENTES!S688","v":0},683,0,1131,"X"]
[null,null,null,null,null,null,null,null,null,null,null,null,{"$f":"IF(ISNUMBER(FIND(\"RES\",REFERENTES!$Q$628:$Q$1125,1)),REFERENTES!Q1310,\"\")","v":""},{"$f":"REFERENTES!S689","v":0},684,0,1131,"X"]
[null,null,null,null,null,null,null,null,null,null,null,null,{"$f":"IF(ISNUMBER(FIND(\"RES\",REFERENTES!$Q$628:$Q$1125,1)),REFERENTES!Q1311,\"\")","v":""},{"$f":"REFERENTES!S690","v":0},685,0,1131,"X"]
[null,null,null,null,null,null,null,null,null,null,null,null,{"$f":"IF(ISNUMBER(FIND(\"RES\",REFERENTES!$Q$628:$Q$1125,1)),REFERENTES!Q1312,\"\")","v":""},{"$f":"REFERENTES!S691","v":0},686,0,1131,"X"]
[null,null,null,null,null,null,null,null,null,null,null,null,{"$f":"IF(ISNUMBER(FIND(\"RES\",REFERENTES!$Q$628:$Q$1125,1)),REFERENTES!Q1313,\"\")","v":""},{"$f":"REFERENTES!S692","v":0},687,0,1131,"X"]
[null,null,null,null,null,null,null,null,null,null,null,null,{"$f":"IF(ISNUMBER(FIND(\"RES\",REFERENTES!$Q$628:$Q$1125,1)),REFERENTES!Q1314,\"\")","v":""},{"$f":"REFERENTES!S693","v":0},688,0,1131,"X"]
[null,null,null,null,null,null,null,null,null,null,null,null,{"$f":"IF(ISNUMBER(FIND(\"RES\",REFERENTES!$Q$628:$Q$1125,1)),REFERENTES!Q1315,\"\")","v":""},{"$f":"REFERENTES!S694","v":0},689,0,1131,"X"]
[null,null,null,null,null,null,null,null,null,null,null,null,{"$f":"IF(ISNUMBER(FIND(\"RES\",REFERENTES!$Q$628:$Q$1125,1)),REFERENTES!Q1316,\"\")","v":""},{"$f":"REFERENTES!S695","v":0},690,0,1131,"X"]
[null,null,null,null,null,null,null,null,null,null,null,null,{"$f":"IF(ISNUMBER(FIND(\"RES\",REFERENTES!$Q$628:$Q$1125,1)),REFERENTES!Q1317,\"\")","v":""},{"$f":"REFERENTES!S696","v":0},691,0,1131,"X"]
[null,null,null,null,null,null,null,null,null,null,null,null,{"$f":"IF(ISNUMBER(FIND(\"RES\",REFERENTES!$Q$628:$Q$1125,1)),REFERENTES!Q1318,\"\")","v":""},{"$f":"REFERENTES!S697","v":0},692,0,1131,"X"]
[null,null,null,null,null,null,null,null,null,null,null,null,{"$f":"IF(ISNUMBER(FIND(\"RES\",REFERENTES!$Q$628:$Q$1125,1)),REFERENTES!Q1319,\"\")","v":""},{"$f":"REFERENTES!S698","v":0},693,0,1131,"X"]
[null,null,null,null,null,null,null,null,null,null,null,null,{"$f":"IF(ISNUMBER(FIND(\"RES\",REFERENTES!$Q$628:$Q$1125,1)),REFERENTES!Q1320,\"\")","v":""},{"$f":"REFERENTES!S699","v":0},694,0,1131,"X"]
[null,null,null,null,null,null,null,null,null,null,null,null,{"$f":"IF(ISNUMBER(FIND(\"RES\",REFERENTES!$Q$628:$Q$1125,1)),REFERENTES!Q1321,\"\")","v":""},{"$f":"REFERENTES!S700","v":0},695,0,1131,"X"]
[null,null,null,null,null,null,null,null,null,null,null,null,{"$f":"IF(ISNUMBER(FIND(\"RES\",REFERENTES!$Q$628:$Q$1125,1)),REFERENTES!Q1322,\"\")","v":""},{"$f":"REFERENTES!S701","v":0},696,0,1131,"X"]
[null,null,null,null,null,null,null,null,null,null,null,null,{"$f":"IF(ISNUMBER(FIND(\"RES\",REFERENTES!$Q$628:$Q$1125,1)),REFERENTES!Q1323,\"\")","v":""},{"$f":"REFERENTES!S702","v":0},697,0,1131,"X"]
[null,null,null,null,null,null,null,null,null,null,null,null,{"$f":"IF(ISNUMBER(FIND(\"RES\",REFERENTES!$Q$628:$Q$1125,1)),REFERENTES!Q1324,\"\")","v":""},{"$f":"REFERENTES!S703","v":0},698,0,1131,"X"]
[null,null,null,null,null,null,null,null,null,null,null,null,{"$f":"IF(ISNUMBER(FIND(\"RES\",REFERENTES!$Q$628:$Q$1125,1)),REFERENTES!Q1325,\"\")","v":""},{"$f":"REFERENTES!S704","v":0},699,0,1131,"X"]
[null,null,null,null,null,null,null,null,null,null,null,null,{"$f":"IF(ISNUMBER(FIND(\"RES\",REFERENTES!$Q$628:$Q$1125,1)),REFERENTES!Q1326,\"\")","v":""},{"$f":"REFERENTES!S705","v":0},700,0,1131,"X"]
[null,null,null,null,null,null,null,null,null,null,null,null,{"$f":"IF(ISNUMBER(FIND(\"RES\",REFERENTES!$Q$628:$Q$1125,1)),REFERENTES!Q1327,\"\")","v":""},{"$f":"REFERENTES!S706","v":0},701,0,1131,"X"]
[null,null,null,null,null,null,null,null,null,null,null,null,{"$f":"IF(ISNUMBER(FIND(\"RES\",REFERENTES!$Q$628:$Q$1125,1)),REFERENTES!Q1328,\"\")","v":""},{"$f":"REFERENTES!S707","v":0},702,0,1131,"X"]
[null,null,null,null,null,null,null,null,null,null,null,null,{"$f":"IF(ISNUMBER(FIND(\"RES\",REFERENTES!$Q$628:$Q$1125,1)),REFERENTES!Q1329,\"\")","v":""},{"$f":"REFERENTES!S708","v":0},703,0,1131,"X"]
[null,null,null,null,null,null,null,null,null,null,null,null,{"$f":"IF(ISNUMBER(FIND(\"RES\",REFERENTES!$Q$628:$Q$1125,1)),REFERENTES!Q1330,\"\")","v":""},{"$f":"REFERENTES!S709","v":0},704,0,1131,"X"]
[null,null,null,null,null,null,null,null,null,null,null,null,{"$f":"IF(ISNUMBER(FIND(\"RES\",REFERENTES!$Q$628:$Q$1125,1)),REFERENTES!Q1331,\"\")","v":""},{"$f":"REFERENTES!S710","v":0},705,0,1131,"X"]
[null,null,null,null,null,null,null,null,null,null,null,null,{"$f":"IF(ISNUMBER(FIND(\"RES\",REFERENTES!$Q$628:$Q$1125,1)),REFERENTES!Q1332,\"\")","v":""},{"$f":"REFERENTES!S711","v":0},706,0,{"$f":"IF(P711=0,MAX($O$6:$O$1135)+1,O711)","v":1131},{"$f":"IFERROR(VLOOKUP(SMALL($Q$6:$Q$1135,O711),$O$6:$P$1135,2,FALSE),\"X\")","v":"X"}]
[null,null,null,null,null,null,null,null,null,null,null,null,{"$f":"IF(ISNUMBER(FIND(\"RES\",REFERENTES!$Q$628:$Q$1125,1)),REFERENTES!Q1333,\"\")","v":""},{"$f":"REFERENTES!S712","v":0},707,0,1131,"X"]
[null,null,null,null,null,null,null,null,null,null,null,null,{"$f":"IF(ISNUMBER(FIND(\"RES\",REFERENTES!$Q$628:$Q$1125,1)),REFERENTES!Q1334,\"\")","v":""},{"$f":"REFERENTES!S713","v":0},708,{"$f":"IF(M713=\"\",0,M713)","v":0},1131,"X"]
[null,null,null,null,null,null,null,null,null,null,null,null,{"$f":"IF(ISNUMBER(FIND(\"RES\",REFERENTES!$Q$628:$Q$1125,1)),REFERENTES!Q1335,\"\")","v":""},{"$f":"REFERENTES!S714","v":0},709,0,1131,"X"]
[null,null,null,null,null,null,null,null,null,null,null,null,{"$f":"IF(ISNUMBER(FIND(\"RES\",REFERENTES!$Q$628:$Q$1125,1)),REFERENTES!Q1336,\"\")","v":""},{"$f":"REFERENTES!S715","v":0},710,0,1131,"X"]
[null,null,null,null,null,null,null,null,null,null,null,null,{"$f":"IF(ISNUMBER(FIND(\"RES\",REFERENTES!$Q$628:$Q$1125,1)),REFERENTES!Q1337,\"\")","v":""},{"$f":"REFERENTES!S716","v":0},711,0,1131,"X"]
[null,null,null,null,null,null,null,null,null,null,null,null,{"$f":"IF(ISNUMBER(FIND(\"RES\",REFERENTES!$Q$628:$Q$1125,1)),REFERENTES!Q1338,\"\")","v":""},{"$f":"REFERENTES!S717","v":0},712,0,1131,"X"]
[null,null,null,null,null,null,null,null,null,null,null,null,{"$f":"IF(ISNUMBER(FIND(\"RES\",REFERENTES!$Q$628:$Q$1125,1)),REFERENTES!Q1339,\"\")","v":""},{"$f":"REFERENTES!S718","v":0},713,0,1131,"X"]
[null,null,null,null,null,null,null,null,null,null,null,null,{"$f":"IF(ISNUMBER(FIND(\"RES\",REFERENTES!$Q$628:$Q$1125,1)),REFERENTES!Q1340,\"\")","v":""},{"$f":"REFERENTES!S719","v":0},714,0,1131,"X"]
[null,null,null,null,null,null,null,null,null,null,null,null,{"$f":"IF(ISNUMBER(FIND(\"RES\",REFERENTES!$Q$628:$Q$1125,1)),REFERENTES!Q1341,\"\")","v":""},{"$f":"REFERENTES!S720","v":0},715,0,1131,"X"]
[null,null,null,null,null,null,null,null,null,null,null,null,{"$f":"IF(ISNUMBER(FIND(\"RES\",REFERENTES!$Q$628:$Q$1125,1)),REFERENTES!Q1342,\"\")","v":""},{"$f":"REFERENTES!S721","v":0},716,0,1131,"X"]
[null,null,null,null,null,null,null,null,null,null,null,null,{"$f":"IF(ISNUMBER(FIND(\"RES\",REFERENTES!$Q$628:$Q$1125,1)),REFERENTES!Q1343,\"\")","v":""},{"$f":"REFERENTES!S722","v":0},717,0,1131,"X"]
[null,null,null,null,null,null,null,null,null,null,null,null,{"$f":"IF(ISNUMBER(FIND(\"RES\",REFERENTES!$Q$628:$Q$1125,1)),REFERENTES!Q1344,\"\")","v":""},{"$f":"REFERENTES!S723","v":0},718,0,1131,"X"]
[null,null,null,null,null,null,null,null,null,null,null,null,{"$f":"IF(ISNUMBER(FIND(\"RES\",REFERENTES!$Q$628:$Q$1125,1)),REFERENTES!Q1345,\"\")","v":""},{"$f":"REFERENTES!S724","v":0},719,0,1131,"X"]
[null,null,null,null,null,null,null,null,null,null,null,null,{"$f":"IF(ISNUMBER(FIND(\"RES\",REFERENTES!$Q$628:$Q$1125,1)),REFERENTES!Q1346,\"\")","v":""},{"$f":"REFERENTES!S725","v":0},720,0,1131,"X"]
[null,null,null,null,null,null,null,null,null,null,null,null,{"$f":"IF(ISNUMBER(FIND(\"RES\",REFERENTES!$Q$628:$Q$1125,1)),REFERENTES!Q1347,\"\")","v":""},{"$f":"REFERENTES!S726","v":0},721,0,1131,"X"]
[null,null,null,null,null,null,null,null,null,null,null,null,{"$f":"IF(ISNUMBER(FIND(\"RES\",REFERENTES!$Q$628:$Q$1125,1)),REFERENTES!Q1348,\"\")","v":""},{"$f":"REFERENTES!S727","v":0},722,0,1131,"X"]
[null,null,null,null,null,null,null,null,null,null,null,null,{"$f":"IF(ISNUMBER(FIND(\"RES\",REFERENTES!$Q$628:$Q$1125,1)),REFERENTES!Q1349,\"\")","v":""},{"$f":"REFERENTES!S728","v":0},723,0,1131,"X"]
[null,null,null,null,null,null,null,null,null,null,null,null,{"$f":"IF(ISNUMBER(FIND(\"RES\",REFERENTES!$Q$628:$Q$1125,1)),REFERENTES!Q1350,\"\")","v":""},{"$f":"REFERENTES!S729","v":0},724,0,1131,"X"]
[null,null,null,null,null,null,null,null,null,null,null,null,{"$f":"IF(ISNUMBER(FIND(\"RES\",REFERENTES!$Q$628:$Q$1125,1)),REFERENTES!Q1351,\"\")","v":""},{"$f":"REFERENTES!S730","v":0},725,0,1131,"X"]
[null,null,null,null,null,null,null,null,null,null,null,null,{"$f":"IF(ISNUMBER(FIND(\"RES\",REFERENTES!$Q$628:$Q$1125,1)),REFERENTES!Q1352,\"\")","v":""},{"$f":"REFERENTES!S731","v":0},726,0,1131,"X"]
[null,null,null,null,null,null,null,null,null,null,null,null,{"$f":"IF(ISNUMBER(FIND(\"RES\",REFERENTES!$Q$628:$Q$1125,1)),REFERENTES!Q1353,\"\")","v":""},{"$f":"REFERENTES!S732","v":0},727,0,1131,"X"]
[null,null,null,null,null,null,null,null,null,null,null,null,{"$f":"IF(ISNUMBER(FIND(\"RES\",REFERENTES!$Q$628:$Q$1125,1)),REFERENTES!Q1354,\"\")","v":""},{"$f":"REFERENTES!S733","v":0},728,0,1131,"X"]
[null,null,null,null,null,null,null,null,null,null,null,null,{"$f":"IF(ISNUMBER(FIND(\"RES\",REFERENTES!$Q$628:$Q$1125,1)),REFERENTES!Q1355,\"\")","v":""},{"$f":"REFERENTES!S734","v":0},729,0,1131,"X"]
[null,null,null,null,null,null,null,null,null,null,null,null,{"$f":"IF(ISNUMBER(FIND(\"RES\",REFERENTES!$Q$628:$Q$1125,1)),REFERENTES!Q1356,\"\")","v":""},{"$f":"REFERENTES!S735","v":0},730,0,1131,"X"]
[null,null,null,null,null,null,null,null,null,null,null,null,{"$f":"IF(ISNUMBER(FIND(\"RES\",REFERENTES!$Q$628:$Q$1125,1)),REFERENTES!Q1357,\"\")","v":""},{"$f":"REFERENTES!S736","v":0},731,0,1131,"X"]
[null,null,null,null,null,null,null,null,null,null,null,null,{"$f":"IF(ISNUMBER(FIND(\"RES\",REFERENTES!$Q$628:$Q$1125,1)),REFERENTES!Q1358,\"\")","v":""},{"$f":"REFERENTES!S737","v":0},732,0,1131,"X"]
[null,null,null,null,null,null,null,null,null,null,null,null,{"$f":"IF(ISNUMBER(FIND(\"RES\",REFERENTES!$Q$628:$Q$1125,1)),REFERENTES!Q1359,\"\")","v":""},{"$f":"REFERENTES!S738","v":0},733,0,1131,"X"]
[null,null,null,null,null,null,null,null,null,null,null,null,{"$f":"IF(ISNUMBER(FIND(\"RES\",REFERENTES!$Q$628:$Q$1125,1)),REFERENTES!Q1360,\"\")","v":""},{"$f":"REFERENTES!S739","v":0},734,0,1131,"X"]
[null,null,null,null,null,null,null,null,null,null,null,null,{"$f":"IF(ISNUMBER(FIND(\"RES\",REFERENTES!$Q$628:$Q$1125,1)),REFERENTES!Q1361,\"\")","v":""},{"$f":"REFERENTES!S740","v":0},735,0,1131,"X"]
[null,null,null,null,null,null,null,null,null,null,null,null,{"$f":"IF(ISNUMBER(FIND(\"RES\",REFERENTES!$Q$628:$Q$1125,1)),REFERENTES!Q1362,\"\")","v":""},{"$f":"REFERENTES!S741","v":0},736,0,1131,"X"]
[null,null,null,null,null,null,null,null,null,null,null,null,{"$f":"IF(ISNUMBER(FIND(\"RES\",REFERENTES!$Q$628:$Q$1125,1)),REFERENTES!Q1363,\"\")","v":""},{"$f":"REFERENTES!S742","v":0},737,0,1131,"X"]
[null,null,null,null,null,null,null,null,null,null,null,null,{"$f":"IF(ISNUMBER(FIND(\"RES\",REFERENTES!$Q$628:$Q$1125,1)),REFERENTES!Q1364,\"\")","v":""},{"$f":"REFERENTES!S743","v":0},738,0,1131,"X"]
[null,null,null,null,null,null,null,null,null,null,null,null,{"$f":"IF(ISNUMBER(FIND(\"RES\",REFERENTES!$Q$628:$Q$1125,1)),REFERENTES!Q1365,\"\")","v":""},{"$f":"REFERENTES!S744","v":0},739,0,1131,"X"]
[null,null,null,null,null,null,null,null,null,null,null,null,{"$f":"IF(ISNUMBER(FIND(\"RES\",REFERENTES!$Q$628:$Q$1125,1)),REFERENTES!Q1366,\"\")","v":""},{"$f":"REFERENTES!S745","v":0},740,0,1131,"X"]
[null,null,null,null,null,null,null,null,null,null,null,null,{"$f":"IF(ISNUMBER(FIND(\"RES\",REFERENTES!$Q$628:$Q$1125,1)),REFERENTES!Q1367,\"\")","v":""},{"$f":"REFERENTES!S746","v":0},741,0,1131,"X"]
[null,null,null,null,null,null,null,null,null,null,null,null,{"$f":"IF(ISNUMBER(FIND(\"RES\",REFERENTES!$Q$628:$Q$1125,1)),REFERENTES!Q1368,\"\")","v":""},{"$f":"REFERENTES!S747","v":0},742,0,1131,"X"]
[null,null,null,null,null,null,null,null,null,null,null,null,{"$f":"IF(ISNUMBER(FIND(\"RES\",REFERENTES!$Q$628:$Q$1125,1)),REFERENTES!Q1369,\"\")","v":""},{"$f":"REFERENTES!S748","v":0},743,0,1131,"X"]
[null,null,null,null,null,null,null,null,null,null,null,null,{"$f":"IF(ISNUMBER(FIND(\"RES\",REFERENTES!$Q$628:$Q$1125,1)),REFERENTES!Q1370,\"\")","v":""},{"$f":"REFERENTES!S749","v":0},744,0,1131,"X"]
[null,null,null,null,null,null,null,null,null,null,null,null,{"$f":"IF(ISNUMBER(FIND(\"RES\",REFERENTES!$Q$628:$Q$1125,1)),REFERENTES!Q1371,\"\")","v":""},{"$f":"REFERENTES!S750","v":0},745,0,1131,"X"]
[null,null,null,null,null,null,null,null,null,null,null,null,{"$f":"IF(ISNUMBER(FIND(\"RES\",REFERENTES!$Q$628:$Q$1125,1)),REFERENTES!Q1372,\"\")","v":""},{"$f":"REFERENTES!S751","v":0},746,0,1131,"X"]
[null,null,null,null,null,null,null,null,null,null,null,null,{"$f":"IF(ISNUMBER(FIND(\"RES\",REFERENTES!$Q$628:$Q$1125,1)),REFERENTES!Q1373,\"\")","v":""},{"$f":"REFERENTES!S752","v":0},747,0,1131,"X"]
[null,null,null,null,null,null,null,null,null,null,null,null,{"$f":"IF(ISNUMBER(FIND(\"RES\",REFERENTES!$Q$628:$Q$1125,1)),REFERENTES!Q1374,\"\")","v":""},{"$f":"REFERENTES!S753","v":0},748,0,1131,"X"]
[null,null,null,null,null,null,null,null,null,null,null,null,{"$f":"IF(ISNUMBER(FIND(\"RES\",REFERENTES!$Q$628:$Q$1125,1)),REFERENTES!Q1375,\"\")","v":""},{"$f":"REFERENTES!S754","v":0},749,0,1131,"X"]
[null,null,null,null,null,null,null,null,null,null,null,null,{"$f":"IF(ISNUMBER(FIND(\"RES\",REFERENTES!$Q$628:$Q$1125,1)),REFERENTES!Q1376,\"\")","v":""},{"$f":"REFERENTES!S755","v":0},750,0,1131,"X"]
[null,null,null,null,null,null,null,null,null,null,null,null,{"$f":"IF(ISNUMBER(FIND(\"RES\",REFERENTES!$Q$628:$Q$1125,1)),REFERENTES!Q1377,\"\")","v":""},{"$f":"REFERENTES!S756","v":0},751,0,1131,"X"]
[null,null,null,null,null,null,null,null,null,null,null,null,{"$f":"IF(ISNUMBER(FIND(\"RES\",REFERENTES!$Q$628:$Q$1125,1)),REFERENTES!Q1378,\"\")","v":""},{"$f":"REFERENTES!S757","v":0},752,0,1131,"X"]
[null,null,null,null,null,null,null,null,null,null,null,null,{"$f":"IF(ISNUMBER(FIND(\"RES\",REFERENTES!$Q$628:$Q$1125,1)),REFERENTES!Q1379,\"\")","v":""},{"$f":"REFERENTES!S758","v":0},753,0,1131,"X"]
[null,null,null,null,null,null,null,null,null,null,null,null,{"$f":"IF(ISNUMBER(FIND(\"RES\",REFERENTES!$Q$628:$Q$1125,1)),REFERENTES!Q1380,\"\")","v":""},{"$f":"REFERENTES!S759","v":0},754,0,1131,"X"]
[null,null,null,null,null,null,null,null,null,null,null,null,{"$f":"IF(ISNUMBER(FIND(\"RES\",REFERENTES!$Q$628:$Q$1125,1)),REFERENTES!Q1381,\"\")","v":""},{"$f":"REFERENTES!S760","v":0},755,0,1131,"X"]
[null,null,null,null,null,null,null,null,null,null,null,null,{"$f":"IF(ISNUMBER(FIND(\"RES\",REFERENTES!$Q$628:$Q$1125,1)),REFERENTES!Q1382,\"\")","v":""},{"$f":"REFERENTES!S761","v":0},756,0,1131,"X"]
[null,null,null,null,null,null,null,null,null,null,null,null,{"$f":"IF(ISNUMBER(FIND(\"RES\",REFERENTES!$Q$628:$Q$1125,1)),REFERENTES!Q1383,\"\")","v":""},{"$f":"REFERENTES!S762","v":0},757,0,1131,"X"]
[null,null,null,null,null,null,null,null,null,null,null,null,{"$f":"IF(ISNUMBER(FIND(\"RES\",REFERENTES!$Q$628:$Q$1125,1)),REFERENTES!Q1384,\"\")","v":""},{"$f":"REFERENTES!S763","v":0},758,0,1131,"X"]
[null,null,null,null,null,null,null,null,null,null,null,null,{"$f":"IF(ISNUMBER(FIND(\"RES\",REFERENTES!$Q$628:$Q$1125,1)),REFERENTES!Q1385,\"\")","v":""},{"$f":"REFERENTES!S764","v":0},759,0,1131,"X"]
[null,null,null,null,null,null,null,null,null,null,null,null,{"$f":"IF(ISNUMBER(FIND(\"RES\",REFERENTES!$Q$628:$Q$1125,1)),REFERENTES!Q1386,\"\")","v":""},{"$f":"REFERENTES!S765","v":0},760,0,1131,"X"]
[null,null,null,null,null,null,null,null,null,null,null,null,{"$f":"IF(ISNUMBER(FIND(\"RES\",REFERENTES!$Q$628:$Q$1125,1)),REFERENTES!Q1387,\"\")","v":""},{"$f":"REFERENTES!S766","v":0},761,0,1131,"X"]
[null,null,null,null,null,null,null,null,null,null,null,null,{"$f":"IF(ISNUMBER(FIND(\"RES\",REFERENTES!$Q$628:$Q$1125,1)),REFERENTES!Q1388,\"\")","v":""},{"$f":"REFERENTES!S767","v":0},762,0,1131,"X"]
[null,null,null,null,null,null,null,null,null,null,null,null,{"$f":"IF(ISNUMBER(FIND(\"RES\",REFERENTES!$Q$628:$Q$1125,1)),REFERENTES!Q1389,\"\")","v":""},{"$f":"REFERENTES!S768","v":0},763,0,1131,"X"]
[null,null,null,null,null,null,null,null,null,null,null,null,{"$f":"IF(ISNUMBER(FIND(\"RES\",REFERENTES!$Q$628:$Q$1125,1)),REFERENTES!Q1390,\"\")","v":""},{"$f":"REFERENTES!S769","v":0},764,0,1131,"X"]
[null,null,null,null,null,null,null,null,null,null,null,null,{"$f":"IF(ISNUMBER(FIND(\"RES\",REFERENTES!$Q$628:$Q$1125,1)),REFERENTES!Q1391,\"\")","v":""},{"$f":"REFERENTES!S770","v":0},765,0,1131,"X"]
[null,null,null,null,null,null,null,null,null,null,null,null,{"$f":"IF(ISNUMBER(FIND(\"RES\",REFERENTES!$Q$628:$Q$1125,1)),REFERENTES!Q1392,\"\")","v":""},{"$f":"REFERENTES!S771","v":0},766,0,1131,"X"]
[null,null,null,null,null,null,null,null,null,null,null,null,{"$f":"IF(ISNUMBER(FIND(\"RES\",REFERENTES!$Q$628:$Q$1125,1)),REFERENTES!Q1393,\"\")","v":""},{"$f":"REFERENTES!S772","v":0},767,0,1131,"X"]
[null,null,null,null,null,null,null,null,null,null,null,null,{"$f":"IF(ISNUMBER(FIND(\"RES\",REFERENTES!$Q$628:$Q$1125,1)),REFERENTES!Q1394,\"\")","v":""},{"$f":"REFERENTES!S773","v":0},768,0,1131,"X"]
[null,null,null,null,null,null,null,null,null,null,null,null,{"$f":"IF(ISNUMBER(FIND(\"RES\",REFERENTES!$Q$628:$Q$1125,1)),REFERENTES!Q1395,\"\")","v":""},{"$f":"REFERENTES!S774","v":0},769,0,1131,"X"]
[null,null,null,null,null,null,null,null,null,null,null,null,{"$f":"IF(ISNUMBER(FIND(\"RES\",REFERENTES!$Q$628:$Q$1125,1)),REFERENTES!Q1396,\"\")","v":""},{"$f":"REFERENTES!S775","v":0},770,0,{"$f":"IF(P775=0,MAX($O$6:$O$1135)+1,O775)","v":1131},{"$f":"IFERROR(VLOOKUP(SMALL($Q$6:$Q$1135,O775),$O$6:$P$1135,2,FALSE),\"X\")","v":"X"}]
[null,null,null,null,null,null,null,null,null,null,null,null,{"$f":"IF(ISNUMBER(FIND(\"RES\",REFERENTES!$Q$628:$Q$1125,1)),REFERENTES!Q1397,\"\")","v":""},{"$f":"REFERENTES!S776","v":0},771,0,1131,"X"]
[null,null,null,null,null,null,null,null,null,null,null,null,{"$f":"IF(ISNUMBER(FIND(\"RES\",REFERENTES!$Q$628:$Q$1125,1)),REFERENTES!Q1398,\"\")","v":""},{"$f":"REFERENTES!S777","v":0},772,{"$f":"IF(M777=\"\",0,M777)","v":0},1131,"X"]
[null,null,null,null,null,null,null,null,null,null,null,null,{"$f":"IF(ISNUMBER(FIND(\"RES\",REFERENTES!$Q$628:$Q$1125,1)),REFERENTES!Q1399,\"\")","v":""},{"$f":"REFERENTES!S778","v":0},773,0,1131,"X"]
[null,null,null,null,null,null,null,null,null,null,null,null,{"$f":"IF(ISNUMBER(FIND(\"RES\",REFERENTES!$Q$628:$Q$1125,1)),REFERENTES!Q1400,\"\")","v":""},{"$f":"REFERENTES!S779","v":0},774,0,1131,"X"]
[null,null,null,null,null,null,null,null,null,null,null,null,{"$f":"IF(ISNUMBER(FIND(\"RES\",REFERENTES!$Q$628:$Q$1125,1)),REFERENTES!Q1401,\"\")","v":""},{"$f":"REFERENTES!S780","v":0},775,0,1131,"X"]
[null,null,null,null,null,null,null,null,null,null,null,null,{"$f":"IF(ISNUMBER(FIND(\"RES\",REFERENTES!$Q$628:$Q$1125,1)),REFERENTES!Q1402,\"\")","v":""},{"$f":"REFERENTES!S781","v":0},776,0,1131,"X"]
[null,null,null,null,null,null,null,null,null,null,null,null,{"$f":"IF(ISNUMBER(FIND(\"RES\",REFERENTES!$Q$628:$Q$1125,1)),REFERENTES!Q1403,\"\")","v":""},{"$f":"REFERENTES!S782","v":0},777,0,1131,"X"]
[null,null,null,null,null,null,null,null,null,null,null,null,{"$f":"IF(ISNUMBER(FIND(\"RES\",REFERENTES!$Q$628:$Q$1125,1)),REFERENTES!Q1404,\"\")","v":""},{"$f":"REFERENTES!S783","v":0},778,0,1131,"X"]
[null,null,null,null,null,null,null,null,null,null,null,null,{"$f":"IF(ISNUMBER(FIND(\"RES\",REFERENTES!$Q$628:$Q$1125,1)),REFERENTES!Q1405,\"\")","v":""},{"$f":"REFERENTES!S784","v":0},779,0,1131,"X"]
[null,null,null,null,null,null,null,null,null,null,null,null,{"$f":"IF(ISNUMBER(FIND(\"RES\",REFERENTES!$Q$628:$Q$1125,1)),REFERENTES!Q1406,\"\")","v":""},{"$f":"REFERENTES!S785","v":0},780,0,1131,"X"]
[null,null,null,null,null,null,null,null,null,null,null,null,{"$f":"IF(ISNUMBER(FIND(\"RES\",REFERENTES!$Q$628:$Q$1125,1)),REFERENTES!Q1407,\"\")","v":""},{"$f":"REFERENTES!S786","v":0},781,0,1131,"X"]
[null,null,null,null,null,null,null,null,null,null,null,null,{"$f":"IF(ISNUMBER(FIND(\"RES\",REFERENTES!$Q$628:$Q$1125,1)),REFERENTES!Q1408,\"\")","v":""},{"$f":"REFERENTES!S787","v":0},782,0,1131,"X"]
[null,null,null,null,null,null,null,null,null,null,null,null,{"$f":"IF(ISNUMBER(FIND(\"RES\",REFERENTES!$Q$628:$Q$1125,1)),REFERENTES!Q1409,\"\")","v":""},{"$f":"REFERENTES!S788","v":0},783,0,1131,"X"]
[null,null,null,null,null,null,null,null,null,null,null,null,{"$f":"IF(ISNUMBER(FIND(\"RES\",REFERENTES!$Q$628:$Q$1125,1)),REFERENTES!Q1410,\"\")","v":""},{"$f":"REFERENTES!S789","v":0},784,0,1131,"X"]
[null,null,null,null,null,null,null,null,null,null,null,null,{"$f":"IF(ISNUMBER(FIND(\"RES\",REFERENTES!$Q$628:$Q$1125,1)),REFERENTES!Q1411,\"\")","v":""},{"$f":"REFERENTES!S790","v":0},785,0,1131,"X"]
[null,null,null,null,null,null,null,null,null,null,null,null,{"$f":"IF(ISNUMBER(FIND(\"RES\",REFERENTES!$Q$628:$Q$1125,1)),REFERENTES!Q1412,\"\")","v":""},{"$f":"REFERENTES!S791","v":0},786,0,1131,"X"]
[null,null,null,null,null,null,null,null,null,null,null,null,{"$f":"IF(ISNUMBER(FIND(\"RES\",REFERENTES!$Q$628:$Q$1125,1)),REFERENTES!Q1413,\"\")","v":""},{"$f":"REFERENTES!S792","v":0},787,0,1131,"X"]
[null,null,null,null,null,null,null,null,null,null,null,null,{"$f":"IF(ISNUMBER(FIND(\"RES\",REFERENTES!$Q$628:$Q$1125,1)),REFERENTES!Q1414,\"\")","v":""},{"$f":"REFERENTES!S793","v":0},788,0,1131,"X"]
[null,null,null,null,null,null,null,null,null,null,null,null,{"$f":"IF(ISNUMBER(FIND(\"RES\",REFERENTES!$Q$628:$Q$1125,1)),REFERENTES!Q1415,\"\")","v":""},{"$f":"REFERENTES!S794","v":0},789,0,1131,"X"]
[null,null,null,null,null,null,null,null,null,null,null,null,{"$f":"IF(ISNUMBER(FIND(\"RES\",REFERENTES!$Q$628:$Q$1125,1)),REFERENTES!Q1416,\"\")","v":""},{"$f":"REFERENTES!S795","v":0},790,0,1131,"X"]
[null,null,null,null,null,null,null,null,null,null,null,null,{"$f":"IF(ISNUMBER(FIND(\"RES\",REFERENTES!$Q$628:$Q$1125,1)),REFERENTES!Q1417,\"\")","v":""},{"$f":"REFERENTES!S796","v":0},791,0,1131,"X"]
[null,null,null,null,null,null,null,null,null,null,null,null,{"$f":"IF(ISNUMBER(FIND(\"RES\",REFERENTES!$Q$628:$Q$1125,1)),REFERENTES!Q1418,\"\")","v":""},{"$f":"REFERENTES!S797","v":0},792,0,1131,"X"]
[null,null,null,null,null,null,null,null,null,null,null,null,{"$f":"IF(ISNUMBER(FIND(\"RES\",REFERENTES!$Q$628:$Q$1125,1)),REFERENTES!Q1419,\"\")","v":""},{"$f":"REFERENTES!S798","v":0},793,0,1131,"X"]
[null,null,null,null,null,null,null,null,null,null,null,null,{"$f":"IF(ISNUMBER(FIND(\"RES\",REFERENTES!$Q$628:$Q$1125,1)),REFERENTES!Q1420,\"\")","v":""},{"$f":"REFERENTES!S799","v":0},794,0,1131,"X"]
[null,null,null,null,null,null,null,null,null,null,null,null,{"$f":"IF(ISNUMBER(FIND(\"RES\",REFERENTES!$Q$628:$Q$1125,1)),REFERENTES!Q1421,\"\")","v":""},{"$f":"REFERENTES!S800","v":0},795,0,1131,"X"]
[null,null,null,null,null,null,null,null,null,null,null,null,{"$f":"IF(ISNUMBER(FIND(\"RES\",REFERENTES!$T$2:$T$1134)),REFERENTES!W801,\"\")","v":""},{"$f":"REFERENTES!S801","v":0},796,0,1131,"X"]
[null,null,null,null,null,null,null,null,null,null,null,null,{"$f":"IF(ISNUMBER(FIND(\"RES\",REFERENTES!$T$2:$T$1134)),REFERENTES!W802,\"\")","v":""},{"$f":"REFERENTES!S802","v":0},797,0,1131,"X"]
[null,null,null,null,null,null,null,null,null,null,null,null,{"$f":"IF(ISNUMBER(FIND(\"RES\",REFERENTES!$T$2:$T$1134)),REFERENTES!W803,\"\")","v":""},{"$f":"REFERENTES!S803","v":0},798,0,1131,"X"]
[null,null,null,null,null,null,null,null,null,null,null,null,{"$f":"IF(ISNUMBER(FIND(\"RES\",REFERENTES!$T$2:$T$1134)),REFERENTES!W804,\"\")","v":""},{"$f":"REFERENTES!S804","v":0},799,0,1131,"X"]
[null,null,null,null,null,null,null,null,null,null,null,null,{"$f":"IF(ISNUMBER(FIND(\"RES\",REFERENTES!$T$2:$T$1134)),REFERENTES!W805,\"\")","v":""},{"$f":"REFERENTES!S805","v":0},800,0,1131,"X"]
[null,null,null,null,null,null,null,null,null,null,null,null,{"$f":"IF(ISNUMBER(FIND(\"RES\",REFERENTES!$T$2:$T$1134)),REFERENTES!W806,\"\")","v":""},{"$f":"REFERENTES!S806","v":0},801,0,1131,"X"]
[null,null,null,null,null,null,null,null,null,null,null,null,{"$f":"IF(ISNUMBER(FIND(\"RES\",REFERENTES!$T$2:$T$1134)),REFERENTES!W807,\"\")","v":""},{"$f":"REFERENTES!S807","v":0},802,0,1131,"X"]
[null,null,null,null,null,null,null,null,null,null,null,null,{"$f":"IF(ISNUMBER(FIND(\"RES\",REFERENTES!$T$2:$T$1134)),REFERENTES!W808,\"\")","v":""},{"$f":"REFERENTES!S808","v":0},803,0,1131,"X"]
[null,null,null,null,null,null,null,null,null,null,null,null,{"$f":"IF(ISNUMBER(FIND(\"RES\",REFERENTES!$T$2:$T$1134)),REFERENTES!W809,\"\")","v":""},{"$f":"REFERENTES!S809","v":0},804,0,1131,"X"]
[null,null,null,null,null,null,null,null,null,null,null,null,{"$f":"IF(ISNUMBER(FIND(\"RES\",REFERENTES!$T$2:$T$1134)),REFERENTES!W810,\"\")","v":""},{"$f":"REFERENTES!S810","v":0},805,0,1131,"X"]
[null,null,null,null,null,null,null,null,null,null,null,null,{"$f":"IF(ISNUMBER(FIND(\"RES\",REFERENTES!$T$2:$T$1134)),REFERENTES!W811,\"\")","v":""},{"$f":"REFERENTES!S811","v":0},806,0,1131,"X"]
[null,null,null,null,null,null,null,null,null,null,null,null,{"$f":"IF(ISNUMBER(FIND(\"RES\",REFERENTES!$T$2:$T$1134)),REFERENTES!W812,\"\")","v":""},{"$f":"REFERENTES!S812","v":0},807,0,1131,"X"]
[null,null,null,null,null,null,null,null,null,null,null,null,{"$f":"IF(ISNUMBER(FIND(\"RES\",REFERENTES!$T$2:$T$1134)),REFERENTES!W813,\"\")","v":""},{"$f":"REFERENTES!S813","v":0},808,0,1131,"X"]
[null,null,null,null,null,null,null,null,null,null,null,null,{"$f":"IF(ISNUMBER(FIND(\"RES\",REFERENTES!$T$2:$T$1134)),REFERENTES!W814,\"\")","v":""},{"$f":"REFERENTES!S814","v":0},809,0,1131,"X"]
[null,null,null,null,null,null,null,null,null,null,null,null,{"$f":"IF(ISNUMBER(FIND(\"RES\",REFERENTES!$T$2:$T$1134)),REFERENTES!W815,\"\")","v":""},{"$f":"REFERENTES!S815","v":0},810,0,1131,"X"]
[null,null,null,null,null,null,null,null,null,null,null,null,{"$f":"IF(ISNUMBER(FIND(\"RES\",REFERENTES!$T$2:$T$1134)),REFERENTES!W816,\"\")","v":""},{"$f":"REFERENTES!S816","v":0},811,0,1131,"X"]
[null,null,null,null,null,null,null,null,null,null,null,null,{"$f":"IF(ISNUMBER(FIND(\"RES\",REFERENTES!$T$2:$T$1134)),REFERENTES!W817,\"\")","v":""},{"$f":"REFERENTES!S817","v":0},812,0,1131,"X"]
[null,null,null,null,null,null,null,null,null,null,null,null,{"$f":"IF(ISNUMBER(FIND(\"RES\",REFERENTES!$T$2:$T$1134)),REFERENTES!W818,\"\")","v":""},{"$f":"REFERENTES!S818","v":0},813,0,1131,"X"]
[null,null,null,null,null,null,null,null,null,null,null,null,{"$f":"IF(ISNUMBER(FIND(\"RES\",REFERENTES!$T$2:$T$1134)),REFERENTES!W819,\"\")","v":""},{"$f":"REFERENTES!S819","v":0},814,0,1131,"X"]
[null,null,null,null,null,null,null,null,null,null,null,null,{"$f":"IF(ISNUMBER(FIND(\"RES\",REFERENTES!$T$2:$T$1134)),REFERENTES!W820,\"\")","v":""},{"$f":"REFERENTES!S820","v":0},815,0,1131,"X"]
[null,null,null,null,null,null,null,null,null,null,null,null,{"$f":"IF(ISNUMBER(FIND(\"RES\",REFERENTES!$T$2:$T$1134)),REFERENTES!W821,\"\")","v":""},{"$f":"REFERENTES!S821","v":0},816,0,1131,"X"]
[null,null,null,null,null,null,null,null,null,null,null,null,{"$f":"IF(ISNUMBER(FIND(\"RES\",REFERENTES!$T$2:$T$1134)),REFERENTES!W822,\"\")","v":""},{"$f":"REFERENTES!S822","v":0},817,0,1131,"X"]
[null,null,null,null,null,null,null,null,null,null,null,null,{"$f":"IF(ISNUMBER(FIND(\"RES\",REFERENTES!$T$2:$T$1134)),REFERENTES!W823,\"\")","v":""},{"$f":"REFERENTES!S823","v":0},818,0,1131,"X"]
[null,null,null,null,null,null,null,null,null,null,null,null,{"$f":"IF(ISNUMBER(FIND(\"RES\",REFERENTES!$T$2:$T$1134)),REFERENTES!W824,\"\")","v":""},{"$f":"REFERENTES!S824","v":0},819,0,1131,"X"]
[null,null,null,null,null,null,null,null,null,null,null,null,{"$f":"IF(ISNUMBER(FIND(\"RES\",REFERENTES!$T$2:$T$1134)),REFERENTES!W825,\"\")","v":""},{"$f":"REFERENTES!S825","v":0},820,0,1131,"X"]
[null,null,null,null,null,null,null,null,null,null,null,null,{"$f":"IF(ISNUMBER(FIND(\"RES\",REFERENTES!$T$2:$T$1134)),REFERENTES!W826,\"\")","v":""},{"$f":"REFERENTES!S826","v":0},821,0,1131,"X"]
[null,null,null,null,null,null,null,null,null,null,null,null,{"$f":"IF(ISNUMBER(FIND(\"RES\",REFERENTES!$T$2:$T$1134)),REFERENTES!W827,\"\")","v":""},{"$f":"REFERENTES!S827","v":0},822,0,1131,"X"]
[null,null,null,null,null,null,null,null,null,null,null,null,{"$f":"IF(ISNUMBER(FIND(\"RES\",REFERENTES!$T$2:$T$1134)),REFERENTES!W828,\"\")","v":""},{"$f":"REFERENTES!S828","v":0},823,0,1131,"X"]
[null,null,null,null,null,null,null,null,null,null,null,null,{"$f":"IF(ISNUMBER(FIND(\"RES\",REFERENTES!$T$2:$T$1134)),REFERENTES!W829,\"\")","v":""},{"$f":"REFERENTES!S829","v":0},824,0,1131,"X"]
[null,null,null,null,null,null,null,null,null,null,null,null,{"$f":"IF(ISNUMBER(FIND(\"RES\",REFERENTES!$T$2:$T$1134)),REFERENTES!W830,\"\")","v":""},{"$f":"REFERENTES!S830","v":0},825,0,1131,"X"]
[null,null,null,null,null,null,null,null,null,null,null,null,{"$f":"IF(ISNUMBER(FIND(\"RES\",REFERENTES!$T$2:$T$1134)),REFERENTES!W831,\"\")","v":""},{"$f":"REFERENTES!S831","v":0},826,0,1131,"X"]
[null,null,null,null,null,null,null,null,null,null,null,null,{"$f":"IF(ISNUMBER(FIND(\"RES\",REFERENTES!$T$2:$T$1134)),REFERENTES!W832,\"\")","v":""},{"$f":"REFERENTES!S832","v":0},827,0,1131,"X"]
[null,null,null,null,null,null,null,null,null,null,null,null,{"$f":"IF(ISNUMBER(FIND(\"RES\",REFERENTES!$T$2:$T$1134)),REFERENTES!W833,\"\")","v":""},{"$f":"REFERENTES!S833","v":0},828,0,1131,"X"]
[null,null,null,null,null,null,null,null,null,null,null,null,{"$f":"IF(ISNUMBER(FIND(\"RES\",REFERENTES!$T$2:$T$1134)),REFERENTES!W834,\"\")","v":""},{"$f":"REFERENTES!S834","v":0},829,0,1131,"X"]
[null,null,null,null,null,null,null,null,null,null,null,null,{"$f":"IF(ISNUMBER(FIND(\"RES\",REFERENTES!$T$2:$T$1134)),REFERENTES!W835,\"\")","v":""},{"$f":"REFERENTES!S835","v":0},830,0,1131,"X"]
[null,null,null,null,null,null,null,null,null,null,null,null,{"$f":"IF(ISNUMBER(FIND(\"RES\",REFERENTES!$T$2:$T$1134)),REFERENTES!W836,\"\")","v":""},{"$f":"REFERENTES!S836","v":0},831,0,1131,"X"]
[null,null,null,null,null,null,null,null,null,null,null,null,{"$f":"IF(ISNUMBER(FIND(\"RES\",REFERENTES!$T$2:$T$1134)),REFERENTES!W837,\"\")","v":""},{"$f":"REFERENTES!S837","v":0},832,0,1131,"X"]
[null,null,null,null,null,null,null,null,null,null,null,null,{"$f":"IF(ISNUMBER(FIND(\"RES\",REFERENTES!$T$2:$T$1134)),REFERENTES!W838,\"\")","v":""},{"$f":"REFERENTES!S838","v":0},833,0,1131,"X"]
[null,null,null,null,null,null,null,null,null,null,null,null,{"$f":"IF(ISNUMBER(FIND(\"RES\",REFERENTES!$T$2:$T$1134)),REFERENTES!W839,\"\")","v":""},{"$f":"REFERENTES!S839","v":0},834,0,{"$f":"IF(P839=0,MAX($O$6:$O$1135)+1,O839)","v":1131},{"$f":"IFERROR(VLOOKUP(SMALL($Q$6:$Q$1135,O839),$O$6:$P$1135,2,FALSE),\"X\")","v":"X"}]
[null,null,null,null,null,null,null,null,null,null,null,null,{"$f":"IF(ISNUMBER(FIND(\"RES\",REFERENTES!$T$2:$T$1134)),REFERENTES!W840,\"\")","v":""},{"$f":"REFERENTES!S840","v":0},835,0,1131,"X"]
[null,null,null,null,null,null,null,null,null,null,null,null,{"$f":"IF(ISNUMBER(FIND(\"RES\",REFERENTES!$T$2:$T$1134)),REFERENTES!W841,\"\")","v":""},{"$f":"REFERENTES!S841","v":0},836,{"$f":"IF(M841=\"\",0,M841)","v":0},1131,"X"]
[null,null,null,null,null,null,null,null,null,null,null,null,{"$f":"IF(ISNUMBER(FIND(\"RES\",REFERENTES!$T$2:$T$1134)),REFERENTES!W842,\"\")","v":""},{"$f":"REFERENTES!S842","v":0},837,0,1131,"X"]
[null,null,null,null,null,null,null,null,null,null,null,null,{"$f":"IF(ISNUMBER(FIND(\"RES\",REFERENTES!$T$2:$T$1134)),REFERENTES!W843,\"\")","v":""},{"$f":"REFERENTES!S843","v":0},838,0,1131,"X"]
[null,null,null,null,null,null,null,null,null,null,null,null,{"$f":"IF(ISNUMBER(FIND(\"RES\",REFERENTES!$T$2:$T$1134)),REFERENTES!W844,\"\")","v":""},{"$f":"REFERENTES!S844","v":0},839,0,1131,"X"]
[null,null,null,null,null,null,null,null,null,null,null,null,{"$f":"IF(ISNUMBER(FIND(\"RES\",REFERENTES!$T$2:$T$1134)),REFERENTES!W845,\"\")","v":""},{"$f":"REFERENTES!S845","v":0},840,0,1131,"X"]
[null,null,null,null,null,null,null,null,null,null,null,null,{"$f":"IF(ISNUMBER(FIND(\"RES\",REFERENTES!$T$2:$T$1134)),REFERENTES!W846,\"\")","v":""},{"$f":"REFERENTES!S846","v":0},841,0,1131,"X"]
[null,null,null,null,null,null,null,null,null,null,null,null,{"$f":"IF(ISNUMBER(FIND(\"RES\",REFERENTES!$T$2:$T$1134)),REFERENTES!W847,\"\")","v":""},{"$f":"REFERENTES!S847","v":0},842,0,1131,"X"]
[null,null,null,null,null,null,null,null,null,null,null,null,{"$f":"IF(ISNUMBER(FIND(\"RES\",REFERENTES!$T$2:$T$1134)),REFERENTES!W848,\"\")","v":""},{"$f":"REFERENTES!S848","v":0},843,0,1131,"X"]
[null,null,null,null,null,null,null,null,null,null,null,null,{"$f":"IF(ISNUMBER(FIND(\"RES\",REFERENTES!$T$2:$T$1134)),REFERENTES!W849,\"\")","v":""},{"$f":"REFERENTES!S849","v":0},844,0,1131,"X"]
[null,null,null,null,null,null,null,null,null,null,null,null,{"$f":"IF(ISNUMBER(FIND(\"RES\",REFERENTES!$T$2:$T$1134)),REFERENTES!W850,\"\")","v":""},{"$f":"REFERENTES!S850","v":0},845,0,1131,"X"]
[null,null,null,null,null,null,null,null,null,null,null,null,{"$f":"IF(ISNUMBER(FIND(\"RES\",REFERENTES!$T$2:$T$1134)),REFERENTES!W851,\"\")","v":""},{"$f":"REFERENTES!S851","v":0},846,0,1131,"X"]
[null,null,null,null,null,null,null,null,null,null,null,null,{"$f":"IF(ISNUMBER(FIND(\"RES\",REFERENTES!$T$2:$T$1134)),REFERENTES!W852,\"\")","v":""},{"$f":"REFERENTES!S852","v":0},847,0,1131,"X"]
[null,null,null,null,null,null,null,null,null,null,null,null,{"$f":"IF(ISNUMBER(FIND(\"RES\",REFERENTES!$T$2:$T$1134)),REFERENTES!W853,\"\")","v":""},{"$f":"REFERENTES!S853","v":0},848,0,1131,"X"]
[null,null,null,null,null,null,null,null,null,null,null,null,{"$f":"IF(ISNUMBER(FIND(\"RES\",REFERENTES!$T$2:$T$1134)),REFERENTES!W854,\"\")","v":""},{"$f":"REFERENTES!S854","v":0},849,0,1131,"X"]
[null,null,null,null,null,null,null,null,null,null,null,null,{"$f":"IF(ISNUMBER(FIND(\"RES\",REFERENTES!$T$2:$T$1134)),REFERENTES!W855,\"\")","v":""},{"$f":"REFERENTES!S855","v":0},850,0,1131,"X"]
[null,null,null,null,null,null,null,null,null,null,null,null,{"$f":"IF(ISNUMBER(FIND(\"RES\",REFERENTES!$T$2:$T$1134)),REFERENTES!W856,\"\")","v":""},{"$f":"REFERENTES!S856","v":0},851,0,1131,"X"]
[null,null,null,null,null,null,null,null,null,null,null,null,{"$f":"IF(ISNUMBER(FIND(\"RES\",REFERENTES!$T$2:$T$1134)),REFERENTES!W857,\"\")","v":""},{"$f":"REFERENTES!S857","v":0},852,0,1131,"X"]
[null,null,null,null,null,null,null,null,null,null,null,null,{"$f":"IF(ISNUMBER(FIND(\"RES\",REFERENTES!$T$2:$T$1134)),REFERENTES!W858,\"\")","v":""},{"$f":"REFERENTES!S858","v":0},853,0,1131,"X"]
[null,null,null,null,null,null,null,null,null,null,null,null,{"$f":"IF(ISNUMBER(FIND(\"RES\",REFERENTES!$T$2:$T$1134)),REFERENTES!W859,\"\")","v":""},{"$f":"REFERENTES!S859","v":0},854,0,1131,"X"]
[null,null,null,null,null,null,null,null,null,null,null,null,{"$f":"IF(ISNUMBER(FIND(\"RES\",REFERENTES!$T$2:$T$1134)),REFERENTES!W860,\"\")","v":""},{"$f":"REFERENTES!S860","v":0},855,0,1131,"X"]
[null,null,null,null,null,null,null,null,null,null,null,null,{"$f":"IF(ISNUMBER(FIND(\"RES\",REFERENTES!$T$2:$T$1134)),REFERENTES!W861,\"\")","v":""},{"$f":"REFERENTES!S861","v":0},856,0,1131,"X"]
[null,null,null,null,null,null,null,null,null,null,null,null,{"$f":"IF(ISNUMBER(FIND(\"RES\",REFERENTES!$T$2:$T$1134)),REFERENTES!W862,\"\")","v":""},{"$f":"REFERENTES!S862","v":0},857,0,1131,"X"]
[null,null,null,null,null,null,null,null,null,null,null,null,{"$f":"IF(ISNUMBER(FIND(\"RES\",REFERENTES!$T$2:$T$1134)),REFERENTES!W863,\"\")","v":""},{"$f":"REFERENTES!S863","v":0},858,0,1131,"X"]
[null,null,null,null,null,null,null,null,null,null,null,null,{"$f":"IF(ISNUMBER(FIND(\"RES\",REFERENTES!$T$2:$T$1134)),REFERENTES!W864,\"\")","v":""},{"$f":"REFERENTES!S864","v":0},859,0,1131,"X"]
[null,null,null,null,null,null,null,null,null,null,null,null,{"$f":"IF(ISNUMBER(FIND(\"RES\",REFERENTES!$T$2:$T$1134)),REFERENTES!W865,\"\")","v":""},{"$f":"REFERENTES!S865","v":0},860,0,1131,"X"]
[null,null,null,null,null,null,null,null,null,null,null,null,{"$f":"IF(ISNUMBER(FIND(\"RES\",REFERENTES!$T$2:$T$1134)),REFERENTES!W866,\"\")","v":""},{"$f":"REFERENTES!S866","v":0},861,0,1131,"X"]
[null,null,null,null,null,null,null,null,null,null,null,null,{"$f":"IF(ISNUMBER(FIND(\"RES\",REFERENTES!$T$2:$T$1134)),REFERENTES!W867,\"\")","v":""},{"$f":"REFERENTES!S867","v":0},862,0,1131,"X"]
[null,null,null,null,null,null,null,null,null,null,null,null,{"$f":"IF(ISNUMBER(FIND(\"RES\",REFERENTES!$T$2:$T$1134)),REFERENTES!W868,\"\")","v":""},{"$f":"REFERENTES!S868","v":0},863,0,1131,"X"]
[null,null,null,null,null,null,null,null,null,null,null,null,{"$f":"IF(ISNUMBER(FIND(\"RES\",REFERENTES!$T$2:$T$1134)),REFERENTES!W869,\"\")","v":""},{"$f":"REFERENTES!S869","v":0},864,0,1131,"X"]
[null,null,null,null,null,null,null,null,null,null,null,null,{"$f":"IF(ISNUMBER(FIND(\"RES\",REFERENTES!$T$2:$T$1134)),REFERENTES!W870,\"\")","v":""},{"$f":"REFERENTES!S870","v":0},865,0,1131,"X"]
[null,null,null,null,null,null,null,null,null,null,null,null,{"$f":"IF(ISNUMBER(FIND(\"RES\",REFERENTES!$T$2:$T$1134)),REFERENTES!W871,\"\")","v":""},{"$f":"REFERENTES!S871","v":0},866,0,1131,"X"]
[null,null,null,null,null,null,null,null,null,null,null,null,{"$f":"IF(ISNUMBER(FIND(\"RES\",REFERENTES!$T$2:$T$1134)),REFERENTES!W872,\"\")","v":""},{"$f":"REFERENTES!S872","v":0},867,0,1131,"X"]
[null,null,null,null,null,null,null,null,null,null,null,null,{"$f":"IF(ISNUMBER(FIND(\"RES\",REFERENTES!$T$2:$T$1134)),REFERENTES!W873,\"\")","v":""},{"$f":"REFERENTES!S873","v":0},868,0,1131,"X"]
[null,null,null,null,null,null,null,null,null,null,null,null,{"$f":"IF(ISNUMBER(FIND(\"RES\",REFERENTES!$T$2:$T$1134)),REFERENTES!W874,\"\")","v":""},{"$f":"REFERENTES!S874","v":0},869,0,1131,"X"]
[null,null,null,null,null,null,null,null,null,null,null,null,{"$f":"IF(ISNUMBER(FIND(\"RES\",REFERENTES!$T$2:$T$1134)),REFERENTES!W875,\"\")","v":""},{"$f":"REFERENTES!S875","v":0},870,0,1131,"X"]
[null,null,null,null,null,null,null,null,null,null,null,null,{"$f":"IF(ISNUMBER(FIND(\"RES\",REFERENTES!$T$2:$T$1134)),REFERENTES!W876,\"\")","v":""},{"$f":"REFERENTES!S876","v":0},871,0,1131,"X"]
[null,null,null,null,null,null,null,null,null,null,null,null,{"$f":"IF(ISNUMBER(FIND(\"RES\",REFERENTES!$T$2:$T$1134)),REFERENTES!W877,\"\")","v":""},{"$f":"REFERENTES!S877","v":0},872,0,1131,"X"]
[null,null,null,null,null,null,null,null,null,null,null,null,{"$f":"IF(ISNUMBER(FIND(\"RES\",REFERENTES!$T$2:$T$1134)),REFERENTES!W878,\"\")","v":""},{"$f":"REFERENTES!S878","v":0},873,0,1131,"X"]
[null,null,null,null,null,null,null,null,null,null,null,null,{"$f":"IF(ISNUMBER(FIND(\"RES\",REFERENTES!$T$2:$T$1134)),REFERENTES!W879,\"\")","v":""},{"$f":"REFERENTES!S879","v":0},874,0,1131,"X"]
[null,null,null,null,null,null,null,null,null,null,null,null,{"$f":"IF(ISNUMBER(FIND(\"RES\",REFERENTES!$T$2:$T$1134)),REFERENTES!W880,\"\")","v":""},{"$f":"REFERENTES!S880","v":0},875,0,1131,"X"]
[null,null,null,null,null,null,null,null,null,null,null,null,{"$f":"IF(ISNUMBER(FIND(\"RES\",REFERENTES!$T$2:$T$1134)),REFERENTES!W881,\"\")","v":""},{"$f":"REFERENTES!S881","v":0},876,0,1131,"X"]
[null,null,null,null,null,null,null,null,null,null,null,null,{"$f":"IF(ISNUMBER(FIND(\"RES\",REFERENTES!$T$2:$T$1134)),REFERENTES!W882,\"\")","v":""},{"$f":"REFERENTES!S882","v":0},877,0,1131,"X"]
[null,null,null,null,null,null,null,null,null,null,null,null,{"$f":"IF(ISNUMBER(FIND(\"RES\",REFERENTES!$T$2:$T$1134)),REFERENTES!W883,\"\")","v":""},{"$f":"REFERENTES!S883","v":0},878,0,1131,"X"]
[null,null,null,null,null,null,null,null,null,null,null,null,{"$f":"IF(ISNUMBER(FIND(\"RES\",REFERENTES!$T$2:$T$1134)),REFERENTES!W884,\"\")","v":""},{"$f":"REFERENTES!S884","v":0},879,0,1131,"X"]
[null,null,null,null,null,null,null,null,null,null,null,null,{"$f":"IF(ISNUMBER(FIND(\"RES\",REFERENTES!$T$2:$T$1134)),REFERENTES!W885,\"\")","v":""},{"$f":"REFERENTES!S885","v":0},880,0,1131,"X"]
[null,null,null,null,null,null,null,null,null,null,null,null,{"$f":"IF(ISNUMBER(FIND(\"RES\",REFERENTES!$T$2:$T$1134)),REFERENTES!W886,\"\")","v":""},{"$f":"REFERENTES!S886","v":0},881,0,1131,"X"]
[null,null,null,null,null,null,null,null,null,null,null,null,{"$f":"IF(ISNUMBER(FIND(\"RES\",REFERENTES!$T$2:$T$1134)),REFERENTES!W887,\"\")","v":""},{"$f":"REFERENTES!S887","v":0},882,0,1131,"X"]
[null,null,null,null,null,null,null,null,null,null,null,null,{"$f":"IF(ISNUMBER(FIND(\"RES\",REFERENTES!$T$2:$T$1134)),REFERENTES!W888,\"\")","v":""},{"$f":"REFERENTES!S888","v":0},883,0,1131,"X"]
[null,null,null,null,null,null,null,null,null,null,null,null,{"$f":"IF(ISNUMBER(FIND(\"RES\",REFERENTES!$T$2:$T$1134)),REFERENTES!W889,\"\")","v":""},{"$f":"REFERENTES!S889","v":0},884,0,1131,"X"]
[null,null,null,null,null,null,null,null,null,null,null,null,{"$f":"IF(ISNUMBER(FIND(\"RES\",REFERENTES!$T$2:$T$1134)),REFERENTES!W890,\"\")","v":""},{"$f":"REFERENTES!S890","v":0},885,0,1131,"X"]
[null,null,null,null,null,null,null,null,null,null,null,null,{"$f":"IF(ISNUMBER(FIND(\"RES\",REFERENTES!$T$2:$T$1134)),REFERENTES!W891,\"\")","v":""},{"$f":"REFERENTES!S891","v":0},886,0,1131,"X"]
[null,null,null,null,null,null,null,null,null,null,null,null,{"$f":"IF(ISNUMBER(FIND(\"RES\",REFERENTES!$T$2:$T$1134)),REFERENTES!W892,\"\")","v":""},{"$f":"REFERENTES!S892","v":0},887,0,1131,"X"]
[null,null,null,null,null,null,null,null,null,null,null,null,{"$f":"IF(ISNUMBER(FIND(\"RES\",REFERENTES!$T$2:$T$1134)),REFERENTES!W893,\"\")","v":""},{"$f":"REFERENTES!S893","v":0},888,0,1131,"X"]
[null,null,null,null,null,null,null,null,null,null,null,null,{"$f":"IF(ISNUMBER(FIND(\"RES\",REFERENTES!$T$2:$T$1134)),REFERENTES!W894,\"\")","v":""},{"$f":"REFERENTES!S894","v":0},889,0,1131,"X"]
[null,null,null,null,null,null,null,null,null,null,null,null,{"$f":"IF(ISNUMBER(FIND(\"RES\",REFERENTES!$T$2:$T$1134)),REFERENTES!W895,\"\")","v":""},{"$f":"REFERENTES!S895","v":0},890,0,1131,"X"]
[null,null,null,null,null,null,null,null,null,null,null,null,{"$f":"IF(ISNUMBER(FIND(\"RES\",REFERENTES!$T$2:$T$1134)),REFERENTES!W896,\"\")","v":""},{"$f":"REFERENTES!S896","v":0},891,0,1131,"X"]
[null,null,null,null,null,null,null,null,null,null,null,null,{"$f":"IF(ISNUMBER(FIND(\"RES\",REFERENTES!$T$2:$T$1134)),REFERENTES!W897,\"\")","v":""},{"$f":"REFERENTES!S897","v":0},892,0,1131,"X"]
[null,null,null,null,null,null,null,null,null,null,null,null,{"$f":"IF(ISNUMBER(FIND(\"RES\",REFERENTES!$T$2:$T$1134)),REFERENTES!W898,\"\")","v":""},{"$f":"REFERENTES!S898","v":0},893,0,1131,"X"]
[null,null,null,null,null,null,null,null,null,null,null,null,{"$f":"IF(ISNUMBER(FIND(\"RES\",REFERENTES!$T$2:$T$1134)),REFERENTES!W899,\"\")","v":""},{"$f":"REFERENTES!S899","v":0},894,0,1131,"X"]
[null,null,null,null,null,null,null,null,null,null,null,null,{"$f":"IF(ISNUMBER(FIND(\"RES\",REFERENTES!$T$2:$T$1134)),REFERENTES!W900,\"\")","v":""},{"$f":"REFERENTES!S900","v":0},895,0,1131,"X"]
[null,null,null,null,null,null,null,null,null,null,null,null,{"$f":"IF(ISNUMBER(FIND(\"RES\",REFERENTES!$T$2:$T$1134)),REFERENTES!W901,\"\")","v":""},{"$f":"REFERENTES!S901","v":0},896,0,1131,"X"]
[null,null,null,null,null,null,null,null,null,null,null,null,{"$f":"IF(ISNUMBER(FIND(\"RES\",REFERENTES!$T$2:$T$1134)),REFERENTES!W902,\"\")","v":""},{"$f":"REFERENTES!S902","v":0},897,0,1131,"X"]
[null,null,null,null,null,null,null,null,null,null,null,null,{"$f":"IF(ISNUMBER(FIND(\"RES\",REFERENTES!$T$2:$T$1134)),REFERENTES!W903,\"\")","v":""},{"$f":"REFERENTES!S903","v":0},898,0,{"$f":"IF(P903=0,MAX($O$6:$O$1135)+1,O903)","v":1131},{"$f":"IFERROR(VLOOKUP(SMALL($Q$6:$Q$1135,O903),$O$6:$P$1135,2,FALSE),\"X\")","v":"X"}]
[null,null,null,null,null,null,null,null,null,null,null,null,{"$f":"IF(ISNUMBER(FIND(\"RES\",REFERENTES!$T$2:$T$1134)),REFERENTES!W904,\"\")","v":""},{"$f":"REFERENTES!S904","v":0},899,0,1131,"X"]
[null,null,null,null,null,null,null,null,null,null,null,null,{"$f":"IF(ISNUMBER(FIND(\"RES\",REFERENTES!$T$2:$T$1134)),REFERENTES!W905,\"\")","v":""},{"$f":"REFERENTES!S905","v":0},900,{"$f":"IF(M905=\"\",0,M905)","v":0},1131,"X"]
[null,null,null,null,null,null,null,null,null,null,null,null,{"$f":"IF(ISNUMBER(FIND(\"RES\",REFERENTES!$T$2:$T$1134)),REFERENTES!W906,\"\")","v":""},{"$f":"REFERENTES!S906","v":0},901,0,1131,"X"]
[null,null,null,null,null,null,null,null,null,null,null,null,{"$f":"IF(ISNUMBER(FIND(\"RES\",REFERENTES!$T$2:$T$1134)),REFERENTES!W907,\"\")","v":""},{"$f":"REFERENTES!S907","v":0},902,0,1131,"X"]
[null,null,null,null,null,null,null,null,null,null,null,null,{"$f":"IF(ISNUMBER(FIND(\"RES\",REFERENTES!$T$2:$T$1134)),REFERENTES!W908,\"\")","v":""},{"$f":"REFERENTES!S908","v":0},903,0,1131,"X"]
[null,null,null,null,null,null,null,null,null,null,null,null,{"$f":"IF(ISNUMBER(FIND(\"RES\",REFERENTES!$T$2:$T$1134)),REFERENTES!W909,\"\")","v":""},{"$f":"REFERENTES!S909","v":0},904,0,1131,"X"]
[null,null,null,null,null,null,null,null,null,null,null,null,{"$f":"IF(ISNUMBER(FIND(\"RES\",REFERENTES!$T$2:$T$1134)),REFERENTES!W910,\"\")","v":""},{"$f":"REFERENTES!S910","v":0},905,0,1131,"X"]
[null,null,null,null,null,null,null,null,null,null,null,null,{"$f":"IF(ISNUMBER(FIND(\"RES\",REFERENTES!$T$2:$T$1134)),REFERENTES!W911,\"\")","v":""},{"$f":"REFERENTES!S911","v":0},906,0,1131,"X"]
[null,null,null,null,null,null,null,null,null,null,null,null,{"$f":"IF(ISNUMBER(FIND(\"RES\",REFERENTES!$T$2:$T$1134)),REFERENTES!W912,\"\")","v":""},{"$f":"REFERENTES!S912","v":0},907,0,1131,"X"]
[null,null,null,null,null,null,null,null,null,null,null,null,{"$f":"IF(ISNUMBER(FIND(\"RES\",REFERENTES!$T$2:$T$1134)),REFERENTES!W913,\"\")","v":""},{"$f":"REFERENTES!S913","v":0},908,0,1131,"X"]
[null,null,null,null,null,null,null,null,null,null,null,null,{"$f":"IF(ISNUMBER(FIND(\"RES\",REFERENTES!$T$2:$T$1134)),REFERENTES!W914,\"\")","v":""},{"$f":"REFERENTES!S914","v":0},909,0,1131,"X"]
[null,null,null,null,null,null,null,null,null,null,null,null,{"$f":"IF(ISNUMBER(FIND(\"RES\",REFERENTES!$T$2:$T$1134)),REFERENTES!W915,\"\")","v":""},{"$f":"REFERENTES!S915","v":0},910,0,1131,"X"]
[null,null,null,null,null,null,null,null,null,null,null,null,{"$f":"IF(ISNUMBER(FIND(\"RES\",REFERENTES!$T$2:$T$1134)),REFERENTES!W916,\"\")","v":""},{"$f":"REFERENTES!S916","v":0},911,0,1131,"X"]
[null,null,null,null,null,null,null,null,null,null,null,null,{"$f":"IF(ISNUMBER(FIND(\"RES\",REFERENTES!$T$2:$T$1134)),REFERENTES!W917,\"\")","v":""},{"$f":"REFERENTES!S917","v":0},912,0,1131,"X"]
[null,null,null,null,null,null,null,null,null,null,null,null,{"$f":"IF(ISNUMBER(FIND(\"RES\",REFERENTES!$T$2:$T$1134)),REFERENTES!W918,\"\")","v":""},{"$f":"REFERENTES!S918","v":0},913,0,1131,"X"]
[null,null,null,null,null,null,null,null,null,null,null,null,{"$f":"IF(ISNUMBER(FIND(\"RES\",REFERENTES!$T$2:$T$1134)),REFERENTES!W919,\"\")","v":""},{"$f":"REFERENTES!S919","v":0},914,0,1131,"X"]
[null,null,null,null,null,null,null,null,null,null,null,null,{"$f":"IF(ISNUMBER(FIND(\"RES\",REFERENTES!$T$2:$T$1134)),REFERENTES!W920,\"\")","v":""},{"$f":"REFERENTES!S920","v":0},915,0,1131,"X"]
[null,null,null,null,null,null,null,null,null,null,null,null,{"$f":"IF(ISNUMBER(FIND(\"RES\",REFERENTES!$T$2:$T$1134)),REFERENTES!W921,\"\")","v":""},{"$f":"REFERENTES!S921","v":0},916,0,1131,"X"]
[null,null,null,null,null,null,null,null,null,null,null,null,{"$f":"IF(ISNUMBER(FIND(\"RES\",REFERENTES!$T$2:$T$1134)),REFERENTES!W922,\"\")","v":""},{"$f":"REFERENTES!S922","v":0},917,0,1131,"X"]
[null,null,null,null,null,null,null,null,null,null,null,null,{"$f":"IF(ISNUMBER(FIND(\"RES\",REFERENTES!$T$2:$T$1134)),REFERENTES!W923,\"\")","v":""},{"$f":"REFERENTES!S923","v":0},918,0,1131,"X"]
[null,null,null,null,null,null,null,null,null,null,null,null,{"$f":"IF(ISNUMBER(FIND(\"RES\",REFERENTES!$T$2:$T$1134)),REFERENTES!W924,\"\")","v":""},{"$f":"REFERENTES!S924","v":0},919,0,1131,"X"]
[null,null,null,null,null,null,null,null,null,null,null,null,{"$f":"IF(ISNUMBER(FIND(\"RES\",REFERENTES!$T$2:$T$1134)),REFERENTES!W925,\"\")","v":""},{"$f":"REFERENTES!S925","v":0},920,0,1131,"X"]
[null,null,null,null,null,null,null,null,null,null,null,null,{"$f":"IF(ISNUMBER(FIND(\"RES\",REFERENTES!$T$2:$T$1134)),REFERENTES!W926,\"\")","v":""},{"$f":"REFERENTES!S926","v":0},921,0,1131,"X"]
[null,null,null,null,null,null,null,null,null,null,null,null,{"$f":"IF(ISNUMBER(FIND(\"RES\",REFERENTES!$T$2:$T$1134)),REFERENTES!W927,\"\")","v":""},{"$f":"REFERENTES!S927","v":0},922,0,1131,"X"]
[null,null,null,null,null,null,null,null,null,null,null,null,{"$f":"IF(ISNUMBER(FIND(\"RES\",REFERENTES!$T$2:$T$1134)),REFERENTES!W928,\"\")","v":""},{"$f":"REFERENTES!S928","v":0},923,0,1131,"X"]
[null,null,null,null,null,null,null,null,null,null,null,null,{"$f":"IF(ISNUMBER(FIND(\"RES\",REFERENTES!$T$2:$T$1134)),REFERENTES!W929,\"\")","v":""},{"$f":"REFERENTES!S929","v":0},924,0,1131,"X"]
[null,null,null,null,null,null,null,null,null,null,null,null,{"$f":"IF(ISNUMBER(FIND(\"RES\",REFERENTES!$T$2:$T$1134)),REFERENTES!W930,\"\")","v":""},{"$f":"REFERENTES!S930","v":0},925,0,1131,"X"]
[null,null,null,null,null,null,null,null,null,null,null,null,{"$f":"IF(ISNUMBER(FIND(\"RES\",REFERENTES!$T$2:$T$1134)),REFERENTES!W931,\"\")","v":""},{"$f":"REFERENTES!S931","v":0},926,0,1131,"X"]
[null,null,null,null,null,null,null,null,null,null,null,null,{"$f":"IF(ISNUMBER(FIND(\"RES\",REFERENTES!$T$2:$T$1134)),REFERENTES!W932,\"\")","v":""},{"$f":"REFERENTES!S932","v":0},927,0,1131,"X"]
[null,null,null,null,null,null,null,null,null,null,null,null,{"$f":"IF(ISNUMBER(FIND(\"RES\",REFERENTES!$T$2:$T$1134)),REFERENTES!W933,\"\")","v":""},{"$f":"REFERENTES!S933","v":0},928,0,1131,"X"]
[null,null,null,null,null,null,null,null,null,null,null,null,{"$f":"IF(ISNUMBER(FIND(\"RES\",REFERENTES!$T$2:$T$1134)),REFERENTES!W934,\"\")","v":""},{"$f":"REFERENTES!S934","v":0},929,0,1131,"X"]
[null,null,null,null,null,null,null,null,null,null,null,null,{"$f":"IF(ISNUMBER(FIND(\"RES\",REFERENTES!$T$2:$T$1134)),REFERENTES!W935,\"\")","v":""},{"$f":"REFERENTES!S935","v":0},930,0,1131,"X"]
[null,null,null,null,null,null,null,null,null,null,null,null,{"$f":"IF(ISNUMBER(FIND(\"RES\",REFERENTES!$T$2:$T$1134)),REFERENTES!W936,\"\")","v":""},{"$f":"REFERENTES!S936","v":0},931,0,1131,"X"]
[null,null,null,null,null,null,null,null,null,null,null,null,{"$f":"IF(ISNUMBER(FIND(\"RES\",REFERENTES!$T$2:$T$1134)),REFERENTES!W937,\"\")","v":""},{"$f":"REFERENTES!S937","v":0},932,0,1131,"X"]
[null,null,null,null,null,null,null,null,null,null,null,null,{"$f":"IF(ISNUMBER(FIND(\"RES\",REFERENTES!$T$2:$T$1134)),REFERENTES!W938,\"\")","v":""},{"$f":"REFERENTES!S938","v":0},933,0,1131,"X"]
[null,null,null,null,null,null,null,null,null,null,null,null,{"$f":"IF(ISNUMBER(FIND(\"RES\",REFERENTES!$T$2:$T$1134)),REFERENTES!W939,\"\")","v":""},{"$f":"REFERENTES!S939","v":0},934,0,1131,"X"]
[null,null,null,null,null,null,null,null,null,null,null,null,{"$f":"IF(ISNUMBER(FIND(\"RES\",REFERENTES!$T$2:$T$1134)),REFERENTES!W940,\"\")","v":""},{"$f":"REFERENTES!S940","v":0},935,0,1131,"X"]
[null,null,null,null,null,null,null,null,null,null,null,null,{"$f":"IF(ISNUMBER(FIND(\"RES\",REFERENTES!$T$2:$T$1134)),REFERENTES!W941,\"\")","v":""},{"$f":"REFERENTES!S941","v":0},936,0,1131,"X"]
[null,null,null,null,null,null,null,null,null,null,null,null,{"$f":"IF(ISNUMBER(FIND(\"RES\",REFERENTES!$T$2:$T$1134)),REFERENTES!W942,\"\")","v":""},{"$f":"REFERENTES!S942","v":0},937,0,1131,"X"]
[null,null,null,null,null,null,null,null,null,null,null,null,{"$f":"IF(ISNUMBER(FIND(\"RES\",REFERENTES!$T$2:$T$1134)),REFERENTES!W943,\"\")","v":""},{"$f":"REFERENTES!S943","v":0},938,0,1131,"X"]
[null,null,null,null,null,null,null,null,null,null,null,null,{"$f":"IF(ISNUMBER(FIND(\"RES\",REFERENTES!$T$2:$T$1134)),REFERENTES!W944,\"\")","v":""},{"$f":"REFERENTES!S944","v":0},939,0,1131,"X"]
[null,null,null,null,null,null,null,null,null,null,null,null,{"$f":"IF(ISNUMBER(FIND(\"RES\",REFERENTES!$T$2:$T$1134)),REFERENTES!W945,\"\")","v":""},{"$f":"REFERENTES!S945","v":0},940,0,1131,"X"]
[null,null,null,null,null,null,null,null,null,null,null,null,{"$f":"IF(ISNUMBER(FIND(\"RES\",REFERENTES!$T$2:$T$1134)),REFERENTES!W946,\"\")","v":""},{"$f":"REFERENTES!S946","v":0},941,0,1131,"X"]
[null,null,null,null,null,null,null,null,null,null,null,null,{"$f":"IF(ISNUMBER(FIND(\"RES\",REFERENTES!$T$2:$T$1134)),REFERENTES!W947,\"\")","v":""},{"$f":"REFERENTES!S947","v":0},942,0,1131,"X"]
[null,null,null,null,null,null,null,null,null,null,null,null,{"$f":"IF(ISNUMBER(FIND(\"RES\",REFERENTES!$T$2:$T$1134)),REFERENTES!W948,\"\")","v":""},{"$f":"REFERENTES!S948","v":0},943,0,1131,"X"]
[null,null,null,null,null,null,null,null,null,null,null,null,{"$f":"IF(ISNUMBER(FIND(\"RES\",REFERENTES!$T$2:$T$1134)),REFERENTES!W949,\"\")","v":""},{"$f":"REFERENTES!S949","v":0},944,0,1131,"X"]
[null,null,null,null,null,null,null,null,null,null,null,null,{"$f":"IF(ISNUMBER(FIND(\"RES\",REFERENTES!$T$2:$T$1134)),REFERENTES!W950,\"\")","v":""},{"$f":"REFERENTES!S950","v":0},945,0,1131,"X"]
[null,null,null,null,null,null,null,null,null,null,null,null,{"$f":"IF(ISNUMBER(FIND(\"RES\",REFERENTES!$T$2:$T$1134)),REFERENTES!W951,\"\")","v":""},{"$f":"REFERENTES!S951","v":0},946,0,1131,"X"]
[null,null,null,null,null,null,null,null,null,null,null,null,{"$f":"IF(ISNUMBER(FIND(\"RES\",REFERENTES!$T$2:$T$1134)),REFERENTES!W952,\"\")","v":""},{"$f":"REFERENTES!S952","v":0},947,0,1131,"X"]
[null,null,null,null,null,null,null,null,null,null,null,null,{"$f":"IF(ISNUMBER(FIND(\"RES\",REFERENTES!$T$2:$T$1134)),REFERENTES!W953,\"\")","v":""},{"$f":"REFERENTES!S953","v":0},948,0,1131,"X"]
[null,null,null,null,null,null,null,null,null,null,null,null,{"$f":"IF(ISNUMBER(FIND(\"RES\",REFERENTES!$T$2:$T$1134)),REFERENTES!W954,\"\")","v":""},{"$f":"REFERENTES!S954","v":0},949,0,1131,"X"]
[null,null,null,null,null,null,null,null,null,null,null,null,{"$f":"IF(ISNUMBER(FIND(\"RES\",REFERENTES!$T$2:$T$1134)),REFERENTES!W955,\"\")","v":""},{"$f":"REFERENTES!S955","v":0},950,0,1131,"X"]
[null,null,null,null,null,null,null,null,null,null,null,null,{"$f":"IF(ISNUMBER(FIND(\"RES\",REFERENTES!$T$2:$T$1134)),REFERENTES!W956,\"\")","v":""},{"$f":"REFERENTES!S956","v":0},951,0,1131,"X"]
[null,null,null,null,null,null,null,null,null,null,null,null,{"$f":"IF(ISNUMBER(FIND(\"RES\",REFERENTES!$T$2:$T$1134)),REFERENTES!W957,\"\")","v":""},{"$f":"REFERENTES!S957","v":0},952,0,1131,"X"]
[null,null,null,null,null,null,null,null,null,null,null,null,{"$f":"IF(ISNUMBER(FIND(\"RES\",REFERENTES!$T$2:$T$1134)),REFERENTES!W958,\"\")","v":""},{"$f":"REFERENTES!S958","v":0},953,0,1131,"X"]
[null,null,null,null,null,null,null,null,null,null,null,null,{"$f":"IF(ISNUMBER(FIND(\"RES\",REFERENTES!$T$2:$T$1134)),REFERENTES!W959,\"\")","v":""},{"$f":"REFERENTES!S959","v":0},954,0,1131,"X"]
[null,null,null,null,null,null,null,null,null,null,null,null,{"$f":"IF(ISNUMBER(FIND(\"RES\",REFERENTES!$T$2:$T$1134)),REFERENTES!W960,\"\")","v":""},{"$f":"REFERENTES!S960","v":0},955,0,1131,"X"]
[null,null,null,null,null,null,null,null,null,null,null,null,{"$f":"IF(ISNUMBER(FIND(\"RES\",REFERENTES!$T$2:$T$1134)),REFERENTES!W961,\"\")","v":""},{"$f":"REFERENTES!S961","v":0},956,0,1131,"X"]
[null,null,null,null,null,null,null,null,null,null,null,null,{"$f":"IF(ISNUMBER(FIND(\"RES\",REFERENTES!$T$2:$T$1134)),REFERENTES!W962,\"\")","v":""},{"$f":"REFERENTES!S962","v":0},957,0,1131,"X"]
[null,null,null,null,null,null,null,null,null,null,null,null,{"$f":"IF(ISNUMBER(FIND(\"RES\",REFERENTES!$T$2:$T$1134)),REFERENTES!W963,\"\")","v":""},{"$f":"REFERENTES!S963","v":0},958,0,1131,"X"]
[null,null,null,null,null,null,null,null,null,null,null,null,{"$f":"IF(ISNUMBER(FIND(\"RES\",REFERENTES!$T$2:$T$1134)),REFERENTES!W964,\"\")","v":""},{"$f":"REFERENTES!S964","v":0},959,0,1131,"X"]
[null,null,null,null,null,null,null,null,null,null,null,null,{"$f":"IF(ISNUMBER(FIND(\"RES\",REFERENTES!$T$2:$T$1134)),REFERENTES!W965,\"\")","v":""},{"$f":"REFERENTES!S965","v":0},960,0,1131,"X"]
[null,null,null,null,null,null,null,null,null,null,null,null,{"$f":"IF(ISNUMBER(FIND(\"RES\",REFERENTES!$T$2:$T$1134)),REFERENTES!W966,\"\")","v":""},{"$f":"REFERENTES!S966","v":0},961,0,1131,"X"]
[null,null,null,null,null,null,null,null,null,null,null,null,{"$f":"IF(ISNUMBER(FIND(\"RES\",REFERENTES!$T$2:$T$1134)),REFERENTES!W967,\"\")","v":""},{"$f":"REFERENTES!S967","v":0},962,0,{"$f":"IF(P967=0,MAX($O$6:$O$1135)+1,O967)","v":1131},{"$f":"IFERROR(VLOOKUP(SMALL($Q$6:$Q$1135,O967),$O$6:$P$1135,2,FALSE),\"X\")","v":"X"}]
[null,null,null,null,null,null,null,null,null,null,null,null,{"$f":"IF(ISNUMBER(FIND(\"RES\",REFERENTES!$T$2:$T$1134)),REFERENTES!W968,\"\")","v":""},{"$f":"REFERENTES!S968","v":0},963,0,1131,"X"]
[null,null,null,null,null,null,null,null,null,null,null,null,{"$f":"IF(ISNUMBER(FIND(\"RES\",REFERENTES!$T$2:$T$1134)),REFERENTES!W969,\"\")","v":""},{"$f":"REFERENTES!S969","v":0},964,{"$f":"IF(M969=\"\",0,M969)","v":0},1131,"X"]
[null,null,null,null,null,null,null,null,null,null,null,null,{"$f":"IF(ISNUMBER(FIND(\"RES\",REFERENTES!$T$2:$T$1134)),REFERENTES!W970,\"\")","v":""},{"$f":"REFERENTES!S970","v":0},965,0,1131,"X"]
[null,null,null,null,null,null,null,null,null,null,null,null,{"$f":"IF(ISNUMBER(FIND(\"RES\",REFERENTES!$T$2:$T$1134)),REFERENTES!W971,\"\")","v":""},{"$f":"REFERENTES!S971","v":0},966,0,1131,"X"]
[null,null,null,null,null,null,null,null,null,null,null,null,{"$f":"IF(ISNUMBER(FIND(\"RES\",REFERENTES!$T$2:$T$1134)),REFERENTES!W972,\"\")","v":""},{"$f":"REFERENTES!S972","v":0},967,0,1131,"X"]
[null,null,null,null,null,null,null,null,null,null,null,null,{"$f":"IF(ISNUMBER(FIND(\"RES\",REFERENTES!$T$2:$T$1134)),REFERENTES!W973,\"\")","v":""},{"$f":"REFERENTES!S973","v":0},968,0,1131,"X"]
[null,null,null,null,null,null,null,null,null,null,null,null,{"$f":"IF(ISNUMBER(FIND(\"RES\",REFERENTES!$T$2:$T$1134)),REFERENTES!W974,\"\")","v":""},{"$f":"REFERENTES!S974","v":0},969,0,1131,"X"]
[null,null,null,null,null,null,null,null,null,null,null,null,{"$f":"IF(ISNUMBER(FIND(\"RES\",REFERENTES!$T$2:$T$1134)),REFERENTES!W975,\"\")","v":""},{"$f":"REFERENTES!S975","v":0},970,0,1131,"X"]
[null,null,null,null,null,null,null,null,null,null,null,null,{"$f":"IF(ISNUMBER(FIND(\"RES\",REFERENTES!$T$2:$T$1134)),REFERENTES!W976,\"\")","v":""},{"$f":"REFERENTES!S976","v":0},971,0,1131,"X"]
[null,null,null,null,null,null,null,null,null,null,null,null,{"$f":"IF(ISNUMBER(FIND(\"RES\",REFERENTES!$T$2:$T$1134)),REFERENTES!W977,\"\")","v":""},{"$f":"REFERENTES!S977","v":0},972,0,1131,"X"]
[null,null,null,null,null,null,null,null,null,null,null,null,{"$f":"IF(ISNUMBER(FIND(\"RES\",REFERENTES!$T$2:$T$1134)),REFERENTES!W978,\"\")","v":""},{"$f":"REFERENTES!S978","v":0},973,0,1131,"X"]
[null,null,null,null,null,null,null,null,null,null,null,null,{"$f":"IF(ISNUMBER(FIND(\"RES\",REFERENTES!$T$2:$T$1134)),REFERENTES!W979,\"\")","v":""},{"$f":"REFERENTES!S979","v":0},974,0,1131,"X"]
[null,null,null,null,null,null,null,null,null,null,null,null,{"$f":"IF(ISNUMBER(FIND(\"RES\",REFERENTES!$T$2:$T$1134)),REFERENTES!W980,\"\")","v":""},{"$f":"REFERENTES!S980","v":0},975,0,1131,"X"]
[null,null,null,null,null,null,null,null,null,null,null,null,{"$f":"IF(ISNUMBER(FIND(\"RES\",REFERENTES!$T$2:$T$1134)),REFERENTES!W981,\"\")","v":""},{"$f":"REFERENTES!S981","v":0},976,0,1131,"X"]
[null,null,null,null,null,null,null,null,null,null,null,null,{"$f":"IF(ISNUMBER(FIND(\"RES\",REFERENTES!$T$2:$T$1134)),REFERENTES!W982,\"\")","v":""},{"$f":"REFERENTES!S982","v":0},977,0,1131,"X"]
[null,null,null,null,null,null,null,null,null,null,null,null,{"$f":"IF(ISNUMBER(FIND(\"RES\",REFERENTES!$T$2:$T$1134)),REFERENTES!W983,\"\")","v":""},{"$f":"REFERENTES!S983","v":0},978,0,1131,"X"]
[null,null,null,null,null,null,null,null,null,null,null,null,{"$f":"IF(ISNUMBER(FIND(\"RES\",REFERENTES!$T$2:$T$1134)),REFERENTES!W984,\"\")","v":""},{"$f":"REFERENTES!S984","v":0},979,0,1131,"X"]
[null,null,null,null,null,null,null,null,null,null,null,null,{"$f":"IF(ISNUMBER(FIND(\"RES\",REFERENTES!$T$2:$T$1134)),REFERENTES!W985,\"\")","v":""},{"$f":"REFERENTES!S985","v":0},980,0,1131,"X"]
[null,null,null,null,null,null,null,null,null,null,null,null,{"$f":"IF(ISNUMBER(FIND(\"RES\",REFERENTES!$T$2:$T$1134)),REFERENTES!W986,\"\")","v":""},{"$f":"REFERENTES!S986","v":0},981,0,1131,"X"]
[null,null,null,null,null,null,null,null,null,null,null,null,{"$f":"IF(ISNUMBER(FIND(\"RES\",REFERENTES!$T$2:$T$1134)),REFERENTES!W987,\"\")","v":""},{"$f":"REFERENTES!S987","v":0},982,0,1131,"X"]
[null,null,null,null,null,null,null,null,null,null,null,null,{"$f":"IF(ISNUMBER(FIND(\"RES\",REFERENTES!$T$2:$T$1134)),REFERENTES!W988,\"\")","v":""},{"$f":"REFERENTES!S988","v":0},983,0,1131,"X"]
[null,null,null,null,null,null,null,null,null,null,null,null,{"$f":"IF(ISNUMBER(FIND(\"RES\",REFERENTES!$T$2:$T$1134)),REFERENTES!W989,\"\")","v":""},{"$f":"REFERENTES!S989","v":0},984,0,1131,"X"]
[null,null,null,null,null,null,null,null,null,null,null,null,{"$f":"IF(ISNUMBER(FIND(\"RES\",REFERENTES!$T$2:$T$1134)),REFERENTES!W990,\"\")","v":""},{"$f":"REFERENTES!S990","v":0},985,0,1131,"X"]
[null,null,null,null,null,null,null,null,null,null,null,null,{"$f":"IF(ISNUMBER(FIND(\"RES\",REFERENTES!$T$2:$T$1134)),REFERENTES!W991,\"\")","v":""},{"$f":"REFERENTES!S991","v":0},986,0,1131,"X"]
[null,null,null,null,null,null,null,null,null,null,null,null,{"$f":"IF(ISNUMBER(FIND(\"RES\",REFERENTES!$T$2:$T$1134)),REFERENTES!W992,\"\")","v":""},{"$f":"REFERENTES!S992","v":0},987,0,1131,"X"]
[null,null,null,null,null,null,null,null,null,null,null,null,{"$f":"IF(ISNUMBER(FIND(\"RES\",REFERENTES!$T$2:$T$1134)),REFERENTES!W993,\"\")","v":""},{"$f":"REFERENTES!S993","v":0},988,0,1131,"X"]
[null,null,null,null,null,null,null,null,null,null,null,null,{"$f":"IF(ISNUMBER(FIND(\"RES\",REFERENTES!$T$2:$T$1134)),REFERENTES!W994,\"\")","v":""},{"$f":"REFERENTES!S994","v":0},989,0,1131,"X"]
[null,null,null,null,null,null,null,null,null,null,null,null,{"$f":"IF(ISNUMBER(FIND(\"RES\",REFERENTES!$T$2:$T$1134)),REFERENTES!W995,\"\")","v":""},{"$f":"REFERENTES!S995","v":0},990,0,1131,"X"]
[null,null,null,null,null,null,null,null,null,null,null,null,{"$f":"IF(ISNUMBER(FIND(\"RES\",REFERENTES!$T$2:$T$1134)),REFERENTES!W996,\"\")","v":""},{"$f":"REFERENTES!S996","v":0},991,0,1131,"X"]
[null,null,null,null,null,null,null,null,null,null,null,null,{"$f":"IF(ISNUMBER(FIND(\"RES\",REFERENTES!$T$2:$T$1134)),REFERENTES!W997,\"\")","v":""},{"$f":"REFERENTES!S997","v":0},992,0,1131,"X"]
[null,null,null,null,null,null,null,null,null,null,null,null,{"$f":"IF(ISNUMBER(FIND(\"RES\",REFERENTES!$T$2:$T$1134)),REFERENTES!W998,\"\")","v":""},{"$f":"REFERENTES!S998","v":0},993,0,1131,"X"]
[null,null,null,null,null,null,null,null,null,null,null,null,{"$f":"IF(ISNUMBER(FIND(\"RES\",REFERENTES!$T$2:$T$1134)),REFERENTES!W999,\"\")","v":""},{"$f":"REFERENTES!S999","v":0},994,0,1131,"X"]
[null,null,null,null,null,null,null,null,null,null,null,null,{"$f":"IF(ISNUMBER(FIND(\"RES\",REFERENTES!$T$2:$T$1134)),REFERENTES!W1000,\"\")","v":""},{"$f":"REFERENTES!S1000","v":0},995,0,1131,"X"]
[null,null,null,null,null,null,null,null,null,null,null,null,{"$f":"IF(ISNUMBER(FIND(\"RES\",REFERENTES!$T$2:$T$1134)),REFERENTES!W1001,\"\")","v":""},{"$f":"REFERENTES!S1001","v":0},996,0,1131,"X"]
[null,null,null,null,null,null,null,null,null,null,null,null,{"$f":"IF(ISNUMBER(FIND(\"RES\",REFERENTES!$T$2:$T$1134)),REFERENTES!W1002,\"\")","v":""},{"$f":"REFERENTES!S1002","v":0},997,0,1131,"X"]
[null,null,null,null,null,null,null,null,null,null,null,null,{"$f":"IF(ISNUMBER(FIND(\"RES\",REFERENTES!$T$2:$T$1134)),REFERENTES!W1003,\"\")","v":""},{"$f":"REFERENTES!S1003","v":0},998,0,1131,"X"]
[null,null,null,null,null,null,null,null,null,null,null,null,{"$f":"IF(ISNUMBER(FIND(\"RES\",REFERENTES!$T$2:$T$1134)),REFERENTES!W1004,\"\")","v":""},{"$f":"REFERENTES!S1004","v":0},999,0,1131,"X"]
[null,null,null,null,null,null,null,null,null,null,null,null,{"$f":"IF(ISNUMBER(FIND(\"RES\",REFERENTES!$T$2:$T$1134)),REFERENTES!W1005,\"\")","v":""},{"$f":"REFERENTES!S1005","v":0},1000,0,1131,"X"]
[null,null,null,null,null,null,null,null,null,null,null,null,{"$f":"IF(ISNUMBER(FIND(\"RES\",REFERENTES!$T$2:$T$1134)),REFERENTES!W1006,\"\")","v":""},{"$f":"REFERENTES!S1006","v":0},1001,0,1131,"X"]
[null,null,null,null,null,null,null,null,null,null,null,null,{"$f":"IF(ISNUMBER(FIND(\"RES\",REFERENTES!$T$2:$T$1134)),REFERENTES!W1007,\"\")","v":""},{"$f":"REFERENTES!S1007","v":0},1002,0,1131,"X"]
[null,null,null,null,null,null,null,null,null,null,null,null,{"$f":"IF(ISNUMBER(FIND(\"RES\",REFERENTES!$T$2:$T$1134)),REFERENTES!W1008,\"\")","v":""},{"$f":"REFERENTES!S1008","v":0},1003,0,1131,"X"]
[null,null,null,null,null,null,null,null,null,null,null,null,{"$f":"IF(ISNUMBER(FIND(\"RES\",REFERENTES!$T$2:$T$1134)),REFERENTES!W1009,\"\")","v":""},{"$f":"REFERENTES!S1009","v":0},1004,0,1131,"X"]
[null,null,null,null,null,null,null,null,null,null,null,null,{"$f":"IF(ISNUMBER(FIND(\"RES\",REFERENTES!$T$2:$T$1134)),REFERENTES!W1010,\"\")","v":""},{"$f":"REFERENTES!S1010","v":0},1005,0,1131,"X"]
[null,null,null,null,null,null,null,null,null,null,null,null,{"$f":"IF(ISNUMBER(FIND(\"RES\",REFERENTES!$T$2:$T$1134)),REFERENTES!W1011,\"\")","v":""},{"$f":"REFERENTES!S1011","v":0},1006,0,1131,"X"]
[null,null,null,null,null,null,null,null,null,null,null,null,{"$f":"IF(ISNUMBER(FIND(\"RES\",REFERENTES!$T$2:$T$1134)),REFERENTES!W1012,\"\")","v":""},{"$f":"REFERENTES!S1012","v":0},1007,0,1131,"X"]
[null,null,null,null,null,null,null,null,null,null,null,null,{"$f":"IF(ISNUMBER(FIND(\"RES\",REFERENTES!$T$2:$T$1134)),REFERENTES!W1013,\"\")","v":""},{"$f":"REFERENTES!S1013","v":0},1008,0,1131,"X"]
[null,null,null,null,null,null,null,null,null,null,null,null,{"$f":"IF(ISNUMBER(FIND(\"RES\",REFERENTES!$T$2:$T$1134)),REFERENTES!W1014,\"\")","v":""},{"$f":"REFERENTES!S1014","v":0},1009,0,1131,"X"]
[null,null,null,null,null,null,null,null,null,null,null,null,{"$f":"IF(ISNUMBER(FIND(\"RES\",REFERENTES!$T$2:$T$1134)),REFERENTES!W1015,\"\")","v":""},{"$f":"REFERENTES!S1015","v":0},1010,0,1131,"X"]
[null,null,null,null,null,null,null,null,null,null,null,null,{"$f":"IF(ISNUMBER(FIND(\"RES\",REFERENTES!$T$2:$T$1134)),REFERENTES!W1016,\"\")","v":""},{"$f":"REFERENTES!S1016","v":0},1011,0,1131,"X"]
[null,null,null,null,null,null,null,null,null,null,null,null,{"$f":"IF(ISNUMBER(FIND(\"RES\",REFERENTES!$T$2:$T$1134)),REFERENTES!W1017,\"\")","v":""},{"$f":"REFERENTES!S1017","v":0},1012,0,1131,"X"]
[null,null,null,null,null,null,null,null,null,null,null,null,{"$f":"IF(ISNUMBER(FIND(\"RES\",REFERENTES!$T$2:$T$1134)),REFERENTES!W1018,\"\")","v":""},{"$f":"REFERENTES!S1018","v":0},1013,0,1131,"X"]
[null,null,null,null,null,null,null,null,null,null,null,null,{"$f":"IF(ISNUMBER(FIND(\"RES\",REFERENTES!$T$2:$T$1134)),REFERENTES!W1019,\"\")","v":""},{"$f":"REFERENTES!S1019","v":0},1014,0,1131,"X"]
[null,null,null,null,null,null,null,null,null,null,null,null,{"$f":"IF(ISNUMBER(FIND(\"RES\",REFERENTES!$T$2:$T$1134)),REFERENTES!W1020,\"\")","v":""},{"$f":"REFERENTES!S1020","v":0},1015,0,1131,"X"]
[null,null,null,null,null,null,null,null,null,null,null,null,{"$f":"IF(ISNUMBER(FIND(\"RES\",REFERENTES!$T$2:$T$1134)),REFERENTES!W1021,\"\")","v":""},{"$f":"REFERENTES!S1021","v":0},1016,0,1131,"X"]
[null,null,null,null,null,null,null,null,null,null,null,null,{"$f":"IF(ISNUMBER(FIND(\"RES\",REFERENTES!$T$2:$T$1134)),REFERENTES!W1022,\"\")","v":""},{"$f":"REFERENTES!S1022","v":0},1017,0,1131,"X"]
[null,null,null,null,null,null,null,null,null,null,null,null,{"$f":"IF(ISNUMBER(FIND(\"RES\",REFERENTES!$T$2:$T$1134)),REFERENTES!W1023,\"\")","v":""},{"$f":"REFERENTES!S1023","v":0},1018,0,1131,"X"]
[null,null,null,null,null,null,null,null,null,null,null,null,{"$f":"IF(ISNUMBER(FIND(\"RES\",REFERENTES!$T$2:$T$1134)),REFERENTES!W1024,\"\")","v":""},{"$f":"REFERENTES!S1024","v":0},1019,0,1131,"X"]
[null,null,null,null,null,null,null,null,null,null,null,null,{"$f":"IF(ISNUMBER(FIND(\"RES\",REFERENTES!$T$2:$T$1134)),REFERENTES!W1025,\"\")","v":""},{"$f":"REFERENTES!S1025","v":0},1020,0,1131,"X"]
[null,null,null,null,null,null,null,null,null,null,null,null,{"$f":"IF(ISNUMBER(FIND(\"RES\",REFERENTES!$T$2:$T$1134)),REFERENTES!W1026,\"\")","v":""},{"$f":"REFERENTES!S1026","v":0},1021,0,1131,"X"]
[null,null,null,null,null,null,null,null,null,null,null,null,{"$f":"IF(ISNUMBER(FIND(\"RES\",REFERENTES!$T$2:$T$1134)),REFERENTES!W1027,\"\")","v":""},{"$f":"REFERENTES!S1027","v":0},1022,0,1131,"X"]
[null,null,null,null,null,null,null,null,null,null,null,null,{"$f":"IF(ISNUMBER(FIND(\"RES\",REFERENTES!$T$2:$T$1134)),REFERENTES!W1028,\"\")","v":""},{"$f":"REFERENTES!S1028","v":0},1023,0,1131,"X"]
[null,null,null,null,null,null,null,null,null,null,null,null,{"$f":"IF(ISNUMBER(FIND(\"RES\",REFERENTES!$T$2:$T$1134)),REFERENTES!W1029,\"\")","v":""},{"$f":"REFERENTES!S1029","v":0},1024,0,1131,"X"]
[null,null,null,null,null,null,null,null,null,null,null,null,{"$f":"IF(ISNUMBER(FIND(\"RES\",REFERENTES!$T$2:$T$1134)),REFERENTES!W1030,\"\")","v":""},{"$f":"REFERENTES!S1030","v":0},1025,0,1131,"X"]
[null,null,null,null,null,null,null,null,null,null,null,null,{"$f":"IF(ISNUMBER(FIND(\"RES\",REFERENTES!$T$2:$T$1134)),REFERENTES!W1031,\"\")","v":""},{"$f":"REFERENTES!S1031","v":0},1026,0,{"$f":"IF(P1031=0,MAX($O$6:$O$1135)+1,O1031)","v":1131},{"$f":"IFERROR(VLOOKUP(SMALL($Q$6:$Q$1135,O1031),$O$6:$P$1135,2,FALSE),\"X\")","v":"X"}]
[null,null,null,null,null,null,null,null,null,null,null,null,{"$f":"IF(ISNUMBER(FIND(\"RES\",REFERENTES!$T$2:$T$1134)),REFERENTES!W1032,\"\")","v":""},{"$f":"REFERENTES!S1032","v":0},1027,0,1131,"X"]
[null,null,null,null,null,null,null,null,null,null,null,null,{"$f":"IF(ISNUMBER(FIND(\"RES\",REFERENTES!$T$2:$T$1134)),REFERENTES!W1033,\"\")","v":""},{"$f":"REFERENTES!S1033","v":0},1028,{"$f":"IF(M1033=\"\",0,M1033)","v":0},1131,"X"]
[null,null,null,null,null,null,null,null,null,null,null,null,{"$f":"IF(ISNUMBER(FIND(\"RES\",REFERENTES!$T$2:$T$1134)),REFERENTES!W1034,\"\")","v":""},{"$f":"REFERENTES!S1034","v":0},1029,0,1131,"X"]
[null,null,null,null,null,null,null,null,null,null,null,null,{"$f":"IF(ISNUMBER(FIND(\"RES\",REFERENTES!$T$2:$T$1134)),REFERENTES!W1035,\"\")","v":""},{"$f":"REFERENTES!S1035","v":0},1030,0,1131,"X"]
[null,null,null,null,null,null,null,null,null,null,null,null,{"$f":"IF(ISNUMBER(FIND(\"RES\",REFERENTES!$T$2:$T$1134)),REFERENTES!W1036,\"\")","v":""},{"$f":"REFERENTES!S1036","v":0},1031,0,1131,"X"]
[null,null,null,null,null,null,null,null,null,null,null,null,{"$f":"IF(ISNUMBER(FIND(\"RES\",REFERENTES!$T$2:$T$1134)),REFERENTES!W1037,\"\")","v":""},{"$f":"REFERENTES!S1037","v":0},1032,0,1131,"X"]
[null,null,null,null,null,null,null,null,null,null,null,null,{"$f":"IF(ISNUMBER(FIND(\"RES\",REFERENTES!$T$2:$T$1134)),REFERENTES!W1038,\"\")","v":""},{"$f":"REFERENTES!S1038","v":0},1033,0,1131,"X"]
[null,null,null,null,null,null,null,null,null,null,null,null,{"$f":"IF(ISNUMBER(FIND(\"RES\",REFERENTES!$T$2:$T$1134)),REFERENTES!W1039,\"\")","v":""},{"$f":"REFERENTES!S1039","v":0},1034,0,1131,"X"]
[null,null,null,null,null,null,null,null,null,null,null,null,{"$f":"IF(ISNUMBER(FIND(\"RES\",REFERENTES!$T$2:$T$1134)),REFERENTES!W1040,\"\")","v":""},{"$f":"REFERENTES!S1040","v":0},1035,0,1131,"X"]
[null,null,null,null,null,null,null,null,null,null,null,null,{"$f":"IF(ISNUMBER(FIND(\"RES\",REFERENTES!$T$2:$T$1134)),REFERENTES!W1041,\"\")","v":""},{"$f":"REFERENTES!S1041","v":0},1036,0,1131,"X"]
[null,null,null,null,null,null,null,null,null,null,null,null,{"$f":"IF(ISNUMBER(FIND(\"RES\",REFERENTES!$T$2:$T$1134)),REFERENTES!W1042,\"\")","v":""},{"$f":"REFERENTES!S1042","v":0},1037,0,1131,"X"]
[null,null,null,null,null,null,null,null,null,null,null,null,{"$f":"IF(ISNUMBER(FIND(\"RES\",REFERENTES!$T$2:$T$1134)),REFERENTES!W1043,\"\")","v":""},{"$f":"REFERENTES!S1043","v":0},1038,0,1131,"X"]
[null,null,null,null,null,null,null,null,null,null,null,null,{"$f":"IF(ISNUMBER(FIND(\"RES\",REFERENTES!$T$2:$T$1134)),REFERENTES!W1044,\"\")","v":""},{"$f":"REFERENTES!S1044","v":0},1039,0,1131,"X"]
[null,null,null,null,null,null,null,null,null,null,null,null,{"$f":"IF(ISNUMBER(FIND(\"RES\",REFERENTES!$T$2:$T$1134)),REFERENTES!W1045,\"\")","v":""},{"$f":"REFERENTES!S1045","v":0},1040,0,1131,"X"]
[null,null,null,null,null,null,null,null,null,null,null,null,{"$f":"IF(ISNUMBER(FIND(\"RES\",REFERENTES!$T$2:$T$1134)),REFERENTES!W1046,\"\")","v":""},{"$f":"REFERENTES!S1046","v":0},1041,0,1131,"X"]
[null,null,null,null,null,null,null,null,null,null,null,null,{"$f":"IF(ISNUMBER(FIND(\"RES\",REFERENTES!$T$2:$T$1134)),REFERENTES!W1047,\"\")","v":""},{"$f":"REFERENTES!S1047","v":0},1042,0,1131,"X"]
[null,null,null,null,null,null,null,null,null,null,null,null,{"$f":"IF(ISNUMBER(FIND(\"RES\",REFERENTES!$T$2:$T$1134)),REFERENTES!W1048,\"\")","v":""},{"$f":"REFERENTES!S1048","v":0},1043,0,1131,"X"]
[null,null,null,null,null,null,null,null,null,null,null,null,{"$f":"IF(ISNUMBER(FIND(\"RES\",REFERENTES!$T$2:$T$1134)),REFERENTES!W1049,\"\")","v":""},{"$f":"REFERENTES!S1049","v":0},1044,0,1131,"X"]
[null,null,null,null,null,null,null,null,null,null,null,null,{"$f":"IF(ISNUMBER(FIND(\"RES\",REFERENTES!$T$2:$T$1134)),REFERENTES!W1050,\"\")","v":""},{"$f":"REFERENTES!S1050","v":0},1045,0,1131,"X"]
[null,null,null,null,null,null,null,null,null,null,null,null,{"$f":"IF(ISNUMBER(FIND(\"RES\",REFERENTES!$T$2:$T$1134)),REFERENTES!W1051,\"\")","v":""},{"$f":"REFERENTES!S1051","v":0},1046,0,1131,"X"]
[null,null,null,null,null,null,null,null,null,null,null,null,{"$f":"IF(ISNUMBER(FIND(\"RES\",REFERENTES!$T$2:$T$1134)),REFERENTES!W1052,\"\")","v":""},{"$f":"REFERENTES!S1052","v":0},1047,0,1131,"X"]
[null,null,null,null,null,null,null,null,null,null,null,null,{"$f":"IF(ISNUMBER(FIND(\"RES\",REFERENTES!$T$2:$T$1134)),REFERENTES!W1053,\"\")","v":""},{"$f":"REFERENTES!S1053","v":0},1048,0,1131,"X"]
[null,null,null,null,null,null,null,null,null,null,null,null,{"$f":"IF(ISNUMBER(FIND(\"RES\",REFERENTES!$T$2:$T$1134)),REFERENTES!W1054,\"\")","v":""},{"$f":"REFERENTES!S1054","v":0},1049,0,1131,"X"]
[null,null,null,null,null,null,null,null,null,null,null,null,{"$f":"IF(ISNUMBER(FIND(\"RES\",REFERENTES!$T$2:$T$1134)),REFERENTES!W1055,\"\")","v":""},{"$f":"REFERENTES!S1055","v":0},1050,0,1131,"X"]
[null,null,null,null,null,null,null,null,null,null,null,null,{"$f":"IF(ISNUMBER(FIND(\"RES\",REFERENTES!$T$2:$T$1134)),REFERENTES!W1056,\"\")","v":""},{"$f":"REFERENTES!S1056","v":0},1051,0,1131,"X"]
[null,null,null,null,null,null,null,null,null,null,null,null,{"$f":"IF(ISNUMBER(FIND(\"RES\",REFERENTES!$T$2:$T$1134)),REFERENTES!W1057,\"\")","v":""},{"$f":"REFERENTES!S1057","v":0},1052,0,1131,"X"]
[null,null,null,null,null,null,null,null,null,null,null,null,{"$f":"IF(ISNUMBER(FIND(\"RES\",REFERENTES!$T$2:$T$1134)),REFERENTES!W1058,\"\")","v":""},{"$f":"REFERENTES!S1058","v":0},1053,0,1131,"X"]
[null,null,null,null,null,null,null,null,null,null,null,null,{"$f":"IF(ISNUMBER(FIND(\"RES\",REFERENTES!$T$2:$T$1134)),REFERENTES!W1059,\"\")","v":""},{"$f":"REFERENTES!S1059","v":0},1054,0,1131,"X"]
[null,null,null,null,null,null,null,null,null,null,null,null,{"$f":"IF(ISNUMBER(FIND(\"RES\",REFERENTES!$T$2:$T$1134)),REFERENTES!W1060,\"\")","v":""},{"$f":"REFERENTES!S1060","v":0},1055,0,1131,"X"]
[null,null,null,null,null,null,null,null,null,null,null,null,{"$f":"IF(ISNUMBER(FIND(\"RES\",REFERENTES!$T$2:$T$1134)),REFERENTES!W1061,\"\")","v":""},{"$f":"REFERENTES!S1061","v":0},1056,0,1131,"X"]
[null,null,null,null,null,null,null,null,null,null,null,null,{"$f":"IF(ISNUMBER(FIND(\"RES\",REFERENTES!$T$2:$T$1134)),REFERENTES!W1062,\"\")","v":""},{"$f":"REFERENTES!S1062","v":0},1057,0,1131,"X"]
[null,null,null,null,null,null,null,null,null,null,null,null,{"$f":"IF(ISNUMBER(FIND(\"RES\",REFERENTES!$T$2:$T$1134)),REFERENTES!W1063,\"\")","v":""},{"$f":"REFERENTES!S1063","v":0},1058,0,1131,"X"]
[null,null,null,null,null,null,null,null,null,null,null,null,{"$f":"IF(ISNUMBER(FIND(\"RES\",REFERENTES!$T$2:$T$1134)),REFERENTES!W1064,\"\")","v":""},{"$f":"REFERENTES!S1064","v":0},1059,0,1131,"X"]
[null,null,null,null,null,null,null,null,null,null,null,null,{"$f":"IF(ISNUMBER(FIND(\"RES\",REFERENTES!$T$2:$T$1134)),REFERENTES!W1065,\"\")","v":""},{"$f":"REFERENTES!S1065","v":0},1060,0,1131,"X"]
[null,null,null,null,null,null,null,null,null,null,null,null,{"$f":"IF(ISNUMBER(FIND(\"RES\",REFERENTES!$T$2:$T$1134)),REFERENTES!W1066,\"\")","v":""},{"$f":"REFERENTES!S1066","v":0},1061,0,1131,"X"]
[null,null,null,null,null,null,null,null,null,null,null,null,{"$f":"IF(ISNUMBER(FIND(\"RES\",REFERENTES!$T$2:$T$1134)),REFERENTES!W1067,\"\")","v":""},{"$f":"REFERENTES!S1067","v":0},1062,0,1131,"X"]
[null,null,null,null,null,null,null,null,null,null,null,null,{"$f":"IF(ISNUMBER(FIND(\"RES\",REFERENTES!$T$2:$T$1134)),REFERENTES!W1068,\"\")","v":""},{"$f":"REFERENTES!S1068","v":0},1063,0,1131,"X"]
[null,null,null,null,null,null,null,null,null,null,null,null,{"$f":"IF(ISNUMBER(FIND(\"RES\",REFERENTES!$T$2:$T$1134)),REFERENTES!W1069,\"\")","v":""},{"$f":"REFERENTES!S1069","v":0},1064,0,1131,"X"]
[null,null,null,null,null,null,null,null,null,null,null,null,{"$f":"IF(ISNUMBER(FIND(\"RES\",REFERENTES!$T$2:$T$1134)),REFERENTES!W1070,\"\")","v":""},{"$f":"REFERENTES!S1070","v":0},1065,0,1131,"X"]
[null,null,null,null,null,null,null,null,null,null,null,null,{"$f":"IF(ISNUMBER(FIND(\"RES\",REFERENTES!$T$2:$T$1134)),REFERENTES!W1071,\"\")","v":""},{"$f":"REFERENTES!S1071","v":0},1066,0,1131,"X"]
[null,null,null,null,null,null,null,null,null,null,null,null,{"$f":"IF(ISNUMBER(FIND(\"RES\",REFERENTES!$T$2:$T$1134)),REFERENTES!W1072,\"\")","v":""},{"$f":"REFERENTES!S1072","v":0},1067,0,1131,"X"]
[null,null,null,null,null,null,null,null,null,null,null,null,{"$f":"IF(ISNUMBER(FIND(\"RES\",REFERENTES!$T$2:$T$1134)),REFERENTES!W1073,\"\")","v":""},{"$f":"REFERENTES!S1073","v":0},1068,0,1131,"X"]
[null,null,null,null,null,null,null,null,null,null,null,null,{"$f":"IF(ISNUMBER(FIND(\"RES\",REFERENTES!$T$2:$T$1134)),REFERENTES!W1074,\"\")","v":""},{"$f":"REFERENTES!S1074","v":0},1069,0,1131,"X"]
[null,null,null,null,null,null,null,null,null,null,null,null,{"$f":"IF(ISNUMBER(FIND(\"RES\",REFERENTES!$T$2:$T$1134)),REFERENTES!W1075,\"\")","v":""},{"$f":"REFERENTES!S1075","v":0},1070,0,1131,"X"]
[null,null,null,null,null,null,null,null,null,null,null,null,{"$f":"IF(ISNUMBER(FIND(\"RES\",REFERENTES!$T$2:$T$1134)),REFERENTES!W1076,\"\")","v":""},{"$f":"REFERENTES!S1076","v":0},1071,0,1131,"X"]
[null,null,null,null,null,null,null,null,null,null,null,null,{"$f":"IF(ISNUMBER(FIND(\"RES\",REFERENTES!$T$2:$T$1134)),REFERENTES!W1077,\"\")","v":""},{"$f":"REFERENTES!S1077","v":0},1072,0,1131,"X"]
[null,null,null,null,null,null,null,null,null,null,null,null,{"$f":"IF(ISNUMBER(FIND(\"RES\",REFERENTES!$T$2:$T$1134)),REFERENTES!W1078,\"\")","v":""},{"$f":"REFERENTES!S1078","v":0},1073,0,1131,"X"]
[null,null,null,null,null,null,null,null,null,null,null,null,{"$f":"IF(ISNUMBER(FIND(\"RES\",REFERENTES!$T$2:$T$1134)),REFERENTES!W1079,\"\")","v":""},{"$f":"REFERENTES!S1079","v":0},1074,0,1131,"X"]
[null,null,null,null,null,null,null,null,null,null,null,null,{"$f":"IF(ISNUMBER(FIND(\"RES\",REFERENTES!$T$2:$T$1134)),REFERENTES!W1080,\"\")","v":""},{"$f":"REFERENTES!S1080","v":0},1075,0,1131,"X"]
[null,null,null,null,null,null,null,null,null,null,null,null,{"$f":"IF(ISNUMBER(FIND(\"RES\",REFERENTES!$T$2:$T$1134)),REFERENTES!W1081,\"\")","v":""},{"$f":"REFERENTES!S1081","v":0},1076,0,1131,"X"]
[null,null,null,null,null,null,null,null,null,null,null,null,{"$f":"IF(ISNUMBER(FIND(\"RES\",REFERENTES!$T$2:$T$1134)),REFERENTES!W1082,\"\")","v":""},{"$f":"REFERENTES!S1082","v":0},1077,0,1131,"X"]
[null,null,null,null,null,null,null,null,null,null,null,null,{"$f":"IF(ISNUMBER(FIND(\"RES\",REFERENTES!$T$2:$T$1134)),REFERENTES!W1083,\"\")","v":""},{"$f":"REFERENTES!S1083","v":0},1078,0,1131,"X"]
[null,null,null,null,null,null,null,null,null,null,null,null,{"$f":"IF(ISNUMBER(FIND(\"RES\",REFERENTES!$T$2:$T$1134)),REFERENTES!W1084,\"\")","v":""},{"$f":"REFERENTES!S1084","v":0},1079,0,1131,"X"]
[null,null,null,null,null,null,null,null,null,null,null,null,{"$f":"IF(ISNUMBER(FIND(\"RES\",REFERENTES!$T$2:$T$1134)),REFERENTES!W1085,\"\")","v":""},{"$f":"REFERENTES!S1085","v":0},1080,0,1131,"X"]
[null,null,null,null,null,null,null,null,null,null,null,null,{"$f":"IF(ISNUMBER(FIND(\"RES\",REFERENTES!$T$2:$T$1134)),REFERENTES!W1086,\"\")","v":""},{"$f":"REFERENTES!S1086","v":0},1081,0,1131,"X"]
[null,null,null,null,null,null,null,null,null,null,null,null,{"$f":"IF(ISNUMBER(FIND(\"RES\",REFERENTES!$T$2:$T$1134)),REFERENTES!W1087,\"\")","v":""},{"$f":"REFERENTES!S1087","v":0},1082,0,1131,"X"]
[null,null,null,null,null,null,null,null,null,null,null,null,{"$f":"IF(ISNUMBER(FIND(\"RES\",REFERENTES!$T$2:$T$1134)),REFERENTES!W1088,\"\")","v":""},{"$f":"REFERENTES!S1088","v":0},1083,0,1131,"X"]
[null,null,null,null,null,null,null,null,null,null,null,null,{"$f":"IF(ISNUMBER(FIND(\"RES\",REFERENTES!$T$2:$T$1134)),REFERENTES!W1089,\"\")","v":""},{"$f":"REFERENTES!S1089","v":0},1084,0,1131,"X"]
[null,null,null,null,null,null,null,null,null,null,null,null,{"$f":"IF(ISNUMBER(FIND(\"RES\",REFERENTES!$T$2:$T$1134)),REFERENTES!W1090,\"\")","v":""},{"$f":"REFERENTES!S1090","v":0},1085,0,1131,"X"]
[null,null,null,null,null,null,null,null,null,null,null,null,{"$f":"IF(ISNUMBER(FIND(\"RES\",REFERENTES!$T$2:$T$1134)),REFERENTES!W1091,\"\")","v":""},{"$f":"REFERENTES!S1091","v":0},1086,0,1131,"X"]
[null,null,null,null,null,null,null,null,null,null,null,null,{"$f":"IF(ISNUMBER(FIND(\"RES\",REFERENTES!$T$2:$T$1134)),REFERENTES!W1092,\"\")","v":""},{"$f":"REFERENTES!S1092","v":0},1087,0,1131,"X"]
[null,null,null,null,null,null,null,null,null,null,null,null,{"$f":"IF(ISNUMBER(FIND(\"RES\",REFERENTES!$T$2:$T$1134)),REFERENTES!W1093,\"\")","v":""},{"$f":"REFERENTES!S1093","v":0},1088,0,1131,"X"]
[null,null,null,null,null,null,null,null,null,null,null,null,{"$f":"IF(ISNUMBER(FIND(\"RES\",REFERENTES!$T$2:$T$1134)),REFERENTES!W1094,\"\")","v":""},{"$f":"REFERENTES!S1094","v":0},1089,0,1131,"X"]
[null,null,null,null,null,null,null,null,null,null,null,null,{"$f":"IF(ISNUMBER(FIND(\"RES\",REFERENTES!$T$2:$T$1134)),REFERENTES!W1095,\"\")","v":""},{"$f":"REFERENTES!S1095","v":0},1090,0,{"$f":"IF(P1095=0,MAX($O$6:$O$1135)+1,O1095)","v":1131},{"$f":"IFERROR(VLOOKUP(SMALL($Q$6:$Q$1135,O1095),$O$6:$P$1135,2,FALSE),\"X\")","v":"X"}]
[null,null,null,null,null,null,null,null,null,null,null,null,{"$f":"IF(ISNUMBER(FIND(\"RES\",REFERENTES!$T$2:$T$1134)),REFERENTES!W1096,\"\")","v":""},{"$f":"REFERENTES!S1096","v":0},1091,0,1131,"X"]
[null,null,null,null,null,null,null,null,null,null,null,null,{"$f":"IF(ISNUMBER(FIND(\"RES\",REFERENTES!$T$2:$T$1134)),REFERENTES!W1097,\"\")","v":""},{"$f":"REFERENTES!S1097","v":0},1092,{"$f":"IF(M1097=\"\",0,M1097)","v":0},1131,"X"]
[null,null,null,null,null,null,null,null,null,null,null,null,{"$f":"IF(ISNUMBER(FIND(\"RES\",REFERENTES!$T$2:$T$1134)),REFERENTES!W1098,\"\")","v":""},{"$f":"REFERENTES!S1098","v":0},1093,0,1131,"X"]
[null,null,null,null,null,null,null,null,null,null,null,null,{"$f":"IF(ISNUMBER(FIND(\"RES\",REFERENTES!$T$2:$T$1134)),REFERENTES!W1099,\"\")","v":""},{"$f":"REFERENTES!S1099","v":0},1094,0,1131,"X"]
[null,null,null,null,null,null,null,null,null,null,null,null,{"$f":"IF(ISNUMBER(FIND(\"RES\",REFERENTES!$T$2:$T$1134)),REFERENTES!W1100,\"\")","v":""},{"$f":"REFERENTES!S1100","v":0},1095,0,1131,"X"]
[null,null,null,null,null,null,null,null,null,null,null,null,{"$f":"IF(ISNUMBER(FIND(\"RES\",REFERENTES!$T$2:$T$1134)),REFERENTES!W1101,\"\")","v":""},{"$f":"REFERENTES!S1101","v":0},1096,0,1131,"X"]
[null,null,null,null,null,null,null,null,null,null,null,null,{"$f":"IF(ISNUMBER(FIND(\"RES\",REFERENTES!$T$2:$T$1134)),REFERENTES!W1102,\"\")","v":""},{"$f":"REFERENTES!S1102","v":0},1097,0,1131,"X"]
[null,null,null,null,null,null,null,null,null,null,null,null,{"$f":"IF(ISNUMBER(FIND(\"RES\",REFERENTES!$T$2:$T$1134)),REFERENTES!W1103,\"\")","v":""},{"$f":"REFERENTES!S1103","v":0},1098,0,1131,"X"]
[null,null,null,null,null,null,null,null,null,null,null,null,{"$f":"IF(ISNUMBER(FIND(\"RES\",REFERENTES!$T$2:$T$1134)),REFERENTES!W1104,\"\")","v":""},{"$f":"REFERENTES!S1104","v":0},1099,0,1131,"X"]
[null,null,null,null,null,null,null,null,null,null,null,null,{"$f":"IF(ISNUMBER(FIND(\"RES\",REFERENTES!$T$2:$T$1134)),REFERENTES!W1105,\"\")","v":""},{"$f":"REFERENTES!S1105","v":0},1100,0,1131,"X"]
[null,null,null,null,null,null,null,null,null,null,null,null,{"$f":"IF(ISNUMBER(FIND(\"RES\",REFERENTES!$T$2:$T$1134)),REFERENTES!W1106,\"\")","v":""},{"$f":"REFERENTES!S1106","v":0},1101,0,1131,"X"]
[null,null,null,null,null,null,null,null,null,null,null,null,{"$f":"IF(ISNUMBER(FIND(\"RES\",REFERENTES!$T$2:$T$1134)),REFERENTES!W1107,\"\")","v":""},{"$f":"REFERENTES!S1107","v":0},1102,0,1131,"X"]
[null,null,null,null,null,null,null,null,null,null,null,null,{"$f":"IF(ISNUMBER(FIND(\"RES\",REFERENTES!$T$2:$T$1134)),REFERENTES!W1108,\"\")","v":""},{"$f":"REFERENTES!S1108","v":0},1103,0,1131,"X"]
[null,null,null,null,null,null,null,null,null,null,null,null,{"$f":"IF(ISNUMBER(FIND(\"RES\",REFERENTES!$T$2:$T$1134)),REFERENTES!W1109,\"\")","v":""},{"$f":"REFERENTES!S1109","v":0},1104,0,1131,"X"]
[null,null,null,null,null,null,null,null,null,null,null,null,{"$f":"IF(ISNUMBER(FIND(\"RES\",REFERENTES!$T$2:$T$1134)),REFERENTES!W1110,\"\")","v":""},{"$f":"REFERENTES!S1110","v":0},1105,0,1131,"X"]
[null,null,null,null,null,null,null,null,null,null,null,null,{"$f":"IF(ISNUMBER(FIND(\"RES\",REFERENTES!$T$2:$T$1134)),REFERENTES!W1111,\"\")","v":""},{"$f":"REFERENTES!S1111","v":0},1106,0,1131,"X"]
[null,null,null,null,null,null,null,null,null,null,null,null,{"$f":"IF(ISNUMBER(FIND(\"RES\",REFERENTES!$T$2:$T$1134)),REFERENTES!W1112,\"\")","v":""},{"$f":"REFERENTES!S1112","v":0},1107,0,1131,"X"]
[null,null,null,null,null,null,null,null,null,null,null,null,{"$f":"IF(ISNUMBER(FIND(\"RES\",REFERENTES!$T$2:$T$1134)),REFERENTES!W1113,\"\")","v":""},{"$f":"REFERENTES!S1113","v":0},1108,0,1131,"X"]
[null,null,null,null,null,null,null,null,null,null,null,null,{"$f":"IF(ISNUMBER(FIND(\"RES\",REFERENTES!$T$2:$T$1134)),REFERENTES!W1114,\"\")","v":""},{"$f":"REFERENTES!S1114","v":0},1109,0,1131,"X"]
[null,null,null,null,null,null,null,null,null,null,null,null,{"$f":"IF(ISNUMBER(FIND(\"RES\",REFERENTES!$T$2:$T$1134)),REFERENTES!W1115,\"\")","v":""},{"$f":"REFERENTES!S1115","v":0},1110,0,1131,"X"]
[null,null,null,null,null,null,null,null,null,null,null,null,{"$f":"IF(ISNUMBER(FIND(\"RES\",REFERENTES!$T$2:$T$1134)),REFERENTES!W1116,\"\")","v":""},{"$f":"REFERENTES!S1116","v":0},1111,0,1131,"X"]
[null,null,null,null,null,null,null,null,null,null,null,null,{"$f":"IF(ISNUMBER(FIND(\"RES\",REFERENTES!$T$2:$T$1134)),REFERENTES!W1117,\"\")","v":""},{"$f":"REFERENTES!S1117","v":0},1112,0,1131,"X"]
[null,null,null,null,null,null,null,null,null,null,null,null,{"$f":"IF(ISNUMBER(FIND(\"RES\",REFERENTES!$T$2:$T$1134)),REFERENTES!W1118,\"\")","v":""},{"$f":"REFERENTES!S1118","v":0},1113,0,1131,"X"]
[null,null,null,null,null,null,null,null,null,null,null,null,{"$f":"IF(ISNUMBER(FIND(\"RES\",REFERENTES!$T$2:$T$1134)),REFERENTES!W1119,\"\")","v":""},{"$f":"REFERENTES!S1119","v":0},1114,0,1131,"X"]
[null,null,null,null,null,null,null,null,null,null,null,null,{"$f":"IF(ISNUMBER(FIND(\"RES\",REFERENTES!$T$2:$T$1134)),REFERENTES!W1120,\"\")","v":""},{"$f":"REFERENTES!S1120","v":0},1115,0,1131,"X"]
[null,null,null,null,null,null,null,null,null,null,null,null,{"$f":"IF(ISNUMBER(FIND(\"RES\",REFERENTES!$T$2:$T$1134)),REFERENTES!W1121,\"\")","v":""},{"$f":"REFERENTES!S1121","v":0},1116,0,1131,"X"]
[null,null,null,null,null,null,null,null,null,null,null,null,{"$f":"IF(ISNUMBER(FIND(\"RES\",REFERENTES!$T$2:$T$1134)),REFERENTES!W1122,\"\")","v":""},{"$f":"REFERENTES!S1122","v":0},1117,0,1131,"X"]
[null,null,null,null,null,null,null,null,null,null,null,null,{"$f":"IF(ISNUMBER(FIND(\"RES\",REFERENTES!$T$2:$T$1134)),REFERENTES!W1123,\"\")","v":""},{"$f":"REFERENTES!S1123","v":0},1118,0,1131,"X"]
[null,null,null,null,null,null,null,null,null,null,null,null,{"$f":"IF(ISNUMBER(FIND(\"RES\",REFERENTES!$T$2:$T$1134)),REFERENTES!W1124,\"\")","v":""},{"$f":"REFERENTES!S1124","v":0},1119,0,1131,"X"]
[null,null,null,null,null,null,null,null,null,null,null,null,{"$f":"IF(ISNUMBER(FIND(\"RES\",REFERENTES!$T$2:$T$1134)),REFERENTES!W1125,\"\")","v":""},{"$f":"REFERENTES!S1125","v":0},1120,0,1131,"X"]
[null,null,null,null,null,null,null,null,null,null,null,null,{"$f":"IF(ISNUMBER(FIND(\"RES\",REFERENTES!$T$2:$T$1134)),REFERENTES!W1126,\"\")","v":""},{"$f":"REFERENTES!S1126","v":0},1121,0,1131,"X"]
[null,null,null,null,null,null,null,null,null,null,null,null,{"$f":"IF(ISNUMBER(FIND(\"RES\",REFERENTES!$T$2:$T$1134)),REFERENTES!W1127,\"\")","v":""},{"$f":"REFERENTES!S1127","v":0},1122,0,1131,"X"]
[null,null,null,null,null,null,null,null,null,null,null,null,{"$f":"IF(ISNUMBER(FIND(\"RES\",REFERENTES!$T$2:$T$1134)),REFERENTES!W1128,\"\")","v":""},{"$f":"REFERENTES!S1128","v":0},1123,0,1131,"X"]
[null,null,null,null,null,null,null,null,null,null,null,null,{"$f":"IF(ISNUMBER(FIND(\"RES\",REFERENTES!$T$2:$T$1134)),REFERENTES!W1129,\"\")","v":""},{"$f":"REFERENTES!S1129","v":0},1124,0,1131,"X"]
[null,null,null,null,null,null,null,null,null,null,null,null,{"$f":"IF(ISNUMBER(FIND(\"RES\",REFERENTES!$T$2:$T$1134)),REFERENTES!W1130,\"\")","v":""},{"$f":"REFERENTES!S1130","v":0},1125,0,1131,"X"]
[null,null,null,null,null,null,null,null,null,null,null,null,{"$f":"IF(ISNUMBER(FIND(\"RES\",REFERENTES!$T$2:$T$1134)),REFERENTES!W1131,\"\")","v":""},{"$f":"REFERENTES!S1131","v":0},1126,0,1131,"X"]
[null,null,null,null,null,null,null,null,null,null,null,null,{"$f":"IF(ISNUMBER(FIND(\"RES\",REFERENTES!$T$2:$T$1134)),REFERENTES!W1132,\"\")","v":""},{"$f":"REFERENTES!S1132","v":0},1127,0,1131,"X"]
[null,null,null,null,null,null,null,null,null,null,null,null,{"$f":"IF(ISNUMBER(FIND(\"RES\",REFERENTES!$T$2:$T$1134)),REFERENTES!W1133,\"\")","v":""},{"$f":"REFERENTES!S1133","v":0},1128,0,1131,"X"]
[null,null,null,null,null,null,null,null,null,null,null,null,{"$f":"IF(ISNUMBER(FIND(\"RES\",REFERENTES!$T$2:$T$1134)),REFERENTES!W1134,\"\")","v":""},{"$f":"REFERENTES!S1134","v":0},1129,0,1131,"X"]
[null,null,null,null,null,null,null,null,null,null,null,null,{"$f":"IF(ISNUMBER(FIND(\"RES\",REFERENTES!$T$2:$T$1134)),REFERENTES!W1135,\"\")","v":""},{"$f":"REFERENTES!S1135","v":0},1130,0,1131,"X"]
[null,null,null,null,null,null,null,null,null,null,null,null,{"$f":"IF(ISNUMBER(FIND(\"RES\",REFERENTES!$T$2:$T$1134)),REFERENTES!W1136,\"\")","v":""},{"$f":"REFERENTES!S1136","v":0},null,0,1131,"X"]
[null,null,null,null,null,null,null,null,null,null,null,null,{"$f":"IF(ISNUMBER(FIND(\"RES\",REFERENTES!$T$2:$T$1134)),REFERENTES!W1137,\"\")","v":""},{"$f":"REFERENTES!S1137","v":0},null,0,1131,"X"]
[null,null,null,null,null,null,null,null,null,null,null,null,{"$f":"IF(ISNUMBER(FIND(\"RES\",REFERENTES!$T$2:$T$1134)),REFERENTES!W1138,\"\")","v":""},{"$f":"REFERENTES!S1138","v":0},null,0,1131,"X"]
[null,null,null,null,null,null,null,null,null,null,null,null,{"$f":"IF(ISNUMBER(FIND(\"RES\",REFERENTES!$T$2:$T$1134)),REFERENTES!W1139,\"\")","v":""},{"$f":"REFERENTES!S1139","v":0},null,0,1131,"X"]
[null,null,null,null,null,null,null,null,null,null,null,null,{"$f":"IF(ISNUMBER(FIND(\"RES\",REFERENTES!$T$2:$T$1134)),REFERENTES!W1140,\"\")","v":""},{"$f":"REFERENTES!S1140","v":0},null,0,1131,"X"]
[null,null,null,null,null,null,null,null,null,null,null,null,{"$f":"IF(ISNUMBER(FIND(\"RES\",REFERENTES!$T$2:$T$1134)),REFERENTES!W1141,\"\")","v":""},{"$f":"REFERENTES!S1141","v":0},null,0,1131,"X"]
[null,null,null,null,null,null,null,null,null,null,null,null,{"$f":"IF(ISNUMBER(FIND(\"RES\",REFERENTES!$T$2:$T$1134)),REFERENTES!W1142,\"\")","v":""},{"$f":"REFERENTES!S1142","v":0},null,0,1131,"X"]
[null,null,null,null,null,null,null,null,null,null,null,null,{"$f":"IF(ISNUMBER(FIND(\"RES\",REFERENTES!$T$2:$T$1134)),REFERENTES!W1143,\"\")","v":""},{"$f":"REFERENTES!S1143","v":0},null,0,1131,"X"]
[null,null,null,null,null,null,null,null,null,null,null,null,{"$f":"IF(ISNUMBER(FIND(\"RES\",REFERENTES!$T$2:$T$1134)),REFERENTES!W1144,\"\")","v":""},{"$f":"REFERENTES!S1144","v":0},null,0,1131,"X"]
[null,null,null,null,null,null,null,null,null,null,null,null,{"$f":"IF(ISNUMBER(FIND(\"RES\",REFERENTES!$T$2:$T$1134)),REFERENTES!W1145,\"\")","v":""},{"$f":"REFERENTES!S1145","v":0},null,0,1131,"X"]
[null,null,null,null,null,null,null,null,null,null,null,null,{"$f":"IF(ISNUMBER(FIND(\"RES\",REFERENTES!$T$2:$T$1134)),REFERENTES!W1146,\"\")","v":""},{"$f":"REFERENTES!S1146","v":0},null,0,1131,"X"]
[null,null,null,null,null,null,null,null,null,null,null,null,{"$f":"IF(ISNUMBER(FIND(\"RES\",REFERENTES!$T$2:$T$1134)),REFERENTES!W1147,\"\")","v":""},{"$f":"REFERENTES!S1147","v":0},null,0,1131,"X"]
[null,null,null,null,null,null,null,null,null,null,null,null,{"$f":"IF(ISNUMBER(FIND(\"RES\",REFERENTES!$T$2:$T$1134)),REFERENTES!W1148,\"\")","v":""},{"$f":"REFERENTES!S1148","v":0},null,0,1131,"X"]
[null,null,null,null,null,null,null,null,null,null,null,null,{"$f":"IF(ISNUMBER(FIND(\"RES\",REFERENTES!$T$2:$T$1134)),REFERENTES!W1149,\"\")","v":""},{"$f":"REFERENTES!S1149","v":0},null,0,1131,"X"]
[null,null,null,null,null,null,null,null,null,null,null,null,{"$f":"IF(ISNUMBER(FIND(\"RES\",REFERENTES!$T$2:$T$1134)),REFERENTES!W1150,\"\")","v":""},{"$f":"REFERENTES!S1150","v":0},null,0,1131,"X"]
[null,null,null,null,null,null,null,null,null,null,null,null,{"$f":"IF(ISNUMBER(FIND(\"RES\",REFERENTES!$T$2:$T$1134)),REFERENTES!W1151,\"\")","v":""},{"$f":"REFERENTES!S1151","v":0},null,0,1131,"X"]
[null,null,null,null,null,null,null,null,null,null,null,null,{"$f":"IF(ISNUMBER(FIND(\"RES\",REFERENTES!$T$2:$T$1134)),REFERENTES!W1152,\"\")","v":""},{"$f":"REFERENTES!S1152","v":0},null,0,1131,"X"]
[null,null,null,null,null,null,null,null,null,null,null,null,{"$f":"IF(ISNUMBER(FIND(\"RES\",REFERENTES!$T$2:$T$1134)),REFERENTES!W1153,\"\")","v":""},{"$f":"REFERENTES!S1153","v":0},null,0,1131,"X"]
[null,null,null,null,null,null,null,null,null,null,null,null,{"$f":"IF(ISNUMBER(FIND(\"RES\",REFERENTES!$T$2:$T$1134)),REFERENTES!W1154,\"\")","v":""},{"$f":"REFERENTES!S1154","v":0},null,0,1131,"X"]
[null,null,null,null,null,null,null,null,null,null,null,null,{"$f":"IF(ISNUMBER(FIND(\"RES\",REFERENTES!$T$2:$T$1134)),REFERENTES!W1155,\"\")","v":""},{"$f":"REFERENTES!S1155","v":0},null,0,1131,"X"]
[null,null,null,null,null,null,null,null,null,null,null,null,{"$f":"IF(ISNUMBER(FIND(\"RES\",REFERENTES!$T$2:$T$1134)),REFERENTES!W1156,\"\")","v":""},{"$f":"REFERENTES!S1156","v":0},null,0,1131,"X"]
[null,null,null,null,null,null,null,null,null,null,null,null,{"$f":"IF(ISNUMBER(FIND(\"RES\",REFERENTES!$T$2:$T$1134)),REFERENTES!W1157,\"\")","v":""},{"$f":"REFERENTES!S1157","v":0},null,0,1131,"X"]
[null,null,null,null,null,null,null,null,null,null,null,null,{"$f":"IF(ISNUMBER(FIND(\"RES\",REFERENTES!$T$2:$T$1134)),REFERENTES!W1158,\"\")","v":""},{"$f":"REFERENTES!S1158","v":0},null,0,1131,"X"]
[null,null,null,null,null,null,null,null,null,null,null,null,{"$f":"IF(ISNUMBER(FIND(\"RES\",REFERENTES!$T$2:$T$1134)),REFERENTES!W1159,\"\")","v":""},{"$f":"REFERENTES!S1159","v":0},null,0,{"$f":"IF(P1159=0,MAX($O$6:$O$1135)+1,O1159)","v":1131},{"$f":"IFERROR(VLOOKUP(SMALL($Q$6:$Q$1135,O1159),$O$6:$P$1135,2,FALSE),\"X\")","v":"X"}]
[null,null,null,null,null,null,null,null,null,null,null,null,{"$f":"IF(ISNUMBER(FIND(\"RES\",REFERENTES!$T$2:$T$1134)),REFERENTES!W1160,\"\")","v":""},{"$f":"REFERENTES!S1160","v":0},null,0,1131,"X"]
[null,null,null,null,null,null,null,null,null,null,null,null,{"$f":"IF(ISNUMBER(FIND(\"RES\",REFERENTES!$T$2:$T$1134)),REFERENTES!W1161,\"\")","v":""},{"$f":"REFERENTES!S1161","v":0},null,{"$f":"IF(M1161=\"\",0,M1161)","v":0},1131,"X"]
[null,null,null,null,null,null,null,null,null,null,null,null,{"$f":"IF(ISNUMBER(FIND(\"RES\",REFERENTES!$T$2:$T$1134)),REFERENTES!W1162,\"\")","v":""},{"$f":"REFERENTES!S1162","v":0},null,0,1131,"X"]
[null,null,null,null,null,null,null,null,null,null,null,null,{"$f":"IF(ISNUMBER(FIND(\"RES\",REFERENTES!$T$2:$T$1134)),REFERENTES!W1163,\"\")","v":""},{"$f":"REFERENTES!S1163","v":0},null,0,1131,"X"]
[null,null,null,null,null,null,null,null,null,null,null,null,{"$f":"IF(ISNUMBER(FIND(\"RES\",REFERENTES!$T$2:$T$1134)),REFERENTES!W1164,\"\")","v":""},{"$f":"REFERENTES!S1164","v":0},null,0,1131,"X"]
[null,null,null,null,null,null,null,null,null,null,null,null,{"$f":"IF(ISNUMBER(FIND(\"RES\",REFERENTES!$T$2:$T$1134)),REFERENTES!W1165,\"\")","v":""},{"$f":"REFERENTES!S1165","v":0},null,0,1131,"X"]
[null,null,null,null,null,null,null,null,null,null,null,null,{"$f":"IF(ISNUMBER(FIND(\"RES\",REFERENTES!$T$2:$T$1134)),REFERENTES!W1166,\"\")","v":""},{"$f":"REFERENTES!S1166","v":0},null,0,1131,"X"]
[null,null,null,null,null,null,null,null,null,null,null,null,{"$f":"IF(ISNUMBER(FIND(\"RES\",REFERENTES!$T$2:$T$1134)),REFERENTES!W1167,\"\")","v":""},{"$f":"REFERENTES!S1167","v":0},null,0,1131,"X"]
[null,null,null,null,null,null,null,null,null,null,null,null,{"$f":"IF(ISNUMBER(FIND(\"RES\",REFERENTES!$T$2:$T$1134)),REFERENTES!W1168,\"\")","v":""},{"$f":"REFERENTES!S1168","v":0},null,0,1131,"X"]
[null,null,null,null,null,null,null,null,null,null,null,null,{"$f":"IF(ISNUMBER(FIND(\"RES\",REFERENTES!$T$2:$T$1134)),REFERENTES!W1169,\"\")","v":""},{"$f":"REFERENTES!S1169","v":0},null,0,1131,"X"]
[null,null,null,null,null,null,null,null,null,null,null,null,{"$f":"IF(ISNUMBER(FIND(\"RES\",REFERENTES!$T$2:$T$1134)),REFERENTES!W1170,\"\")","v":""},{"$f":"REFERENTES!S1170","v":0},null,0,1131,"X"]
[null,null,null,null,null,null,null,null,null,null,null,null,{"$f":"IF(ISNUMBER(FIND(\"RES\",REFERENTES!$T$2:$T$1134)),REFERENTES!W1171,\"\")","v":""},{"$f":"REFERENTES!S1171","v":0},null,0,1131,"X"]
[null,null,null,null,null,null,null,null,null,null,null,null,{"$f":"IF(ISNUMBER(FIND(\"RES\",REFERENTES!$T$2:$T$1134)),REFERENTES!W1172,\"\")","v":""},{"$f":"REFERENTES!S1172","v":0},null,0,1131,"X"]
[null,null,null,null,null,null,null,null,null,null,null,null,{"$f":"IF(ISNUMBER(FIND(\"RES\",REFERENTES!$T$2:$T$1134)),REFERENTES!W1173,\"\")","v":""},{"$f":"REFERENTES!S1173","v":0},null,0,1131,"X"]
[null,null,null,null,null,null,null,null,null,null,null,null,{"$f":"IF(ISNUMBER(FIND(\"RES\",REFERENTES!$T$2:$T$1134)),REFERENTES!W1174,\"\")","v":""},{"$f":"REFERENTES!S1174","v":0},null,0,1131,"X"]
[null,null,null,null,null,null,null,null,null,null,null,null,{"$f":"IF(ISNUMBER(FIND(\"RES\",REFERENTES!$T$2:$T$1134)),REFERENTES!W1175,\"\")","v":""},{"$f":"REFERENTES!S1175","v":0},null,0,1131,"X"]
[null,null,null,null,null,null,null,null,null,null,null,null,{"$f":"IF(ISNUMBER(FIND(\"RES\",REFERENTES!$T$2:$T$1134)),REFERENTES!W1176,\"\")","v":""},{"$f":"REFERENTES!S1176","v":0},null,0,1131,"X"]
[null,null,null,null,null,null,null,null,null,null,null,null,{"$f":"IF(ISNUMBER(FIND(\"RES\",REFERENTES!$T$2:$T$1134)),REFERENTES!W1177,\"\")","v":""},{"$f":"REFERENTES!S1177","v":0},null,0,1131,"X"]
[null,null,null,null,null,null,null,null,null,null,null,null,{"$f":"IF(ISNUMBER(FIND(\"RES\",REFERENTES!$T$2:$T$1134)),REFERENTES!W1178,\"\")","v":""},{"$f":"REFERENTES!S1178","v":0},null,0,1131,"X"]
[null,null,null,null,null,null,null,null,null,null,null,null,{"$f":"IF(ISNUMBER(FIND(\"RES\",REFERENTES!$T$2:$T$1134)),REFERENTES!W1179,\"\")","v":""},{"$f":"REFERENTES!S1179","v":0},null,0,1131,"X"]
[null,null,null,null,null,null,null,null,null,null,null,null,{"$f":"IF(ISNUMBER(FIND(\"RES\",REFERENTES!$T$2:$T$1134)),REFERENTES!W1180,\"\")","v":""},{"$f":"REFERENTES!S1180","v":0},null,0,1131,"X"]
[null,null,null,null,null,null,null,null,null,null,null,null,{"$f":"IF(ISNUMBER(FIND(\"RES\",REFERENTES!$T$2:$T$1134)),REFERENTES!W1181,\"\")","v":""},{"$f":"REFERENTES!S1181","v":0},null,0,1131,"X"]
[null,null,null,null,null,null,null,null,null,null,null,null,{"$f":"IF(ISNUMBER(FIND(\"RES\",REFERENTES!$T$2:$T$1134)),REFERENTES!W1182,\"\")","v":""},{"$f":"REFERENTES!S1182","v":0},null,0,1131,"X"]
[null,null,null,null,null,null,null,null,null,null,null,null,{"$f":"IF(ISNUMBER(FIND(\"RES\",REFERENTES!$T$2:$T$1134)),REFERENTES!W1183,\"\")","v":""},{"$f":"REFERENTES!S1183","v":0},null,0,1131,"X"]
[null,null,null,null,null,null,null,null,null,null,null,null,{"$f":"IF(ISNUMBER(FIND(\"RES\",REFERENTES!$T$2:$T$1134)),REFERENTES!W1184,\"\")","v":""},{"$f":"REFERENTES!S1184","v":0},null,0,1131,"X"]
[null,null,null,null,null,null,null,null,null,null,null,null,{"$f":"IF(ISNUMBER(FIND(\"RES\",REFERENTES!$T$2:$T$1134)),REFERENTES!W1185,\"\")","v":""},{"$f":"REFERENTES!S1185","v":0},null,0,1131,"X"]
[null,null,null,null,null,null,null,null,null,null,null,null,{"$f":"IF(ISNUMBER(FIND(\"RES\",REFERENTES!$T$2:$T$1134)),REFERENTES!W1186,\"\")","v":""},{"$f":"REFERENTES!S1186","v":0},null,0,1131,"X"]
[null,null,null,null,null,null,null,null,null,null,null,null,{"$f":"IF(ISNUMBER(FIND(\"RES\",REFERENTES!$T$2:$T$1134)),REFERENTES!W1187,\"\")","v":""},{"$f":"REFERENTES!S1187","v":0},null,0,1131,"X"]
[null,null,null,null,null,null,null,null,null,null,null,null,{"$f":"IF(ISNUMBER(FIND(\"RES\",REFERENTES!$T$2:$T$1134)),REFERENTES!W1188,\"\")","v":""},{"$f":"REFERENTES!S1188","v":0},null,0,1131,"X"]
[null,null,null,null,null,null,null,null,null,null,null,null,{"$f":"IF(ISNUMBER(FIND(\"RES\",REFERENTES!$T$2:$T$1134)),REFERENTES!W1189,\"\")","v":""},{"$f":"REFERENTES!S1189","v":0},null,0,1131,"X"]
[null,null,null,null,null,null,null,null,null,null,null,null,{"$f":"IF(ISNUMBER(FIND(\"RES\",REFERENTES!$T$2:$T$1134)),REFERENTES!W1190,\"\")","v":""},{"$f":"REFERENTES!S1190","v":0},null,0,1131,"X"]
[null,null,null,null,null,null,null,null,null,null,null,null,{"$f":"IF(ISNUMBER(FIND(\"RES\",REFERENTES!$T$2:$T$1134)),REFERENTES!W1191,\"\")","v":""},{"$f":"REFERENTES!S1191","v":0},null,0,1131,"X"]
[null,null,null,null,null,null,null,null,null,null,null,null,{"$f":"IF(ISNUMBER(FIND(\"RES\",REFERENTES!$T$2:$T$1134)),REFERENTES!W1192,\"\")","v":""},{"$f":"REFERENTES!S1192","v":0},null,0,1131,"X"]
[null,null,null,null,null,null,null,null,null,null,null,null,{"$f":"IF(ISNUMBER(FIND(\"RES\",REFERENTES!$T$2:$T$1134)),REFERENTES!W1193,\"\")","v":""},{"$f":"REFERENTES!S1193","v":0},null,0,1131,"X"]
[null,null,null,null,null,null,null,null,null,null,null,null,{"$f":"IF(ISNUMBER(FIND(\"RES\",REFERENTES!$T$2:$T$1134)),REFERENTES!W1194,\"\")","v":""},{"$f":"REFERENTES!S1194","v":0},null,0,1131,"X"]
[null,null,null,null,null,null,null,null,null,null,null,null,{"$f":"IF(ISNUMBER(FIND(\"RES\",REFERENTES!$T$2:$T$1134)),REFERENTES!W1195,\"\")","v":""},{"$f":"REFERENTES!S1195","v":0},null,0,1131,"X"]
[null,null,null,null,null,null,null,null,null,null,null,null,{"$f":"IF(ISNUMBER(FIND(\"RES\",REFERENTES!$T$2:$T$1134)),REFERENTES!W1196,\"\")","v":""},{"$f":"REFERENTES!S1196","v":0},null,0,1131,"X"]
[null,null,null,null,null,null,null,null,null,null,null,null,{"$f":"IF(ISNUMBER(FIND(\"RES\",REFERENTES!$T$2:$T$1134)),REFERENTES!W1197,\"\")","v":""},{"$f":"REFERENTES!S1197","v":0},null,0,1131,"X"]
[null,null,null,null,null,null,null,null,null,null,null,null,{"$f":"IF(ISNUMBER(FIND(\"RES\",REFERENTES!$T$2:$T$1134)),REFERENTES!W1198,\"\")","v":""},{"$f":"REFERENTES!S1198","v":0},null,0,1131,"X"]
[null,null,null,null,null,null,null,null,null,null,null,null,{"$f":"IF(ISNUMBER(FIND(\"RES\",REFERENTES!$T$2:$T$1134)),REFERENTES!W1199,\"\")","v":""},{"$f":"REFERENTES!S1199","v":0},null,0,1131,"X"]
[null,null,null,null,null,null,null,null,null,null,null,null,{"$f":"IF(ISNUMBER(FIND(\"RES\",REFERENTES!$T$2:$T$1134)),REFERENTES!W1200,\"\")","v":""},{"$f":"REFERENTES!S1200","v":0},null,0,1131,"X"]
[null,null,null,null,null,null,null,null,null,null,null,null,{"$f":"IF(ISNUMBER(FIND(\"RES\",REFERENTES!$T$2:$T$1134)),REFERENTES!W1201,\"\")","v":""},{"$f":"REFERENTES!S1201","v":0},null,0,1131,"X"]
[null,null,null,null,null,null,null,null,null,null,null,null,{"$f":"IF(ISNUMBER(FIND(\"RES\",REFERENTES!$T$2:$T$1134)),REFERENTES!W1202,\"\")","v":""},{"$f":"REFERENTES!S1202","v":0},null,0,1131,"X"]
[null,null,null,null,null,null,null,null,null,null,null,null,{"$f":"IF(ISNUMBER(FIND(\"RES\",REFERENTES!$T$2:$T$1134)),REFERENTES!W1203,\"\")","v":""},{"$f":"REFERENTES!S1203","v":0},null,0,1131,"X"]
[null,null,null,null,null,null,null,null,null,null,null,null,{"$f":"IF(ISNUMBER(FIND(\"RES\",REFERENTES!$T$2:$T$1134)),REFERENTES!W1204,\"\")","v":""},{"$f":"REFERENTES!S1204","v":0},null,0,1131,"X"]
[null,null,null,null,null,null,null,null,null,null,null,null,{"$f":"IF(ISNUMBER(FIND(\"RES\",REFERENTES!$T$2:$T$1134)),REFERENTES!W1205,\"\")","v":""},{"$f":"REFERENTES!S1205","v":0},null,0,1131,"X"]
[null,null,null,null,null,null,null,null,null,null,null,null,{"$f":"IF(ISNUMBER(FIND(\"RES\",REFERENTES!$T$2:$T$1134)),REFERENTES!W1206,\"\")","v":""},{"$f":"REFERENTES!S1206","v":0},null,0,1131,"X"]
[null,null,null,null,null,null,null,null,null,null,null,null,{"$f":"IF(ISNUMBER(FIND(\"RES\",REFERENTES!$T$2:$T$1134)),REFERENTES!W1207,\"\")","v":""},{"$f":"REFERENTES!S1207","v":0},null,0,1131,"X"]
[null,null,null,null,null,null,null,null,null,null,null,null,{"$f":"IF(ISNUMBER(FIND(\"RES\",REFERENTES!$T$2:$T$1134)),REFERENTES!W1208,\"\")","v":""},{"$f":"REFERENTES!S1208","v":0},null,0,1131,"X"]
[null,null,null,null,null,null,null,null,null,null,null,null,{"$f":"IF(ISNUMBER(FIND(\"RES\",REFERENTES!$T$2:$T$1134)),REFERENTES!W1209,\"\")","v":""},{"$f":"REFERENTES!S1209","v":0},null,0,1131,"X"]
[null,null,null,null,null,null,null,null,null,null,null,null,{"$f":"IF(ISNUMBER(FIND(\"RES\",REFERENTES!$T$2:$T$1134)),REFERENTES!W1210,\"\")","v":""},{"$f":"REFERENTES!S1210","v":0},null,0,1131,"X"]
[null,null,null,null,null,null,null,null,null,null,null,null,{"$f":"IF(ISNUMBER(FIND(\"RES\",REFERENTES!$T$2:$T$1134)),REFERENTES!W1211,\"\")","v":""},{"$f":"REFERENTES!S1211","v":0},null,0,1131,"X"]
[null,null,null,null,null,null,null,null,null,null,null,null,{"$f":"IF(ISNUMBER(FIND(\"RES\",REFERENTES!$T$2:$T$1134)),REFERENTES!W1212,\"\")","v":""},{"$f":"REFERENTES!S1212","v":0},null,0,1131,"X"]
[null,null,null,null,null,null,null,null,null,null,null,null,{"$f":"IF(ISNUMBER(FIND(\"RES\",REFERENTES!$T$2:$T$1134)),REFERENTES!W1213,\"\")","v":""},{"$f":"REFERENTES!S1213","v":0},null,0,1131,"X"]
[null,null,null,null,null,null,null,null,null,null,null,null,{"$f":"IF(ISNUMBER(FIND(\"RES\",REFERENTES!$T$2:$T$1134)),REFERENTES!W1214,\"\")","v":""},{"$f":"REFERENTES!S1214","v":0},null,0,1131,"X"]
[null,null,null,null,null,null,null,null,null,null,null,null,{"$f":"IF(ISNUMBER(FIND(\"RES\",REFERENTES!$T$2:$T$1134)),REFERENTES!W1215,\"\")","v":""},{"$f":"REFERENTES!S1215","v":0},null,0,1131,"X"]
[null,null,null,null,null,null,null,null,null,null,null,null,{"$f":"IF(ISNUMBER(FIND(\"RES\",REFERENTES!$T$2:$T$1134)),REFERENTES!W1216,\"\")","v":""},{"$f":"REFERENTES!S1216","v":0},null,0,1131,"X"]
[null,null,null,null,null,null,null,null,null,null,null,null,{"$f":"IF(ISNUMBER(FIND(\"RES\",REFERENTES!$T$2:$T$1134)),REFERENTES!W1217,\"\")","v":""},{"$f":"REFERENTES!S1217","v":0},null,0,1131,"X"]
[null,null,null,null,null,null,null,null,null,null,null,null,{"$f":"IF(ISNUMBER(FIND(\"RES\",REFERENTES!$T$2:$T$1134)),REFERENTES!W1218,\"\")","v":""},{"$f":"REFERENTES!S1218","v":0},null,0,1131,"X"]
[null,null,null,null,null,null,null,null,null,null,null,null,{"$f":"IF(ISNUMBER(FIND(\"RES\",REFERENTES!$T$2:$T$1134)),REFERENTES!W1219,\"\")","v":""},{"$f":"REFERENTES!S1219","v":0},null,0,1131,"X"]
[null,null,null,null,null,null,null,null,null,null,null,null,{"$f":"IF(ISNUMBER(FIND(\"RES\",REFERENTES!$T$2:$T$1134)),REFERENTES!W1220,\"\")","v":""},{"$f":"REFERENTES!S1220","v":0},null,0,1131,"X"]
[null,null,null,null,null,null,null,null,null,null,null,null,{"$f":"IF(ISNUMBER(FIND(\"RES\",REFERENTES!$T$2:$T$1134)),REFERENTES!W1221,\"\")","v":""},{"$f":"REFERENTES!S1221","v":0},null,0,1131,"X"]
[null,null,null,null,null,null,null,null,null,null,null,null,{"$f":"IF(ISNUMBER(FIND(\"RES\",REFERENTES!$T$2:$T$1134)),REFERENTES!W1222,\"\")","v":""},{"$f":"REFERENTES!S1222","v":0},null,0,1131,"X"]
[null,null,null,null,null,null,null,null,null,null,null,null,{"$f":"IF(ISNUMBER(FIND(\"RES\",REFERENTES!$T$2:$T$1134)),REFERENTES!W1223,\"\")","v":""},{"$f":"REFERENTES!S1223","v":0},null,0,{"$f":"IF(P1223=0,MAX($O$6:$O$1135)+1,O1223)","v":1131},{"$f":"IFERROR(VLOOKUP(SMALL($Q$6:$Q$1135,O1223),$O$6:$P$1135,2,FALSE),\"X\")","v":"X"}]
[null,null,null,null,null,null,null,null,null,null,null,null,{"$f":"IF(ISNUMBER(FIND(\"RES\",REFERENTES!$T$2:$T$1134)),REFERENTES!W1224,\"\")","v":""},{"$f":"REFERENTES!S1224","v":0},null,0,1131,"X"]
[null,null,null,null,null,null,null,null,null,null,null,null,{"$f":"IF(ISNUMBER(FIND(\"RES\",REFERENTES!$T$2:$T$1134)),REFERENTES!W1225,\"\")","v":""},{"$f":"REFERENTES!S1225","v":0},null,{"$f":"IF(M1225=\"\",0,M1225)","v":0},1131,"X"]
[null,null,null,null,null,null,null,null,null,null,null,null,{"$f":"IF(ISNUMBER(FIND(\"RES\",REFERENTES!$T$2:$T$1134)),REFERENTES!W1226,\"\")","v":""},{"$f":"REFERENTES!S1226","v":0},null,0,1131,"X"]
[null,null,null,null,null,null,null,null,null,null,null,null,{"$f":"IF(ISNUMBER(FIND(\"RES\",REFERENTES!$T$2:$T$1134)),REFERENTES!W1227,\"\")","v":""},{"$f":"REFERENTES!S1227","v":0},null,0,1131,"X"]
[null,null,null,null,null,null,null,null,null,null,null,null,{"$f":"IF(ISNUMBER(FIND(\"RES\",REFERENTES!$T$2:$T$1134)),REFERENTES!W1228,\"\")","v":""},{"$f":"REFERENTES!S1228","v":0},null,0,1131,"X"]
[null,null,null,null,null,null,null,null,null,null,null,null,{"$f":"IF(ISNUMBER(FIND(\"RES\",REFERENTES!$T$2:$T$1134)),REFERENTES!W1229,\"\")","v":""},{"$f":"REFERENTES!S1229","v":0},null,0,1131,"X"]
[null,null,null,null,null,null,null,null,null,null,null,null,{"$f":"IF(ISNUMBER(FIND(\"RES\",REFERENTES!$T$2:$T$1134)),REFERENTES!W1230,\"\")","v":""},{"$f":"REFERENTES!S1230","v":0},null,0,1131,"X"]