{"text_format":"1","workbook":"xlsx","n_sheets":6,"sheets":["configuracion","Registro de cambios","DIGITADOR","DATOS","REFERENTES","OTRAS REFERENTES"],"not_rendered":{"charts":0,"images":0,"macros":1,"external_links":1,"defined_names":20,"comments":0,"pivot_tables":0},"unopened":[],"bounds":{"document_bytes":16777216,"sheet_cells":100000,"rows_first":2000,"rows_last":500,"rows_between":2000,"halvings":0,"cell_chars":16384,"cell_head_chars":4096},"cells_cut":0,"cells_raw":0,"read":"row_number_cap","date_system":"1900"}

{"sheet":"configuracion","index":0,"n_rows":70,"n_cols":11,"rows_kept":70,"cut":false,"hidden":true,"merged":[[65,0,65,1],[60,0,60,1],[28,0,35,0],[37,0,42,0],[45,0,45,1],[0,0,2,0],[3,0,5,0],[7,0,8,0],[9,0,15,0],[17,0,21,0],[23,0,26,0]]}
["general","urlServicio","https://argos.invemar.org.co/api/"]
[null,"fila de inicio",3]
[null,"fila de fin",153]
["metodologias","Metodologias",862]
[null,"Referentes",862]
[null,"Cantidad maxima de referentes ",200]
["estaciones/investigadores","proyectos",2239]
["Lista especies","metodologias",3]
[null,"proyectos",2239]
["MUESTREOS","ID_MUESTREO","DATOS,B"]
{"$rows_left_out":61}
{"sheet":"Registro de cambios","index":1,"n_rows":12,"n_cols":6,"rows_kept":12,"cut":false,"hidden":true,"merged":[[1,3,1,5]]}
[]
[null,null,null,"REGISTRO DE CAMBIOS"]
[null,null,null,"VERSIÓN No.","CAMBIO REALIZADO","VIGENTE DESDE"]
[null,null,null,"20240514i","1) Se actualizo el servicio para que consuma la nueva API.                                                                               2)Se tuvo que organizar en cada  lista el origen de los datos en la hoja DATOS.                                                    3) Se organizo la hoja REFERENTES","2024-05-14"]
[null,null,null,"20230316i","1)Se agrego un nuevo boton \"Ordenar \" en la hoja DATOS para ordenar los datos y no generar ID_MUESTREO distintos.                                                                                               2) Se modifico la regla para generar el ID_MUESTREO, antes se tenia en cuenta la fecha del monitoreo , ahora se tiene en cuenta es el ID_PARCELA del monitoreo.                                                                                                           3)Se agrego un nuevo boton \"Validar Datos\" en la hoja DIGITADOR , para asi validar que ningun campo quede vacio antes de cargar los datos.","2023-03-16"]
[null,null,null,"20220927i","Se modifico la formula de subparcelas muestreadas que se encuentra en la hoja Digitador.\n \n","2022-09-27"]
[null,null,null,"20220804i","Se modifico algunos campos para que fueran obligatorios y algunos campos id se les coloco lista desplegable para generar el nombre automatico","2022-08-04"]
[null,null,null,"20220510i","Actualizacion del listado de parcelas y estaciones","2022-05-10"]
[null,null,null,"20220502i","se ordenaron los referentes de geograficos, se mapeo el proyecto financiador, por defecto todas las plantillas de sigma guardan sus datos al 2239","2022-05-02"]
[null,null,null,"20220204i","cambio en el endpoint de newreferentes devsiam->argos","2022-02-04"]
{"$rows_left_out":3}
{"sheet":"DIGITADOR","index":2,"n_rows":40,"n_cols":4,"rows_kept":40,"cut":false,"hidden":false,"merged":[[26,0,26,1],[0,3,5,9],[6,3,8,9],[9,3,13,9],[14,3,16,9],[5,0,6,0],[0,0,0,1],[16,0,16,1]]}
["Recolección de Datos Restauración SIGMA",null,null,"Recomendaciones generales: \n¡Precaución! No inserte Filas o Columnas.\nEn los casos en que falte un valor a ingresar que provenga de la hoja de referencias, informe para que el administrador del sistema haga las adiciones necesarias.\nEsta es una plantilla programada. Las columnas de color oscuro se llenan automaticamente, principalmente a partir de los contenidos de la hoja de referencias. \nNO UTILICE PUNTO Y COMA (;) en ningun campo, por ser el separador de variables (columnas). Tampoco escriba las unidades de medida, no son necesarias.\nPara el correcto funcionamiento de la hoja debe estar activa la opcion de Excel de ejecutar macros (al abrir la hoja acepte la opcion habilitar macros, mensaje de Excel que aparece en la parte superior de la hoja en un recuadro amarillo). La extensión del archivo debe ser .xlsm\nSe recomienda renombrar el archivo de la siguiente manera: SIGMA_Regeneracion_NombreEstacion_FechaMonitoreo.xlsm"]
["CODIGO DIGITADOR",{"$f":"IF(B3=\"\",\"\",INDEX(REFERENTES!$V$2:$W$60,MATCH(DIGITADOR!B3,REFERENTES!$W$2:$W$60,0),1))","v":""}]
["NOMBRE DIGITADOR"]
["ENTIDAD"]
["PLANTILLA",{"$f":"'Registro de cambios'!$D4","v":"20240514i"}]
["Fecha en la que ingresa los datos en esta hoja","DD/MM/AAAA"]
[null,"3000-01-01",null,"Previamente a iniciar el llenado de la plantilla, debe presionar el botón \"Descargar Referentes\" para que los referentes de ésta plantilla sean actualizados. \nLuego de llenar completamente la plantilla verifique que:\na. No haya celdas con valores como \"#N/A\" o \"#¡REF!\"\nb. No se esten aplicando filtros en la hoja de datos                                                                                                                                                                                          c.Una vez diligenciados los datos, en la hoja datos presionar el boton \"Ordenar\" esto con el fin para ordenar las fechas y no generar ID_MUESTREOS diferentes.                                                                                                                                                                                                                                      d.Luego presionar el botón \"Validar datos\" para corroborar que todo esté en orden.                                                                                                                            e.En caso de error de campos vacios corregir."]
[]
["Nombre del proyecto"]
["Codigo del proyecto",{"$f":"IF($B$9=\"\",\"\",INDEX('OTRAS REFERENTES'!$D$7:$F$18,MATCH(DIGITADOR!$B$9,'OTRAS REFERENTES'!$E$7:$E$18,0),1))","v":""},null,"Si requiere ayuda contacte a:\nadministrador.sigma@invemar.org.co  - Administrador SIGMA"]
{"$rows_left_out":31}
{"sheet":"DATOS","index":3,"n_rows":152,"n_cols":28,"rows_kept":152,"cut":false,"hidden":false,"merged":[[0,5,1,5],[0,12,1,12],[0,13,1,13],[0,1,1,1],[0,2,1,2],[0,3,1,3],[0,4,1,4],[0,6,1,6],[0,7,1,7],[0,8,1,8],[0,9,0,10],[0,23,1,23],[0,11,1,11],[0,14,1,14],[0,19,1,19],[0,22,1,22],[0,15,0,16],[0,17,0,18],[0,20,0,21]],"read":"row_number_cap"}
[{"$f":"DIGITADOR!B7+H3","v":"3000-01-01"},"ID_MUESTREO (AGD_MUESTREO)","CONSECUTIVO","ID_MUESTRA","CONSECUTIVO DATE_PARCELA","CODMUESTREO","FECHA\n(DD/MM/AAAA)","HORA\n(HH:MM)","DATE","Parcela",null,"AREA_PARCELA (m2)","SUBPARCELA MUESTREADA","AREA SUBPARCELA (m2)","ID_PLANTULA","ESPECIE",null,"ESTADO",null,"ALTURA (cm) ","CAT_ALTURA (cm)",null,"DIAMETRO (cm) (OPCIONAL)","OBSERVACIONES (OPCIONAL)"]
[{"$f":"TEXT(A1,\"yyyymmddhhmm\")","v":"300001010000"},null,null,null,null,null,"DIA","HORA",null,"NOMBRE","ID",null,null,null,null,"NOMBRE","ID","NOMBRE","ID",null,"NOMBRE","ID"]
[1,{"$f":"IF(K3<>\"\", F3,\"\")","v":""},1,{"$f":"IF(G3=\"\",\"\",CONCATENATE(C3,F3))","v":""},{"$f":"CONCATENATE(I3,K3)","v":""},{"$f":"IF(K3<>\"\",CONCATENATE(DIGITADOR!$B$2,$A$2,DIGITADOR!$M$1,A3),\"\")","v":""},null,null,{"$f":"IF(G3<>\"\",G3+H3,\"\")","v":""},null,{"$f":"IF(J3=\"\",\"\",INDEX('OTRAS REFERENTES'!$AB:$AC,MATCH(J3,'OTRAS REFERENTES'!$AB:$AB,0),2))","v":""},null,null,null,null,{"$f":"IF(Q3=\"\",\"\",INDEX(REFERENTES!$G:$H,MATCH(Q3,REFERENTES!$H:$H,0),1))","v":""},null,null,{"$f":"IF(R3=\"\",\"\",INDEX('OTRAS REFERENTES'!$AI:$AJ,MATCH(R3,'OTRAS REFERENTES'!$AJ:$AJ,0),1))","v":""},null,{"$f":"IF(T3=\"\",\"\",IF(AND(T3>=0,T3<=50),\"De 0 cm a 50 cm\",IF(AND(T3>50,T3<=150),\"De 50 cm a 150 cm\",\"Mayor a 150 cm\")))","v":""},{"$f":"IF(T3=\"\",LEFT(U3,1),IF(T3=\"\",\"\",IF(AND(T3>=0,T3<=50),\"A\",IF(AND(T3>50,T3<=150),\"B\",\"C\"))))","v":""},null,null,null,null,{"$f":"IF(SUMPRODUCT(--EXACT(J3&M3,$AA$2:AA2)),\"\",J3&M3)","v":""},{"$f":"IF(SUMPRODUCT(--EXACT(J3&M3,$AB$2:AB2)),\"\",1)","v":""}]
[{"$f":"IF(E4=E3,A3,A3+1)","v":1},{"$f":"IF(F4<>F3, F4,\"\")","v":""},2,"",{"$f":"CONCATENATE(I4,K4)","v":""},{"$f":"IF(K4<>\"\",CONCATENATE(DIGITADOR!$B$2,$A$2,DIGITADOR!$M$1,A4),\"\")","v":""},null,null,"",null,{"$f":"IF(J4=\"\",\"\",INDEX('OTRAS REFERENTES'!$AB:$AC,MATCH(J4,'OTRAS REFERENTES'!$AB:$AB,0),2))","v":""},null,null,null,null,{"$f":"IF(Q4=\"\",\"\",INDEX(REFERENTES!$G:$H,MATCH(Q4,REFERENTES!$H:$H,0),1))","v":""},null,null,{"$f":"IF(R4=\"\",\"\",INDEX('OTRAS REFERENTES'!$AI:$AJ,MATCH(R4,'OTRAS REFERENTES'!$AJ:$AJ,0),1))","v":""},null,"","",null,null,null,null,{"$f":"IF(SUMPRODUCT(--EXACT(J4&M4,$AA$2:AA3)),\"\",J4&M4)","v":""},{"$f":"IF(SUMPRODUCT(--EXACT(J4&M4,$AA$2:AA3)),\"\",MAX($AB$3:AB3)+1)","v":""}]
[1,{"$f":"IF(F5<>F4, F5,\"\")","v":""},3,"","",{"$f":"IF(K5<>\"\",CONCATENATE(DIGITADOR!$B$2,$A$2,DIGITADOR!$M$1,A5),\"\")","v":""},null,null,"",null,{"$f":"IF(J5=\"\",\"\",INDEX('OTRAS REFERENTES'!$AB:$AC,MATCH(J5,'OTRAS REFERENTES'!$AB:$AB,0),2))","v":""},null,null,null,null,{"$f":"IF(Q5=\"\",\"\",INDEX(REFERENTES!$G:$H,MATCH(Q5,REFERENTES!$H:$H,0),1))","v":""},null,null,{"$f":"IF(R5=\"\",\"\",INDEX('OTRAS REFERENTES'!$AI:$AJ,MATCH(R5,'OTRAS REFERENTES'!$AJ:$AJ,0),1))","v":""},null,"","",null,null,null,null,{"$f":"IF(SUMPRODUCT(--EXACT(J5&M5,$AA$2:AA4)),\"\",J5&M5)","v":""},{"$f":"IF(SUMPRODUCT(--EXACT(J5&M5,$AA$2:AA4)),\"\",MAX($AB$3:AB4)+1)","v":""}]
[1,"",4,"","",{"$f":"IF(K6<>\"\",CONCATENATE(DIGITADOR!$B$2,$A$2,DIGITADOR!$M$1,A6),\"\")","v":""},null,null,"",null,{"$f":"IF(J6=\"\",\"\",INDEX('OTRAS REFERENTES'!$AB:$AC,MATCH(J6,'OTRAS REFERENTES'!$AB:$AB,0),2))","v":""},null,null,null,null,{"$f":"IF(Q6=\"\",\"\",INDEX(REFERENTES!$G:$H,MATCH(Q6,REFERENTES!$H:$H,0),1))","v":""},null,null,{"$f":"IF(R6=\"\",\"\",INDEX('OTRAS REFERENTES'!$AI:$AJ,MATCH(R6,'OTRAS REFERENTES'!$AJ:$AJ,0),1))","v":""},null,"","",null,null,null,null,{"$f":"IF(SUMPRODUCT(--EXACT(J6&M6,$AA$2:AA5)),\"\",J6&M6)","v":""},{"$f":"IF(SUMPRODUCT(--EXACT(J6&M6,$AA$2:AA5)),\"\",MAX($AB$3:AB5)+1)","v":""}]
[1,"",5,"","",{"$f":"IF(K7<>\"\",CONCATENATE(DIGITADOR!$B$2,$A$2,DIGITADOR!$M$1,A7),\"\")","v":""},null,null,"",null,{"$f":"IF(J7=\"\",\"\",INDEX('OTRAS REFERENTES'!$AB:$AC,MATCH(J7,'OTRAS REFERENTES'!$AB:$AB,0),2))","v":""},null,null,null,null,{"$f":"IF(Q7=\"\",\"\",INDEX(REFERENTES!$G:$H,MATCH(Q7,REFERENTES!$H:$H,0),1))","v":""},null,null,{"$f":"IF(R7=\"\",\"\",INDEX('OTRAS REFERENTES'!$AI:$AJ,MATCH(R7,'OTRAS REFERENTES'!$AJ:$AJ,0),1))","v":""},null,"","",null,null,null,null,{"$f":"IF(SUMPRODUCT(--EXACT(J7&M7,$AA$2:AA6)),\"\",J7&M7)","v":""},{"$f":"IF(SUMPRODUCT(--EXACT(J7&M7,$AA$2:AA6)),\"\",MAX($AB$3:AB6)+1)","v":""}]
[1,{"$f":"IF(F8<>F7, F8,\"\")","v":""},6,"","",{"$f":"IF(K8<>\"\",CONCATENATE(DIGITADOR!$B$2,$A$2,DIGITADOR!$M$1,A8),\"\")","v":""},null,null,"",null,{"$f":"IF(J8=\"\",\"\",INDEX('OTRAS REFERENTES'!$AB:$AC,MATCH(J8,'OTRAS REFERENTES'!$AB:$AB,0),2))","v":""},null,null,null,null,{"$f":"IF(Q8=\"\",\"\",INDEX(REFERENTES!$G:$H,MATCH(Q8,REFERENTES!$H:$H,0),1))","v":""},null,null,{"$f":"IF(R8=\"\",\"\",INDEX('OTRAS REFERENTES'!$AI:$AJ,MATCH(R8,'OTRAS REFERENTES'!$AJ:$AJ,0),1))","v":""},null,"","",null,null,null,null,{"$f":"IF(SUMPRODUCT(--EXACT(J8&M8,$AA$2:AA7)),\"\",J8&M8)","v":""},{"$f":"IF(SUMPRODUCT(--EXACT(J8&M8,$AA$2:AA7)),\"\",MAX($AB$3:AB7)+1)","v":""}]
[1,"",7,"","",{"$f":"IF(K9<>\"\",CONCATENATE(DIGITADOR!$B$2,$A$2,DIGITADOR!$M$1,A9),\"\")","v":""},null,null,"",null,{"$f":"IF(J9=\"\",\"\",INDEX('OTRAS REFERENTES'!$AB:$AC,MATCH(J9,'OTRAS REFERENTES'!$AB:$AB,0),2))","v":""},null,null,null,null,{"$f":"IF(Q9=\"\",\"\",INDEX(REFERENTES!$G:$H,MATCH(Q9,REFERENTES!$H:$H,0),1))","v":""},null,null,{"$f":"IF(R9=\"\",\"\",INDEX('OTRAS REFERENTES'!$AI:$AJ,MATCH(R9,'OTRAS REFERENTES'!$AJ:$AJ,0),1))","v":""},null,"","",null,null,null,null,{"$f":"IF(SUMPRODUCT(--EXACT(J9&M9,$AA$2:AA8)),\"\",J9&M9)","v":""},{"$f":"IF(SUMPRODUCT(--EXACT(J9&M9,$AA$2:AA8)),\"\",MAX($AB$3:AB8)+1)","v":""}]
[1,"",8,"","",{"$f":"IF(K10<>\"\",CONCATENATE(DIGITADOR!$B$2,$A$2,DIGITADOR!$M$1,A10),\"\")","v":""},null,null,"",null,{"$f":"IF(J10=\"\",\"\",INDEX('OTRAS REFERENTES'!$AB:$AC,MATCH(J10,'OTRAS REFERENTES'!$AB:$AB,0),2))","v":""},null,null,null,null,{"$f":"IF(Q10=\"\",\"\",INDEX(REFERENTES!$G:$H,MATCH(Q10,REFERENTES!$H:$H,0),1))","v":""},null,null,{"$f":"IF(R10=\"\",\"\",INDEX('OTRAS REFERENTES'!$AI:$AJ,MATCH(R10,'OTRAS REFERENTES'!$AJ:$AJ,0),1))","v":""},null,"","",null,null,null,null,{"$f":"IF(SUMPRODUCT(--EXACT(J10&M10,$AA$2:AA9)),\"\",J10&M10)","v":""},{"$f":"IF(SUMPRODUCT(--EXACT(J10&M10,$AA$2:AA9)),\"\",MAX($AB$3:AB9)+1)","v":""}]
{"$rows_left_out":143}
{"sheet":"REFERENTES","index":4,"n_rows":299,"n_cols":30,"rows_kept":299,"cut":false,"hidden":false,"merged":[]}
["AG_ESPECIES",null,null,"AG_LOV",null,null,"descripcion","cod_letras"]
["AB","Avicennia bicolor",null,1,"Propágulo",null,"Avicennia bicolor","AB","2040.55.687",null,null,null,"VERBENACEAE",null,null,null,"Agrosoledad","CSISPIE-ZR1-Agrosole-1",48733,2414,null,3546,"Administrador SIGMA"]
["CE","Conocarpus erectus",null,2,"Plántula",null,"Avicennia germinans","AG","2040.55.685",null,null,null,"VERBENACEAE",null,null,null,"Aguas Negras -1","SFFOCC-SZ1-ANE-1",45924,2154,"Parcela 1 monitoreada por el INVEMAR en el marco del ¨Monitoreo de las condiciones ambientales y los cambios estructurales y funcionales de las comunidades vegetales y de los recursos pesqueros durante la rehabilitación de la Ciénaga Grande de Santa Marta¨",8902,"Alejandra Robles Sanchez",null,null,null,null,null,"AD Pto. Moin C.R.","Administración Desarrollo Complejo Portuario  Limón Moin Costa Rica"]
["LR","Laguncularia racemosa",null,null,null,null,"Conocarpus erectus","CE","2040.55.293",null,null,null,"VERBENACEAE",null,null,null,"Aguas Negras -2","SFFOCC-SZ1-ANE-2",45926,2155,"Parcela 2 monitoreada por el INVEMAR en el marco del ¨Monitoreo de las condiciones ambientales y los cambios estructurales y funcionales de las comunidades vegetales y de los recursos pesqueros durante la rehabilitación de la Ciénaga Grande de Santa Marta¨",7381,"Alejandro Paz",null,null,null,null,null,"ANADARKO","Anadarko Colombia Company"]
["MM","Mora oleifera ",null,null,null,null,"Eugenia Acapulcensis","EA","2040.55.1534",null,"ROSOPSIDA","MYRTALES","MYRTACEAE","EUGENIA",null,null,"Aguas Negras -3","SFFOCC-SZ1-ANE-3",45928,2156,"Parcela 3 monitoreada por el INVEMAR en el marco del ¨Monitoreo de las condiciones ambientales y los cambios estructurales y funcionales de las comunidades vegetales y de los recursos pesqueros durante la rehabilitación de la Ciénaga Grande de Santa Marta¨",3444,"Alexandra Rodríguez",null,null,null,null,null,"AQUABIOSFERA","Aquabiosfera SAS"]
["PR","Pelliciera rhizophorae",null,null,null,null,"Ficus","FS","2040.46.20406",null,"ROSOPSIDA","ROSALES","MORACEAE","FICUS",null,null,"Angostura","BCISEST-ZUS1-angostura-1",45589,2124,"esta parcela se encuentra ubicada en el sector de caño grande en la zona de uso sostenible, en el subsector de aprovechamiento, con predominancia de la especie Rhizophora mangle, esta parcela tiene gran cantidad de arboles muertos, y otros con condiciones de raquitismo, baja densidad de arboles en la parcela.",5658,"Amanda Selene Rojas Aguirre",null,null,null,null,null,"CALIDRIS","Asociación Calidris"]
["RM","Rhizophora mangle",null,null,null,null,"Ficus Tonduzii   ","FT","2040.55.1536",null,"ROSOPSIDA","ROSALES","MORACEAE","FICUS",null,null,"Ararca-1","BARU-ZR1-Ararca-1",44509,1764,"Parcela que coincide con punto de muestreo de PNN, se encontraron dos mojones instalados por ellos.  Bosque en sus primeros 25 m con abundante presencia de R. mangle con numerosas raíces fúlcreas, inundación de 5 cm en promedio, Bosque en buen estado no se evidencia tala",4415,"Ana Sánchez",null,null,null,null,null,"ASOCARS","Asociación de Corporaciones Autónomas Regionales"]
["RR","Rhizophora racemosa",null,null,null,null,"Laguncularia racemosa","LR","2040.55.290",null,null,null,"COMBRETACEAE",null,null,null,"Arroyo Plata-1","BARB-ZR1-Ay-Plata-1",44493,1759,"Parcela dominada por P. rhizophorae, inundación promedio de 15 cm. presencia abundante de propágulos de R. mangle.  Bosque en buen estado no se evidencia tala.",8660,"Angie Daniela Enriquez Fernandez",null,null,null,null,null,"ANLA","Autoridad Nacional de Licencias Ambientales"]
["SE","Sp. manglar",null,null,null,null,"Mora oleifera ","MM","2040.55.507",null,null,null,"Caesalpiniaceae",null,null,null,"BLACK SAND BAY","BSAND_BAY1",58105,2851,null,8258,"Daniel Fernando Jiménez Rincón",null,null,null,null,null,"ARAP","Autoridad de Recursos Acuáticos de Panamá"]
["FS","Ficus",null,null,null,null,"Pelliciera rhizophorae","PR","2040.55.532",null,null,null,"Rhizophoraceae",null,null,null,"BOCAS DEL ATRATO P1","BCATRATO_P1",56791,2810,null,7664,"Danny Santana Rosero",null,null,null,null,null,"CWOP","Caribbean-Wide Orca Project"]
{"$rows_left_out":290}
{"sheet":"OTRAS REFERENTES","index":5,"n_rows":1230,"n_cols":36,"rows_kept":1230,"cut":false,"hidden":false,"merged":[[4,20,4,21],[0,0,2,10],[4,0,4,1],[4,3,4,4],[4,7,4,8],[4,10,4,11]]}
["Estas son listas para variables con valores que no se encuentran codificados, pero que deben manejarse de manera estandarizada. \nSi se requiere agregar un valor nuevo hagalo debajo de la lista correspondiente"]
[]
[]
[1,2,3,4,5,6,7,8,9,10,11,12,13,14,15,16,17,18,19,20,21,22,23,24,25,26,27,28,29]
["UNIDADES DE MEDIDA",null,null,"PROYECTO",null,null,null,"METODOS ALTURA",null,null,"PROYECTOS FINANCIADORES",null,null,null,"ORDEN","COPIAS COD","REORDENAR","LISTADO",null,null,"ROLES",null,null,null,"ESTACIONES_RES","ID",null,"ESTACIONES","ID"]
["CODIGO","DESCRIPCION",null,"COD","PROYECTO","PROYECTO DESC",null,"COD","VALOR",null,"COD","TITULO",null,{"$f":"REFERENTES!S6","v":45589},1,{"$f":"IF(M6=\"\",0,M6)","v":0},{"$f":"IF(P6=0,MAX($O$6:$O$1135)+1,O6)","v":1131},{"$f":"IFERROR(VLOOKUP(SMALL($Q$6:$Q$1135,O6),$O$6:$P$1135,2,FALSE),\"X\")","v":"X"},null,null,"ID","CARGO",null,null,null,null,null,"****ESTACIONES_RES******","NO VALIDO",null,"A","A: de 0 cm a 50 cm",null,null,1,"Vivo"]
[10,"cm",null,1513,"Monitoreo_CGSM","Monitoreo CGSM",null,663,"Regla",null,3498,"Implementación de lineamientos para la restauración del ecosistema de manglar de la desembocadura del rio Toribio, departamento del Magdalena.",{"$f":"IF(ISNUMBER(FIND(\"RES\",REFERENTES!$Q$628:$Q$1125,1)),REFERENTES!Q628,\"\")","v":""},{"$f":"REFERENTES!S7","v":44509},2,{"$f":"IF(M7=\"\",0,M7)","v":0},{"$f":"IF(P7=0,MAX($O$6:$O$1135)+1,O7)","v":1131},{"$f":"IFERROR(VLOOKUP(SMALL($Q$6:$Q$1135,O7),$O$6:$P$1135,2,FALSE),\"X\")","v":"X"},null,null,4,"Captura en campo",null,null,null,null,null,"Aperturas Canal Clarin- Restauración(RES_MGACC)",55345,null,"C","C: mayor a 150 cm",null,null,2,"Muerto"]
[11,"m",null,2187,"INVEMAR - EPA Cartagena","INVEMAR - EPA Cartagena",null,633,"Estimación visual directa",null,3360,"LINEAMIENTOS PARA LA RESTAURACIÓN DEL ECOSISTEMA DE MANGLAR EN LA DESEMBOCADURA DEL RIO TORIBIO, DEPARTAMENTO DEL MAGDALENA",{"$f":"IF(ISNUMBER(FIND(\"RES\",REFERENTES!$Q$628:$Q$1125,1)),REFERENTES!Q629,\"\")","v":""},{"$f":"REFERENTES!S8","v":44493},3,{"$f":"IF(M8=\"\",0,M8)","v":0},1131,"X",null,null,6,"Revisar datos",null,null,null,null,null,"Caleta del Tambor- Restauración(RES_MGACTRES)",55346,null,"B","B: de 50 cm a 150 cm",null,null,6,"Herbivoría"]
[null,null,null,2486,"CVS_URRA_MANGLARES","CVS.URRA",null,null,null,null,3499,"Generación de insumos técnicos para la restauración del manglar en el sector noroeste de la CGSM y evaluación del desempeño de algunas medidas previamente implementadas",{"$f":"IF(ISNUMBER(FIND(\"RES\",REFERENTES!$Q$628:$Q$1125,1)),REFERENTES!Q630,\"\")","v":""},{"$f":"REFERENTES!S9","v":58105},4,{"$f":"IF(M9=\"\",0,M9)","v":0},1131,"X",null,null,3497,"Coordinador actividad de campo",null,null,null,null,null,"Caño La caleta del tambor(RES_MGCG_CT)",52736,null,null,null,null,null,4,"Marchito"]
[null,null,null,3287,"Restauracion Petrobras","Restauración De Ecosistemas De Manglar En La Guajira. Casos De Estudio Piloto: Musichi y Santuario de Fauna y Flora Los Flamencos",null,null,null,null,3528,"Fortalecimiento de la restauración de Manglares en Colombia: técnicas saberes y experiencias",{"$f":"IF(ISNUMBER(FIND(\"RES\",REFERENTES!$Q$628:$Q$1125,1)),REFERENTES!Q631,\"\")","v":""},{"$f":"REFERENTES!S10","v":56791},5,0,1131,"X",null,null,null,null,null,null,null,null,null,"Desembocadura rio Toribio - HMP Enriquecimiento zonas degradadas manglar,  Zonas con suelo desnudo(RES_MGTBRES_SD)",52725,null,null,null,null,null,5,"Clorosis"]
{"$rows_left_out":1220}