{"text_format":"1","workbook":"xlsx","n_sheets":11,"sheets":["Registro de cambios","configuracion","DIGITADOR","DATOS","referentes","Otras referencias","AGD_MUESTREOS","AGD_PARAMETRO","AGD_MUESTRAS","AGD_MUESTRAS_VARIABLES","AGD_AUTORIAS"],"not_rendered":{"charts":0,"images":0,"macros":1,"external_links":2,"defined_names":32,"comments":0,"pivot_tables":0},"unopened":[],"bounds":{"document_bytes":16777216,"sheet_cells":100000,"rows_first":2000,"rows_last":500,"rows_between":2000,"halvings":0,"cell_chars":16384,"cell_head_chars":4096},"cells_cut":0,"cells_raw":0,"read":"whole","date_system":"1900"}

{"sheet":"Registro de cambios","index":0,"n_rows":8,"n_cols":6,"rows_kept":8,"cut":false,"hidden":true,"merged":[[1,3,1,5]]}
[]
[null,null,null,"REGISTRO DE CAMBIOS"]
[null,null,null,"VERSIÓN No.","CAMBIO REALIZADO","VIGENTE DESDE"]
[null,null,null,"20240614i","*Se modifica el código de descarga referentes y carga de datos, implementando las nevas API, servicios para descarga y carga de datos:\nhttps://argos.invemar.org.co/api/\n\n* Se incluye el botón denominado \"\"validación datos\"\" en la hoja DIGITADOR, proceso encargado de validar la información ingresada.","2024-06-14"]
[null,null,null,"20211013i","Se agregaron las columnas nro de asilamientos. Lleva ademas comodin despues de la ultima columna para no modificar formulas si se insertan atributos","2021-10-13"]
[null,null,null,"20201120i","Se realizo la configuración y actualización de las plantillas CONFIGURACIÓN, DATOS y DIGITADOR. Fuente simac samp","2020-11-27"]
[null,null,null,20201211]
[null,null,null,"20201223i"]

{"sheet":"configuracion","index":1,"n_rows":66,"n_cols":17,"rows_kept":66,"cut":false,"hidden":true,"merged":[[28,0,35,0],[37,0,42,0],[45,0,45,1],[0,0,2,0],[3,0,5,0],[7,0,8,0],[9,0,15,0],[17,0,21,0],[23,0,26,0]]}
["general","urlServicio","https://argos.invemar.org.co/api/","Nodo Estaciones ",40]
[null,"fila de inicio",5]
[null,"fila de fin",100]
["metodologias","Metodologias",860]
[null,"Referentes",200]
[null,"Cantidad maxima de referentes ",200]
["estaciones/investigadores","proyectos",2050]
["Lista especies","metodologias",860]
[null,"proyectos",2050]
["MUESTREOS","ID_MUESTREO","DATOS,C"]
{"$rows_left_out":57}
{"sheet":"DIGITADOR","index":2,"n_rows":28,"n_cols":13,"rows_kept":28,"cut":false,"hidden":false,"merged":[[18,0,18,1],[12,3,14,9],[6,0,7,0],[0,0,0,1],[0,3,6,9],[11,3,11,9],[7,3,10,9]]}
["Monitoreo Calidad Sanitaria Aguas",null,null,"Recomendaciones generales: \n- ¡Precaución! No inserte Filas o Columnas.\n- En los casos en que falte un valor a ingresar que provenga de la hoja de referencias, informe para que el administrador del sistema haga las adiciones necesarias.\nEsta es una plantilla programada. Las columnas de color oscuro se llenan automáticamente, principalmente a partir de los contenidos de la hoja de referencias. \nNO UTILICE PUNTO Y COMA (;) en ningún campo, por ser el separador de variables (columnas). Tampoco escriba las unidades de medida, no son necesarias.\n- Para el correcto funcionamiento de la hoja debe estar activa la opción de Excel de ejecutar macros (al abrir la hoja acepte la opción habilitar macros, mensaje de Excel que aparece en la parte superior de la hoja en un recuadro amarillo). La extensión del archivo debe ser .xlsm\n- Se recomienda renombrar el archivo de la siguiente manera: Departamento_proyecto_sustrato-númeromuestreo_año.xlsm",null,null,null,null,null,null,null,null,2738]
["CODIGO",{"$f":"IF(B3=\"\",\"\",INDEX(referentes!BA:BB,MATCH(DIGITADOR!B3,referentes!BB:BB,0),1))","v":""}]
["NOMBRE"]
["ENTIDAD"]
["COD_ENTIDAD",{"$f":"IF(B4=\"\",\"\",INDEX('Otras referencias'!$F:$G,MATCH(B4,'Otras referencias'!$G:$G,0),1))","v":""}]
["Plantilla",{"$f":"'Registro de cambios'!$D$4","v":"20240614i"}]
["Fecha en la que ingresa los datos en esta hoja","3000-01-01"," "]
[null,"3000-01-01",null,"* Instrucciones para el adecuado diligenciamiento y uso de la plantilla:\n\n- Previo al iniciar el llenado de la plantilla, verifique que tenga la versión vigente, descárguela si es necesario.\n- presione el botón \"Descargar referentes\" para que los referentes de ésta plantilla sean actualizados.\n- Diligencie los datos en la hoja \"VALIDACION\"\n- Presionar el botón \"Estandarizar datos\" para copiar los datos a la hoja \"DATOS\"\n- Presionar el botón \"Validacion datos\" para validar los datos diligenciados\n- Luego de validar los datos con éxito, haga clic sobre el botón \"Generar tablas\" para que los datos sean organizados antes de cargarlos al Sistema de Información.\n- Antes de presionar el botón \"Generar tablas\" verifique que:\na. No haya celdas con valores como \"#N/A\" o \"#¡REF!\".\nb. No se estén aplicando filtros en la hoja de datos.\nPara transferir los datos de esta plantilla a la base de datos del sistema, presione el botón \"Cargar datos\". "]
[]
["Cod_Proyecto",2050]
{"$rows_left_out":19}
{"sheet":"DATOS","index":3,"n_rows":100,"n_cols":50,"rows_kept":100,"cut":false,"hidden":false,"merged":[[0,5,2,15],[0,20,2,37],[3,8,3,9]]}
[{"$f":"DIGITADOR!B8","v":"3000-01-01"},null,null,null,null,null,null,null,null,null,null,null,null,null,null,null,null,null,null,null,"PRUEBAS Y RESULTADOS LABORATORIO"]
[{"$f":"CONCATENATE(YEAR(A1),TEXT(A1,\"mmdd\"))","v":"30000101"},null,null,null,null,null,null,null,null,null,null,null,null,null,null,null,null,null,null,null,null,null,null,null,null,null,null,null,null,null,null,null,null,null,null,null,null,null,null,"COMODIN"]
[]
[{"$f":"DIGITADOR!$B$2","v":""},"ID_MUESTREO2","ID_MUESTREO","ID_MUESTRA",null,"PROYECTO FINANCIA","FECHA HORA\n(DD/MM/AAAA HH:MM)",null,"INVESTIGADOR",null,"ID ESTACION","ESTACION","LUGAR","SUSTRATO DE LA\nMUESTRA","PROFUNDIDAD TOMA MUESTRA","NOTAS","CDG\nSUSTRATO","CDG PROFUNDIDAD",null,null,"METODO DE SIEMBRA Y AISLAMIENTO","MEDIO DE CULTIVO","METODO PRUEBA BIOQUIMICA",null,"PERFIL RESULTADO","METODO EXTRACCION ADN","METODO AMPLIFICACION IDENTIFICACION MOLECULAR","PRIMER","METODO SECUENCIACION",null,"CDG ESPECIE ","ESPECIE","NUMERO DE UFC","UNIDADES","AISLAMIENTOS CONFIRMADOS","AISLAMIENTOS NO CONFIRMADOS","FACTOR DE VIRULENCIA","LIMITE DE CUANTIFICACION (>LC)","DUP FILA",null,null,null,"CDG SIEMBRA","CDG MEDIO","CDG BIOQUIMICA","CDG EXTRACCION","CDG AMPLIFICACION","CDG SECUENCIACION","CDG UNIDADES","CDG VIRULENCIA"]
[{"$f":"IF(H5<>\"\",$A$2,\"\")","v":""},{"$f":"IF( L5<>\"\", CONCATENATE(YEAR(G5),TEXT(G5,\"mmdd\"),DIGITADOR!$B$2,DATOS!K5,DIGITADOR!$M$1),\"\")","v":""},{"$f":"IF( L5<>\"\", IF(K5<>K4,CONCATENATE(YEAR(G5),TEXT(G5,\"mmdd\"),DIGITADOR!$B$2,DATOS!K5,DIGITADOR!$M$1),\"\"),\"\")","v":""},{"$f":"IF(K5<>\"\",CONCATENATE(B5,ROW()),\"\")","v":""},null,null,null,null,{"$f":"IF(J5=\"\",\"\",INDEX(referentes!$BA$2:$BB$131,MATCH(DATOS!J5,referentes!$BB$2:$BB$131,0),1))","v":""},null,{"$f":"IF(L5=\"\",\"\",INDEX([2]referentes!$AR:$AV,MATCH(L5,[2]referentes!$AS:$AS,0),1))","v":""},null,{"$f":"IF(L5=\"\",\"\",INDEX([2]referentes!$AR:$AV,MATCH(L5,[2]referentes!$AS:$AS,0),5))","v":""},null,null,null,{"$f":"IF(N5=\"\",\"\",INDEX('Otras referencias'!$A$6:$B$9,MATCH(DATOS!N5,'Otras referencias'!$B$6:$B$9,0),1))","v":""},{"$f":"IF(O5=\"\",\"\",INDEX(referentes!$G:$H,MATCH(O5,referentes!$H:$H,0),1))","v":""},null,null,null,null,null,null,null,null,null,null,null,null,{"$f":"IF(AF5<>\"\",INDEX(referentes!$AK$2:$AL$15,MATCH(DATOS!AF5,referentes!$AL$2:$AL$15,0),1),\"\")","v":""},null,null,null,null,null,null,null,null,null,null,null,{"$f":"IF(U5=\"\",\"\",INDEX(referentes!$J:$K,MATCH(U5,referentes!$K:$K,0),1))","v":""},{"$f":"IF(V5=\"\",\"\",INDEX(referentes!$M:$N,MATCH(V5,referentes!$N:$N,0),1))","v":""},{"$f":"IF(W5=\"\",\"\",INDEX(referentes!$P:$Q,MATCH(W5,referentes!$Q:$Q,0),1))","v":""},{"$f":"IF(Z5=\"\",\"\",INDEX(referentes!$S:$T,MATCH(Z5,referentes!$T:$T,0),1))","v":""},{"$f":"IF(AA5=\"\",\"\",INDEX(referentes!$V:$W,MATCH(AA5,referentes!$W:$W,0),1))","v":""},{"$f":"IF(AC5=\"\",\"\",INDEX(referentes!$Y:$Z,MATCH(AC5,referentes!$Z:$Z,0),1))","v":""},{"$f":"IF(AH5=\"\",\"\",INDEX(referentes!$AE:$AF,MATCH(AH5,referentes!$AF:$AF,0),1))","v":""},{"$f":"IF(AK5=\"\",\"\",INDEX(referentes!$AH:$AI,MATCH(AK5,referentes!$AI:$AI,0),1))","v":""}]
[{"$f":"IF(H6<>\"\",$A$2,\"\")","v":""},{"$f":"IF( L6<>\"\", CONCATENATE(YEAR(G6),TEXT(G6,\"mmdd\"),DIGITADOR!$B$2,DATOS!K6,DIGITADOR!$M$1),\"\")","v":""},{"$f":"IF( L6<>\"\", IF(K6<>K5,CONCATENATE(YEAR(G6),TEXT(G6,\"mmdd\"),DIGITADOR!$B$2,DATOS!K6,DIGITADOR!$M$1),\"\"),\"\")","v":""},{"$f":"IF(K6<>\"\",CONCATENATE(B6,ROW()),\"\")","v":""},null,null,null,null,{"$f":"IF(J6=\"\",\"\",INDEX(referentes!$BA$2:$BB$131,MATCH(DATOS!J6,referentes!$BB$2:$BB$131,0),1))","v":""},null,{"$f":"IF(L6=\"\",\"\",INDEX([2]referentes!$AR:$AV,MATCH(L6,[2]referentes!$AS:$AS,0),1))","v":""},null,{"$f":"IF(L6=\"\",\"\",INDEX([2]referentes!$AR:$AV,MATCH(L6,[2]referentes!$AS:$AS,0),5))","v":""},null,null,null,{"$f":"IF(N6=\"\",\"\",INDEX('Otras referencias'!$A$6:$B$9,MATCH(DATOS!N6,'Otras referencias'!$B$6:$B$9,0),1))","v":""},{"$f":"IF(O6=\"\",\"\",INDEX(referentes!$G:$H,MATCH(O6,referentes!$H:$H,0),1))","v":""},null,null,null,null,null,null,null,null,null,null,null,null,{"$f":"IF(AF6<>\"\",INDEX(referentes!$AK$2:$AL$15,MATCH(DATOS!AF6,referentes!$AL$2:$AL$15,0),1),\"\")","v":""},null,null,null,null,null,null,null,null,null,null,null,{"$f":"IF(U6=\"\",\"\",INDEX(referentes!$J:$K,MATCH(U6,referentes!$K:$K,0),1))","v":""},{"$f":"IF(V6=\"\",\"\",INDEX(referentes!$M:$N,MATCH(V6,referentes!$N:$N,0),1))","v":""},{"$f":"IF(W6=\"\",\"\",INDEX(referentes!$P:$Q,MATCH(W6,referentes!$Q:$Q,0),1))","v":""},{"$f":"IF(Z6=\"\",\"\",INDEX(referentes!$S:$T,MATCH(Z6,referentes!$T:$T,0),1))","v":""},{"$f":"IF(AA6=\"\",\"\",INDEX(referentes!$V:$W,MATCH(AA6,referentes!$W:$W,0),1))","v":""},{"$f":"IF(AC6=\"\",\"\",INDEX(referentes!$Y:$Z,MATCH(AC6,referentes!$Z:$Z,0),1))","v":""},{"$f":"IF(AH6=\"\",\"\",INDEX(referentes!$AE:$AF,MATCH(AH6,referentes!$AF:$AF,0),1))","v":""},{"$f":"IF(AK6=\"\",\"\",INDEX(referentes!$AH:$AI,MATCH(AK6,referentes!$AI:$AI,0),1))","v":""}]
["",{"$f":"IF( L7<>\"\", CONCATENATE(YEAR(G7),TEXT(G7,\"mmdd\"),DIGITADOR!$B$2,DATOS!K7,DIGITADOR!$M$1),\"\")","v":""},{"$f":"IF( L7<>\"\", IF(K7<>K6,CONCATENATE(YEAR(G7),TEXT(G7,\"mmdd\"),DIGITADOR!$B$2,DATOS!K7,DIGITADOR!$M$1),\"\"),\"\")","v":""},"",null,null,null,null,{"$f":"IF(J7=\"\",\"\",INDEX(referentes!$BA$2:$BB$131,MATCH(DATOS!J7,referentes!$BB$2:$BB$131,0),1))","v":""},null,{"$f":"IF(L7=\"\",\"\",INDEX([2]referentes!$AR:$AV,MATCH(L7,[2]referentes!$AS:$AS,0),1))","v":""},null,{"$f":"IF(L7=\"\",\"\",INDEX([2]referentes!$AR:$AV,MATCH(L7,[2]referentes!$AS:$AS,0),5))","v":""},null,null,null,{"$f":"IF(N7=\"\",\"\",INDEX('Otras referencias'!$A$6:$B$9,MATCH(DATOS!N7,'Otras referencias'!$B$6:$B$9,0),1))","v":""},{"$f":"IF(O7=\"\",\"\",INDEX(referentes!$G:$H,MATCH(O7,referentes!$H:$H,0),1))","v":""},null,null,null,null,null,null,null,null,null,null,null,null,{"$f":"IF(AF7<>\"\",INDEX(referentes!$AK$2:$AL$15,MATCH(DATOS!AF7,referentes!$AL$2:$AL$15,0),1),\"\")","v":""},null,null,null,null,null,null,null,null,null,null,null,{"$f":"IF(U7=\"\",\"\",INDEX(referentes!$J:$K,MATCH(U7,referentes!$K:$K,0),1))","v":""},{"$f":"IF(V7=\"\",\"\",INDEX(referentes!$M:$N,MATCH(V7,referentes!$N:$N,0),1))","v":""},{"$f":"IF(W7=\"\",\"\",INDEX(referentes!$P:$Q,MATCH(W7,referentes!$Q:$Q,0),1))","v":""},{"$f":"IF(Z7=\"\",\"\",INDEX(referentes!$S:$T,MATCH(Z7,referentes!$T:$T,0),1))","v":""},{"$f":"IF(AA7=\"\",\"\",INDEX(referentes!$V:$W,MATCH(AA7,referentes!$W:$W,0),1))","v":""},{"$f":"IF(AC7=\"\",\"\",INDEX(referentes!$Y:$Z,MATCH(AC7,referentes!$Z:$Z,0),1))","v":""},{"$f":"IF(AH7=\"\",\"\",INDEX(referentes!$AE:$AF,MATCH(AH7,referentes!$AF:$AF,0),1))","v":""},{"$f":"IF(AK7=\"\",\"\",INDEX(referentes!$AH:$AI,MATCH(AK7,referentes!$AI:$AI,0),1))","v":""}]
["",{"$f":"IF( L8<>\"\", CONCATENATE(YEAR(G8),TEXT(G8,\"mmdd\"),DIGITADOR!$B$2,DATOS!K8,DIGITADOR!$M$1),\"\")","v":""},{"$f":"IF( L8<>\"\", IF(K8<>K7,CONCATENATE(YEAR(G8),TEXT(G8,\"mmdd\"),DIGITADOR!$B$2,DATOS!K8,DIGITADOR!$M$1),\"\"),\"\")","v":""},"",null,null,null,null,{"$f":"IF(J8=\"\",\"\",INDEX(referentes!$BA$2:$BB$131,MATCH(DATOS!J8,referentes!$BB$2:$BB$131,0),1))","v":""},null,{"$f":"IF(L8=\"\",\"\",INDEX([2]referentes!$AR:$AV,MATCH(L8,[2]referentes!$AS:$AS,0),1))","v":""},null,{"$f":"IF(L8=\"\",\"\",INDEX([2]referentes!$AR:$AV,MATCH(L8,[2]referentes!$AS:$AS,0),5))","v":""},null,null,null,{"$f":"IF(N8=\"\",\"\",INDEX('Otras referencias'!$A$6:$B$9,MATCH(DATOS!N8,'Otras referencias'!$B$6:$B$9,0),1))","v":""},{"$f":"IF(O8=\"\",\"\",INDEX(referentes!$G:$H,MATCH(O8,referentes!$H:$H,0),1))","v":""},null,null,null,null,null,null,null,null,null,null,null,null,{"$f":"IF(AF8<>\"\",INDEX(referentes!$AK$2:$AL$15,MATCH(DATOS!AF8,referentes!$AL$2:$AL$15,0),1),\"\")","v":""},null,null,null,null,null,null,null,null,null,null,null,{"$f":"IF(U8=\"\",\"\",INDEX(referentes!$J:$K,MATCH(U8,referentes!$K:$K,0),1))","v":""},{"$f":"IF(V8=\"\",\"\",INDEX(referentes!$M:$N,MATCH(V8,referentes!$N:$N,0),1))","v":""},{"$f":"IF(W8=\"\",\"\",INDEX(referentes!$P:$Q,MATCH(W8,referentes!$Q:$Q,0),1))","v":""},{"$f":"IF(Z8=\"\",\"\",INDEX(referentes!$S:$T,MATCH(Z8,referentes!$T:$T,0),1))","v":""},{"$f":"IF(AA8=\"\",\"\",INDEX(referentes!$V:$W,MATCH(AA8,referentes!$W:$W,0),1))","v":""},{"$f":"IF(AC8=\"\",\"\",INDEX(referentes!$Y:$Z,MATCH(AC8,referentes!$Z:$Z,0),1))","v":""},{"$f":"IF(AH8=\"\",\"\",INDEX(referentes!$AE:$AF,MATCH(AH8,referentes!$AF:$AF,0),1))","v":""},{"$f":"IF(AK8=\"\",\"\",INDEX(referentes!$AH:$AI,MATCH(AK8,referentes!$AI:$AI,0),1))","v":""}]
["",{"$f":"IF( L9<>\"\", CONCATENATE(YEAR(G9),TEXT(G9,\"mmdd\"),DIGITADOR!$B$2,DATOS!K9,DIGITADOR!$M$1),\"\")","v":""},{"$f":"IF( L9<>\"\", IF(K9<>K8,CONCATENATE(YEAR(G9),TEXT(G9,\"mmdd\"),DIGITADOR!$B$2,DATOS!K9,DIGITADOR!$M$1),\"\"),\"\")","v":""},"",null,null,null,null,{"$f":"IF(J9=\"\",\"\",INDEX(referentes!$BA$2:$BB$131,MATCH(DATOS!J9,referentes!$BB$2:$BB$131,0),1))","v":""},null,{"$f":"IF(L9=\"\",\"\",INDEX([2]referentes!$AR:$AV,MATCH(L9,[2]referentes!$AS:$AS,0),1))","v":""},null,{"$f":"IF(L9=\"\",\"\",INDEX([2]referentes!$AR:$AV,MATCH(L9,[2]referentes!$AS:$AS,0),5))","v":""},null,null,null,{"$f":"IF(N9=\"\",\"\",INDEX('Otras referencias'!$A$6:$B$9,MATCH(DATOS!N9,'Otras referencias'!$B$6:$B$9,0),1))","v":""},{"$f":"IF(O9=\"\",\"\",INDEX(referentes!$G:$H,MATCH(O9,referentes!$H:$H,0),1))","v":""},null,null,null,null,null,null,null,null,null,null,null,null,{"$f":"IF(AF9<>\"\",INDEX(referentes!$AK$2:$AL$15,MATCH(DATOS!AF9,referentes!$AL$2:$AL$15,0),1),\"\")","v":""},null,null,null,null,null,null,null,null,null,null,null,{"$f":"IF(U9=\"\",\"\",INDEX(referentes!$J:$K,MATCH(U9,referentes!$K:$K,0),1))","v":""},{"$f":"IF(V9=\"\",\"\",INDEX(referentes!$M:$N,MATCH(V9,referentes!$N:$N,0),1))","v":""},{"$f":"IF(W9=\"\",\"\",INDEX(referentes!$P:$Q,MATCH(W9,referentes!$Q:$Q,0),1))","v":""},{"$f":"IF(Z9=\"\",\"\",INDEX(referentes!$S:$T,MATCH(Z9,referentes!$T:$T,0),1))","v":""},{"$f":"IF(AA9=\"\",\"\",INDEX(referentes!$V:$W,MATCH(AA9,referentes!$W:$W,0),1))","v":""},{"$f":"IF(AC9=\"\",\"\",INDEX(referentes!$Y:$Z,MATCH(AC9,referentes!$Z:$Z,0),1))","v":""},{"$f":"IF(AH9=\"\",\"\",INDEX(referentes!$AE:$AF,MATCH(AH9,referentes!$AF:$AF,0),1))","v":""},{"$f":"IF(AK9=\"\",\"\",INDEX(referentes!$AH:$AI,MATCH(AK9,referentes!$AI:$AI,0),1))","v":""}]
["",{"$f":"IF( L10<>\"\", CONCATENATE(YEAR(G10),TEXT(G10,\"mmdd\"),DIGITADOR!$B$2,DATOS!K10,DIGITADOR!$M$1),\"\")","v":""},{"$f":"IF( L10<>\"\", IF(K10<>K9,CONCATENATE(YEAR(G10),TEXT(G10,\"mmdd\"),DIGITADOR!$B$2,DATOS!K10,DIGITADOR!$M$1),\"\"),\"\")","v":""},{"$f":"IF(K10<>\"\",CONCATENATE(B10,ROW()),\"\")","v":""},null,null,null,null,{"$f":"IF(J10=\"\",\"\",INDEX(referentes!$BA$2:$BB$131,MATCH(DATOS!J10,referentes!$BB$2:$BB$131,0),1))","v":""},null,{"$f":"IF(L10=\"\",\"\",INDEX([2]referentes!$AR:$AV,MATCH(L10,[2]referentes!$AS:$AS,0),1))","v":""},null,{"$f":"IF(L10=\"\",\"\",INDEX([2]referentes!$AR:$AV,MATCH(L10,[2]referentes!$AS:$AS,0),5))","v":""},null,null,null,{"$f":"IF(N10=\"\",\"\",INDEX('Otras referencias'!$A$6:$B$9,MATCH(DATOS!N10,'Otras referencias'!$B$6:$B$9,0),1))","v":""},{"$f":"IF(O10=\"\",\"\",INDEX(referentes!$G:$H,MATCH(O10,referentes!$H:$H,0),1))","v":""},null,null,null,null,null,null,null,null,null,null,null,null,{"$f":"IF(AF10<>\"\",INDEX(referentes!$AK$2:$AL$15,MATCH(DATOS!AF10,referentes!$AL$2:$AL$15,0),1),\"\")","v":""},null,null,null,null,null,null,null,null,null,null,null,{"$f":"IF(U10=\"\",\"\",INDEX(referentes!$J:$K,MATCH(U10,referentes!$K:$K,0),1))","v":""},{"$f":"IF(V10=\"\",\"\",INDEX(referentes!$M:$N,MATCH(V10,referentes!$N:$N,0),1))","v":""},{"$f":"IF(W10=\"\",\"\",INDEX(referentes!$P:$Q,MATCH(W10,referentes!$Q:$Q,0),1))","v":""},{"$f":"IF(Z10=\"\",\"\",INDEX(referentes!$S:$T,MATCH(Z10,referentes!$T:$T,0),1))","v":""},{"$f":"IF(AA10=\"\",\"\",INDEX(referentes!$V:$W,MATCH(AA10,referentes!$W:$W,0),1))","v":""},{"$f":"IF(AC10=\"\",\"\",INDEX(referentes!$Y:$Z,MATCH(AC10,referentes!$Z:$Z,0),1))","v":""},{"$f":"IF(AH10=\"\",\"\",INDEX(referentes!$AE:$AF,MATCH(AH10,referentes!$AF:$AF,0),1))","v":""},{"$f":"IF(AK10=\"\",\"\",INDEX(referentes!$AH:$AI,MATCH(AK10,referentes!$AI:$AI,0),1))","v":""}]
{"$rows_left_out":91}
{"sheet":"referentes","index":4,"n_rows":0,"n_cols":0,"rows_kept":0,"cut":false,"hidden":false,"merged":[]}

{"sheet":"Otras referencias","index":5,"n_rows":20,"n_cols":10,"rows_kept":20,"cut":false,"hidden":false,"merged":[[4,25,4,27],[4,0,4,1],[4,12,4,13]]}
["Listas fijas. Agregue los elementos a la lista"]
[]
[]
[]
["Sustrato",null,null,"PRIMER",null,null,"Entidad"]
["SA","Agua",null,"pVC-F2: TTAAGCSTTTTCRCTGAGAATG                                                                    pVCm-R1: AGTCACTTAACCATACAACCCG",null,"UNIVALLE","Universidad del Valle",null,null,{"$f":"IF(N5=\"\",\"\",INDEX('Otras referencias'!$A:$B,MATCH(N5,'Otras referencias'!$B:$B,0),1))","v":""}]
["SS","Sedimento",null,"gyrB- F:GAGAACCCGACAGAAGCGAAG                                                                       gyrB- R: CCTAGTGCGGTGATCAGTGTTG",null,"CORALINA","Corporación Autonoma "]
["OA","Organismo Animal",null,"Tlh -F: AAAGCGGATTATGCAGAAGCA CTG                                     Tlh-R: GCTACTTTCTAGCATTTTCTCTG C",null,"CORPOGUAJIRA","Corporación Autónoma Regional de la Guajira"]
["OV","Organismo Vegetal",null,"vvhA- F: AATCGGCAACGTCAGATGGT                                          vvhA-R: GCCGTAAACCGAAAACAGCG",null,"UNal","Universidad Nacional de Colombia"]
[null,null,null,"ToxR-F:GACCAGGGCTTTGAGGTGGACGAC                                 ToxR-R: AGGATACGGCACTTGAGTAAGACTC",null,"CORPOURABA","Corporación Autónoma Regional del Uraba"]
{"$rows_left_out":11}
{"sheet":"AGD_MUESTREOS","index":6,"n_rows":0,"n_cols":0,"rows_kept":0,"cut":false,"hidden":true,"merged":[]}

{"sheet":"AGD_PARAMETRO","index":7,"n_rows":0,"n_cols":0,"rows_kept":0,"cut":false,"hidden":true,"merged":[]}

{"sheet":"AGD_MUESTRAS","index":8,"n_rows":0,"n_cols":0,"rows_kept":0,"cut":false,"hidden":true,"merged":[]}

{"sheet":"AGD_MUESTRAS_VARIABLES","index":9,"n_rows":0,"n_cols":0,"rows_kept":0,"cut":false,"hidden":true,"merged":[]}

{"sheet":"AGD_AUTORIAS","index":10,"n_rows":0,"n_cols":0,"rows_kept":0,"cut":false,"hidden":true,"merged":[]}