{"text_format":"1","workbook":"xlsx","n_sheets":6,"sheets":["Versiones","INSTRUCTIVO","dia 1","Hoja2","Variables","configuracion"],"not_rendered":{"charts":0,"images":3,"macros":1,"external_links":0,"defined_names":2,"comments":0,"pivot_tables":0},"unopened":[],"bounds":{"document_bytes":16777216,"sheet_cells":100000,"rows_first":2000,"rows_last":500,"rows_between":2000,"halvings":0,"cell_chars":16384,"cell_head_chars":4096},"cells_cut":0,"cells_raw":0,"read":"whole","date_system":"1900"}

{"sheet":"Versiones","index":0,"n_rows":10,"n_cols":39,"rows_kept":10,"cut":false,"hidden":true,"merged":[[1,0,2,1],[1,3,1,6]]}
[]
["SIEMPRE EN LA FILA 4 columna D la ULTIMA VERSION (Para no modificar la formula de la hoja digitador)",null,null,"REGISTRO DE CAMBIOS"]
[null,null,null,"VERSIÓN No.","CAMBIO REALIZADO","AUTOR","VIGENTE DESDE"]
[null,null,null,"20250702i","*Se implementa un macro llamada  ListaEstaciones, la cual se conecta al servicio web (API) para descargar automáticamente una lista de estaciones de muestreo asociadas a distintos proyectos, y las carga en la hoja \"Variables\", actualizando la lista integrada.\n* Se deja una instruccion en la hoja de INSTRUCTIVO, de cuando se genere un error al ingresar un codigo de la estación que no se encuentre en la lista, de darle clip al boton Actualizar Estaciones, para corregirlo\n*Se agrega una hoja llamada configuracion, donde estan unos datos para que funcionen la macro","Antonio Carrasquilla","2025-07-02"]
[null,null,null,"20241018m","Corrección del contenido de la hoja INSTRUCTIVO.","Kevin Moreno","18/10/2024"]
[null,null,null,"20230301i","* Se crea una rutina (macro VBA) que copia las variables del encabezado en la celda seleccionada para la sección de ejecución del muestreo; esto con el fin de capturar el dato de las variables ejecutadas para cada una de las estaciones e insertarlo en la BD.","Jair Valdés","2023-01-03"]
[null,null,null,"20210722m","* Se deja en blanco el ID_EXCEL, para que cuando se realice una descarga de la plantilla, este ID se genere automaticamente\n\nSe corrijen los códigos de las estaciones, por unos ajustes que realizaron en algunas de ellas.",null,"22/07/2021"]
[null,null,null,"20210322i","Ingreso de la plantilla",null,"22/03/2021"]
[]
[null,null,null,null,null,null,null,null,null,null,null,null,null,null,null,null,null,null,null,null,null,null,null,null,null,null,null,null,null,null,null,null,null,null,null,null,null,null,2107229355]

{"sheet":"INSTRUCTIVO","index":1,"n_rows":30,"n_cols":38,"rows_kept":30,"cut":false,"hidden":false,"merged":[[1,13,5,18],[0,13,0,18],[0,3,5,9],[20,3,21,9],[22,3,24,9],[0,10,0,12],[1,10,5,12],[6,3,19,9]]}
[null,null,null,"Recomendaciones generales: \n¡Precaución! Esta es una plantilla programada. Por ende debe seguir las siguientes indicaciones para su correcta carga.\nNo inserte Filas o Columnas.                                                                                                                                                                                               \nLa plantilla al ser guardada por primera vez genera un ID unico,lo cual permite su identificación. Para garantizar el correcto uso de este formato, contiene celdas bloqueadas.                                                                                                                                                                                   \nLa asignación de variables se hace mediante un listado controlado,en la cual solo debe seleccionar las variables a medir y automaticamente se iran agregando los codigos separados por comas. Para mas información consultar hoja \"Variables\".                                          Indique para cada variable su respectivo laboratorio y sustrato.                                                                                                                                      Para el correcto funcionamiento de la hoja debe estar activa la opcion de Excel de ejecutar macros (al abrir la hoja acepte la opcion habilitar macros, mensaje de Excel que aparece en la parte superior de la hoja en un recuadro amarillo). La extensión del archivo debe ser .xlsm\nSe recomienda renombrar el archivo de la siguiente manera: Plan_muestreo_\"Nombredepartamento\"AAAA.xlsm               ",null,null,null,null,null,null,"Al ingreso de las estaciones, tener en cuenta:",null,null,"Al ingreso de las estaciones, tener en cuenta:"]
[null,null,null,null,null,null,null,null,null,null,"1) Al momento de diligenciar los códigos de las estaciones tener en cuenta que para algunas estaciones se modificó el código debido a procesos de verificación internos del programa, si por algún motivo usted diligencia una estación y le arroja un error (#N/A), por favor verifique el listado de las estaciones que se mostrarán a continuación y asigne el \"Código Correcto\" al cual pertenece esa estación:\n",null,null,"2) Si al colocar el código de la estación correctamente y arroja este error \n\n\n\n\n\n\nDarle al boton  Actualizar Estaciones "]
[]
[]
[]
[]
[null,null,null,"Esta plantilla es cargada en la herramientda web en dos momentos, la programación y la ejecución de muestreos. En el primer momento se validan y  leen datos exclusivamente de la programación, por esta razón es necesario llenar los campos obligatorios:                        1. Proyecto                                                                                               2. Responsable\n3. Fecha Inicial de planeación del muestreo                             4. Fecha final de planeación del muestreo\n5. Lugar de muestreo (Codigo del lugar)                                     6. Punto o estacion de Muestreo\n7. Variables a medir (Lista desplegable)                                     8. Laboratorios\n9. Tipo de muestra                                                                               10. Marcar con X las celdas de las columnas  (Color gris) correspondientes a las  variables planificadas\nSi la programación se realizara en diferentes dias, antes de realizar la programación duplique la hoja dia 1 y cambie su nombre al respectivo dia. No inserte Hojas nuevas, DUPLIQUE LA HOJA DIA 1                                                                                                                                                                                                                                                                             En el segundo momento se validan y leen datos de la ejecución, por ende es necesario llenar lo campos obligatorios:                              1. Fecha Inicial de planeación del muestreo(DD/MM/AAAA)                          2. Fecha final de planeación del muestreo(DD/MM/AAAA)\n3. Lugar de muestreo (Codigo del lugar) (DD/MM/AAAA)                                  4. Marcar con X las celdas de las columnas (Color azul) correspondientes a las  variables planificadas (DD/MM/AAAA)\n",null,null,null,null,null,null,"Código Erroneo    ","Nombre estación","Código correcto",null,null,null,null,null,null,null,null,null,null,null,null,null,null,null,null,null,null,null,null,null,null,null,2105065351,2108238987]
[null,null,null,null,null,null,null,null,null,null,"P52003012","Frente a Rios ","P52002030"]
[null,null,null,null,null,null,null,null,null,null,"C44002044","Navio Quebrado Boca","C44003030"]
[null,null,null,null,null,null,null,null,null,null,"C44002045","Navio Quebrado Extremo Sur Occidental","C44003031"]
[null,null,null,null,null,null,null,null,null,null,"C44002046","Navio Quebrado Centro","C44003032"]
[null,null,null,null,null,null,null,null,null,null,"C44002047","Navio Quebrado Sur","C44003033"]
[null,null,null,null,null,null,null,null,null,null,"C47001014","Río Manzanares (Bonda)","C47003111"]
[null,null,null,null,null,null,null,null,null,null,"C08002014","Playas de Salgar","C08001005"]
[null,null,null,null,null,null,null,null,null,null,"C08002002","Playa Salgar","C08001006"]
[null,null,null,null,null,null,null,null,null,null,"C08002001","Playa Pradomar ","C08001007"]
[null,null,null,null,null,null,null,null,null,null,"P76001026","Playa Magüipi","P76002027"]
[null,null,null,null,null,null,null,null,null,null,"P76002079","Frente a Río Raposo ","P76003038"]
[null,null,null,null,null,null,null,null,null,null,"P19001011","Bocana Río Timbiqui","P19002013"]
[null,null,null,null,null,null,null,null,null,null,"P19001012","Frente Norte Río Timbiqui","P19002014"]
[null,null,null,"Si requiere ayuda contacte a:\njefatura.labsis@invemar.org.co  - Se le asignará a una persona para apoyo técnico software",null,null,null,null,null,null,"P19001013","Frente Bocana Río Timbiqui","P19002015"]
[null,null,null,null,null,null,null,null,null,null,"P19001014","Frente Sur Río Timbiqui","P19002016"]
[null,null,null,"El custodio de los datos es el único autorizado para distribuir este conjunto de datos. El observador y el digitador se comprometen a tomar las medidas necesarias para salvaguardar este conjunto de datos de modo que copia de los mismos no sean obtenidas y/o usadas por terceros no relacionados con el propósito para la cual se recolectó.",null,null,null,null,null,null,"C08001001","Playa Puerto Colombia (1)","C08002022"]
[null,null,null,null,null,null,null,null,null,null,"C13002022","Laguna del Cabrero","C13003102"]
[null,null,null,null,null,null,null,null,null,null,"C13002023","Frente Club de Pesca","C13003103"]
[null,null,null,null,null,null,null,null,null,null,"C13002025","Salida Bocana","C13003104"]
[null,null,null,null,null,null,null,null,null,null,"P52003013","Playa Bocagrande","P52002039"]
[null,null,null,null,null,null,null,null,null,null,"P52003011","Bocana Ens. Tumaco","P52002040"]
[null,null,null,null,null,null,null,null,null,null,"P52003015","La Carbonera","P52002041"]
[null,null,null,null,null,null,null,null,null,null,"P52003014","Isla Vaqueria","P52002042"]
{"$rows_left_out":1}
{"sheet":"dia 1","index":2,"n_rows":40,"n_cols":36,"rows_kept":40,"cut":false,"hidden":false,"merged":[[5,0,5,37],[0,0,3,31],[0,32,4,37],[4,0,4,2],[4,3,4,26],[4,27,4,31],[6,37,8,37],[7,0,7,1],[7,2,7,10],[7,22,7,24],[8,22,8,24],[8,34,8,36],[6,0,6,1],[6,2,6,10],[6,17,6,20],[7,17,7,20],[9,0,9,37],[10,0,10,2],[10,3,10,4],[10,5,10,16],[10,17,10,22],[10,23,10,26],[10,27,10,34],[10,35,10,37],[6,34,7,36],[6,22,6,24],[6,30,6,33],[7,30,7,33],[8,26,8,33],[6,26,6,29],[7,26,7,29],[8,17,8,20],[11,23,11,26],[11,27,11,34],[11,35,11,37],[11,0,11,2],[11,3,11,4],[11,5,11,6],[11,7,11,8],[11,9,11,10],[11,11,11,12],[12,0,12,2],[12,3,12,4],[12,5,12,6],[12,7,12,8],[12,9,12,10],[12,11,12,12],[11,13,11,14],[11,15,11,16],[11,17,11,22],[12,31,12,32],[12,33,12,34],[12,35,12,37],[12,13,12,14],[12,15,12,16],[12,17,12,18],[12,19,12,20],[12,21,12,22],[12,23,12,24],[13,3,13,4],[13,5,13,6],[13,7,13,8],[13,9,13,10],[13,11,13,12],[13,13,13,14],[12,25,12,26],[12,27,12,28],[12,29,12,30],[14,36,14,37],[13,15,13,16],[13,17,13,18],[13,19,13,20],[13,21,13,22],[13,23,13,24],[13,25,13,26],[13,27,13,28],[13,29,13,30],[13,31,13,32],[13,33,13,34],[13,35,13,37],[15,36,15,37],[26,36,26,37],[32,36,32,37],[33,36,33,37],[34,0,35,31],[34,32,35,34],[34,35,34,37],[35,35,35,37],[16,36,16,37],[17,36,17,37],[18,36,18,37],[19,36,19,37],[20,36,20,37],[21,36,21,37],[22,36,22,37],[23,36,23,37],[30,36,30,37],[31,36,31,37],[24,36,24,37],[25,36,25,37],[27,36,27,37],[28,36,28,37],[29,36,29,37],[38,0,38,37],[39,0,39,37],[36,0,36,2],[36,3,36,16],[36,17,36,20],[36,21,36,37],[37,0,37,4],[37,5,37,16],[37,17,37,37]]}
["                 \n   ",null,null,null,null,null,null,null,null,null,null,null,null,null,null,null,null,null,null,null,null,null,null,null,null,null,null,null,null,null,null,null,"FT - LABCAM - 78                      \n   Versión 04"]
[]
[]
[]
["PAGINA 1 DE 1",null,null,"PLAN DE MUESTREO",null,null,null,null,null,null,null,null,null,null,null,null,null,null,null,null,null,null,null,null,null,null,null,"N° "]
[]
[null,null,null,null,null,null,null,null,null,null,null,null,null,null,null,null,null,"Fecha Inicial de planeación del muestreo: ",null,null,null,null,null,null,null,null,"Fecha final de planeación del muestreo: "]
["Proyecto: ",null,null,null,null,null,null,null,null,null,null,null,null,null,null,null,null,"Fecha inicial de ejecución del muestreo: ",null,null,null,null,null,null,null,null,"Fecha final de ejecución del muestreo: "]
[null,null,null,null,null,null,null,null,null,null,null,null,null,null,null,null,null,"Fecha ejecutada de muestreo: "]
[]
[null,null,null,"In Situ",null,"Fisicoquímicos",null,null,null,null,null,null,null,null,null,null,null,"Metales Pesados",null,null,null,null,null,"Microbiológicos",null,null,null,"Contaminantes Orgánicos",null,null,null,null,null,null,null,"Otros"]
["Laboratorio: "]
["Tipo de muestra (Sustrato_MS_Des) "]
["No.","Lugar de muestreo ","Punto o Estación de Muestreo"]
[{"$f":"IF(B15<>\"\",1,\"\")","v":""},null,{"$f":"IF(B15=\"\",\"\",INDEX(Variables!$V$2:$W$1268,MATCH('dia 1'!B15,Variables!$V$2:$V$1268,0),2))","v":""}]
[{"$f":"IF(B16<>\"\",A15+1,\"\")","v":""},null,{"$f":"IF(B16=\"\",\"\",INDEX(Variables!$V$2:$W$1268,MATCH('dia 1'!B16,Variables!$V$2:$V$1268,0),2))","v":""}]
[{"$f":"IF(B17<>\"\",A16+1,\"\")","v":""},null,{"$f":"IF(B17=\"\",\"\",INDEX(Variables!$V$2:$W$1268,MATCH('dia 1'!B17,Variables!$V$2:$V$1268,0),2))","v":""}]
["",null,{"$f":"IF(B18=\"\",\"\",INDEX(Variables!$V$2:$W$1268,MATCH('dia 1'!B18,Variables!$V$2:$V$1268,0),2))","v":""}]
["",null,{"$f":"IF(B19=\"\",\"\",INDEX(Variables!$V$2:$W$1268,MATCH('dia 1'!B19,Variables!$V$2:$V$1268,0),2))","v":""}]
["",null,{"$f":"IF(B20=\"\",\"\",INDEX(Variables!$V$2:$W$1268,MATCH('dia 1'!B20,Variables!$V$2:$V$1268,0),2))","v":""}]
["",null,{"$f":"IF(B21=\"\",\"\",INDEX(Variables!$V$2:$W$1268,MATCH('dia 1'!B21,Variables!$V$2:$V$1268,0),2))","v":""}]
["",null,{"$f":"IF(B22=\"\",\"\",INDEX(Variables!$V$2:$W$1268,MATCH('dia 1'!B22,Variables!$V$2:$V$1268,0),2))","v":""}]
["",null,{"$f":"IF(B23=\"\",\"\",INDEX(Variables!$V$2:$W$1268,MATCH('dia 1'!B23,Variables!$V$2:$V$1268,0),2))","v":""}]
["",null,{"$f":"IF(B24=\"\",\"\",INDEX(Variables!$V$2:$W$1268,MATCH('dia 1'!B24,Variables!$V$2:$V$1268,0),2))","v":""}]
["",null,{"$f":"IF(B25=\"\",\"\",INDEX(Variables!$V$2:$W$1268,MATCH('dia 1'!B25,Variables!$V$2:$V$1268,0),2))","v":""}]
["",null,{"$f":"IF(B26=\"\",\"\",INDEX(Variables!$V$2:$W$1268,MATCH('dia 1'!B26,Variables!$V$2:$V$1268,0),2))","v":""}]
["",null,{"$f":"IF(B27=\"\",\"\",INDEX(Variables!$V$2:$W$1268,MATCH('dia 1'!B27,Variables!$V$2:$V$1268,0),2))","v":""}]
["",null,{"$f":"IF(B28=\"\",\"\",INDEX(Variables!$V$2:$W$1268,MATCH('dia 1'!B28,Variables!$V$2:$V$1268,0),2))","v":""}]
["",null,{"$f":"IF(B29=\"\",\"\",INDEX(Variables!$V$2:$W$1268,MATCH('dia 1'!B29,Variables!$V$2:$V$1268,0),2))","v":""}]
["",null,{"$f":"IF(B30=\"\",\"\",INDEX(Variables!$V$2:$W$1268,MATCH('dia 1'!B30,Variables!$V$2:$V$1268,0),2))","v":""}]
{"$rows_left_out":11}
{"sheet":"Hoja2","index":3,"n_rows":0,"n_cols":0,"rows_kept":0,"cut":false,"hidden":true,"merged":[]}

{"sheet":"Variables","index":4,"n_rows":580,"n_cols":38,"rows_kept":580,"cut":false,"hidden":true,"merged":[[0,4,0,5],[0,7,0,8],[0,10,0,11],[0,13,0,14]]}
["Variable","Codigo","Categoria",null,"Organicos",null,null,"Fisicoquimicos",null,null,"In situ",null,null,"Metales Pesados",null,null,"Microbiologicos",null,null,"PROYECTOS",null,"ESTACIONES",null,null,"SUSTRATOS",null,"LABORATORIOS"]
["Acenafteno","Afte","Contaminantes Orgánicos",null,"Acenafteno","Afte",null,"Amonio","NH4",null,"Conductividad","CON",null,"Aluminio (Al)","AL",null,"Clostridium sp.","CLO",null,"REDCAM",null,"C05003002","(Frente) Km después Rio leon - DGI015",null,"AGUA",null,"INVEMAR"]
["Acenaftileno","Atil","Contaminantes Orgánicos",null,"Acenaftileno","Atil",null,"Carbono Organico Total","COT",null,"Oxigeno Disuelto","OD",null,"Arsénico","AS",null,"Coliformes termotolerantes","CTE",null,"BPIN_ESTADISTICAS_OEICAM",null,"P76002005","003-Bahía de Buenaventura",null,"SEDIMENTO",null,"CORALINA"]
["Aerobios Mesofilos","AEM","Contaminantes Orgánicos",null,"Aerobios Mesofilos","AEM",null,"Clorofila a","CLA",null,"pH","PH",null,"Cadmio","CD",null,"Coliformes totales","CTT",null,null,null,"P76002007","024-Bahía de Buenaventura",null,"ORGANISMO",null,"CORPOGUAJIRA"]
["Aldicarb","P57R","Contaminantes Orgánicos",null,"Aldicarb","P57R",null,"Demanda bioquímica de oxígeno","DBO",null,"Porcentaje de Saturación de Oxígeno","%SO",null,"Cobre","CU",null,"Enterococcus fecales","EFE",null,null,null,"P76002012","050-Bahía de Buenaventura",null,null,null,"CORPAMAG"]
["Aldicarb sulfón","P58R","Contaminantes Orgánicos",null,"Aldicarb sulfón","P58R",null,"Grasas y aceites","GA",null,"Potencial Redox","Rdx",null,"Cromo","CR",null,"Escherichia coli","ECO",null,null,null,"P76002018","067-Bahía de Buenaventura",null,null,null,"CRA"]
["Aldrin","ALD2","Contaminantes Orgánicos",null,"Aldrin","ALD2",null,"Materia Orgánica","MO",null,"Salinidad","SAL",null,"Cromo Hexavalente","Cr6+",null,"Pseudomona sp.","PSE",null,null,null,"P76002019","069-Bahía de Buenaventura",null,null,null,"CARDIQUE",null,null,null,null,null,null,null,null," 20 12 1 5694",null,2507024063]
["Aldrines: Endrin+diendrin+aldrin","ALD","Contaminantes Orgánicos",null,"Aldrines: Endrin+diendrin+aldrin","ALD",null,"Nitrato","NO3",null,"Temperatura","TEM",null,"Hierro","FE",null,null,null,null,null,null,"C05002014","1 Km Adentro Río Turbo - Bocatoma - DGI041",null,null,null,"CARSUCRE"]
["alpha-clordano","P01","Contaminantes Orgánicos",null,"alpha-clordano","P01",null,"Nitratos","N-NO3",null,"Transparencia","TRA",null,"Magnesio","MG",null,null,null,null,null,null,"C05003018","1 Km Arriba rio Currulao - DGI012",null,null,null,"CVS"]
["alpha-HCH","P12","Contaminantes Orgánicos",null,"alpha-HCH","P12",null,"Nitrito","NO2",null,"Turbiedad","TUR",null,"Manganeso","MN",null,null,null,null,null,null,"C05003015","1 Km arriba del Río León - DGI014",null,null,null,"CORPOURABA"]
["Antraceno","Antr","Contaminantes Orgánicos",null,"Antraceno","Antr",null,"Nitritos","N-NO2",null,null,null,null,"Mercurio","HG",null,null,null,null,null,null,"C05001012","1 km arriba San Juan - Arboletes-DGI02",null,null,null,"CODECHOCO"]
["Arenas finas - % 125 µm","ArF","Contaminantes Orgánicos",null,"Arenas finas - % 125 µm","ArF",null,"Nitritos+Nitratos","NO2+NO3",null,null,null,null,"Niquel","NI",null,null,null,null,null,null,"C13004027","10 Matunilla 1 Km arriba casita pequeña ladrillo rojo",null,null,null,"CVC"]
["Arenas gruesas - % 0,5 mm","ArGr","Contaminantes Orgánicos",null,"Arenas gruesas - % 0,5 mm","ArGr",null,"Nitrógeno amoniacal","N-NH3",null,null,null,null,"Plomo","PB",null,null,null,null,null,null,"P76002032","113-Bahía de Buenaventura"]
["Arenas medias - % 250 µm","ArM","Contaminantes Orgánicos",null,"Arenas medias - % 250 µm","ArM",null,"Nut. Amonio","N-NH4",null,null,null,null,"Zinc","ZN",null,null,null,null,null,null,"P76002035","132-Bahía de Buenaventura"]
["Arenas muy finas - % 63 µm","ArMF","Contaminantes Orgánicos",null,"Arenas muy finas - % 63 µm","ArMF",null,"Nut. Ortofosfatos","P-PO4",null,null,null,null,null,null,null,null,null,null,null,null,"P76002039","151-Bahía de Buenaventura"]
["Arenas muy gruesas - % 1 mm","ArMG","Contaminantes Orgánicos",null,"Arenas muy gruesas - % 1 mm","ArMG",null,"Ortofosfato","PO4",null,null,null,null,null,null,null,null,null,null,null,null,"P76002042","155-Bahía de Buenaventura"]
["Azoxistrobín","Q12","Contaminantes Orgánicos",null,"Azoxistrobín","Q12",null,"Silicatos","SIL",null,null,null,null,null,null,null,null,null,null,null,null,"P76002044","163-Bahía de Buenaventura"]
["Bendiocarb","P59R","Contaminantes Orgánicos",null,"Bendiocarb","P59R",null,"Silicio","SI",null,null,null,null,null,null,null,null,null,null,null,null,"P76002046","172-Bahía de Buenaventura"]
["Benzo(a) Antraceno","Bant","Contaminantes Orgánicos",null,"Benzo(a) Antraceno","Bant",null,"Solidos disueltos totales","SDT",null,null,null,null,null,null,null,null,null,null,null,null,"P76002048","178-Bahía de Buenaventura"]
["Benzo(a) Pireno","Bapi","Contaminantes Orgánicos",null,"Benzo(a) Pireno","Bapi",null,"Sólidos suspendidos fijos","SSF",null,null,null,null,null,null,null,null,null,null,null,null,"P76002049","183-Bahía de Buenaventura"]
["Benzo(b) Fluoranteno","Bbfl","Contaminantes Orgánicos",null,"Benzo(b) Fluoranteno","Bbfl",null,"Sólidos Suspendidos Totales","SST",null,null,null,null,null,null,null,null,null,null,null,null,"P76002050","189-Bahía de Buenaventura"]
["Benzo(g,h,i) Perilene","Bper","Contaminantes Orgánicos",null,"Benzo(g,h,i) Perilene","Bper",null,"Sólidos suspendidos volátiles","SSV",null,null,null,null,null,null,null,null,null,null,null,null,"P76002051","190-Bahía de Buenaventura"]
["Benzo(k) Fluoranteno","Bkfl","Contaminantes Orgánicos",null,"Benzo(k) Fluoranteno","Bkfl",null,"Sólidos totales","STo",null,null,null,null,null,null,null,null,null,null,null,null,"P76002052","191-Bahía de Buenaventura"]
["beta-HCH","P13","Contaminantes Orgánicos",null,"beta-HCH","P13",null,"Sulfatos","Sulf",null,null,null,null,null,null,null,null,null,null,null,null,"P76002053","192-Bahía de Buenaventura"]
["Bolstar","P69","Contaminantes Orgánicos",null,"Bolstar","P69",null,"Sulfatos","SO4",null,null,null,null,null,null,null,null,null,null,null,null,"P76002054","197-Bahía de Buenaventura"]
["Bromacil","P27","Contaminantes Orgánicos",null,"Bromacil","P27",null,null,null,null,null,null,null,null,null,null,null,null,null,null,null,"P76002055","200-Bahía de Buenaventura"]
["Carbosulfan","P60R","Contaminantes Orgánicos",null,"Carbosulfan","P60R",null,null,null,null,null,null,null,null,null,null,null,null,null,null,null,"P76002057","206-Bahía de Buenaventura"]
["Cis-nanocloro","P19","Contaminantes Orgánicos",null,"Cis-nanocloro","P19",null,null,null,null,null,null,null,null,null,null,null,null,null,null,null,"P76002058","210-Bahía de Buenaventura"]
["Cis-Permetrina","P30","Contaminantes Orgánicos",null,"Cis-Permetrina","P30",null,null,null,null,null,null,null,null,null,null,null,null,null,null,null,"P76002059","211-Bahía de Buenaventura"]
["Clorotalonil","P32","Contaminantes Orgánicos",null,"Clorotalonil","P32",null,null,null,null,null,null,null,null,null,null,null,null,null,null,null,"P76002060","213-Bahía de Buenaventura"]
{"$rows_left_out":551}
{"sheet":"configuracion","index":5,"n_rows":1,"n_cols":6,"rows_kept":1,"cut":false,"hidden":true,"merged":[]}
["General","https://argos.invemar.org.co/api/","Nodo Estaciones ",40,"Estaciones ",2050]