{"text_format":"1","workbook":"xlsx","n_sheets":14,"sheets":["Registro de cambios","configuracion","DIGITADOR","DATOS","REFERENTES","DETALLESVARIABLES","MUESTRAS","OTRAS REFERENCIAS","INSTRUCCIONES","AGD_MUESTREOS","AGD_MUESTRAS","AGD_PARAMETRO","AGD_MUESTRAS_VARIABLES","AGD_AUTORIAS"],"not_rendered":{"charts":0,"images":1,"macros":1,"external_links":0,"defined_names":5,"comments":0,"pivot_tables":0},"unopened":[],"bounds":{"document_bytes":16777216,"sheet_cells":100000,"rows_first":2000,"rows_last":500,"rows_between":2000,"halvings":0,"cell_chars":16384,"cell_head_chars":4096},"cells_cut":0,"cells_raw":0,"read":"whole","date_system":"1900"}

{"sheet":"Registro de cambios","index":0,"n_rows":7,"n_cols":6,"rows_kept":7,"cut":false,"hidden":true,"merged":[[2,0,10,1],[1,3,1,5]]}
[]
[null,null,null,"REGISTRO DE CAMBIOS"]
["SIEMPRE EN LA FILA 4 columna D la ULTIMA VERSION (Para no modificar la formula de la hoja digitador)",null,null,"VERSIÓN No.","CAMBIO REALIZADO","VIGENTE DESDE"]
[null,null,null,"20240614i","Se incluye el botón denominado \"\"validación datos\"\" en la hoja DIGITADOR, proceso encargado de validar la información ingresada.","2024-06-14"]
[null,null,null,"20240606i","*Se modifica el código de descarga referentes, implementando las nevas API, servicios para descarga y carga de datos:\n\n                      https://argos.invemar.org.co/api/","2024-06-06"]
[null,null,null,"20230810i","* Se aumentan el número de filas de la hoja \"DATOS\", ya que el reporte contempla gran número de datos a diferentes profundidades para una estación.\n\n* Se ajusta la hoja configuración, aumentando el número de filas evitando de esta manera los posibles errores que puedan surgir con las macros al momento de estructurar los datos en las diferentes hojas que seran importadas a la BD.","2023-08-10"]
[null,null,null,"20230731i","* Se seleccionó la plantilla de ingreso de datos REDCAM, adaptandola para el ingreso de datos de calidad de aguas de los proyectos con la ANH. Se realiza la configuración de la plantilla para su adecuado funcionamiento.","2023-07-31"]

{"sheet":"configuracion","index":1,"n_rows":72,"n_cols":10,"rows_kept":72,"cut":false,"hidden":true,"merged":[[28,0,35,0],[37,0,42,0],[45,0,45,1],[0,0,2,0],[3,0,5,0],[7,0,8,0],[9,0,15,0],[17,0,21,0],[23,0,26,0]]}
["general","urlServicio","https://argos.invemar.org.co/api/","Nodo Estaciones",40]
[null,"fila de inicio",23]
[null,"fila de fin",420]
["metodologias","Metodologias",800]
[null,"Referentes",100]
[null,"Cantidad maxima de referentes ",10000]
["estaciones/investigadores","proyectos",{"$f":"DIGITADOR!B9","v":""}]
["Lista especies","metodologias"]
[null,"proyectos"]
["MUESTREOS","ID_MUESTREO","DATOS,A"]
[null,"ID_ESTACION","DATOS,C"]
[null,"ID_PROYECTO",{"$f":"DIGITADOR!B9","v":""}]
[null,"ID_METODOLOGIA",800]
[null,"ID_TEMATICAS",201]
[null,"FECHA","DATOS,D"]
[null,"NOTAS","DATOS,M"]
[null,"cantidad",500]
["parametro muestreo","ID_MUESTREO","DATOS,A","DATOS,A","DATOS,A","DATOS,A","DATOS,A","DATOS,A","DATOS,A","DATOS,A"]
[null,"ID_PARAMETRO",118,119,120,127,825,1055,1169,1170]
[null,"ID_METODOLOGIA",800,800,800,800,800,800,800,800]
{"$rows_left_out":53}
{"sheet":"DIGITADOR","index":2,"n_rows":27,"n_cols":4,"rows_kept":27,"cut":false,"hidden":false,"merged":[[25,1,25,2],[26,1,26,2],[11,3,13,9],[5,0,6,0],[0,0,0,1],[0,3,5,9],[24,1,24,2],[6,3,9,9],[10,3,10,9]]}
["Plantilla para la recolección de datos\nmetodología calidad de aguas INVEMAR - ANH",null,null,"Recomendaciones generales: \n- ¡Precaución! No inserte Filas o Columnas.\n- En los casos en que falte un valor a ingresar que provenga de la hoja de referencias, informe para que el administrador del sistema haga las adiciones necesarias.\nEsta es una plantilla programada. Las columnas de color oscuro se llenan automáticamente, principalmente a partir de los contenidos de la hoja de referencias. \nNO UTILICE PUNTO Y COMA (;) en ningún campo, por ser el separador de variables (columnas). Tampoco escriba las unidades de medida, no son necesarias.\n- Para el correcto funcionamiento de la hoja debe estar activa la opción de Excel de ejecutar macros (al abrir la hoja acepte la opción habilitar macros, mensaje de Excel que aparece en la parte superior de la hoja en un recuadro amarillo). La extensión del archivo debe ser .xlsm\n- Se recomienda renombrar el archivo de la siguiente manera: Departamento_proyecto_sustrato-númeromuestreo_año.xlsm"]
["CODIGO:",{"$f":"IF(B3=\"\",\"\",INDEX(REFERENTES!$AK:$AL,MATCH(DIGITADOR!B3,REFERENTES!$AL:$AL,0),1))","v":""}]
["NOMBRE:"]
[]
["Versión Plantilla:",{"$f":"'Registro de cambios'!D4","v":"20240614i"}]
["Fecha en la que ingresa los datos en esta hoja","DD/MM/AAAA"]
[null,"3000-01-01",null,"* Instrucciones para el adecuado diligenciamiento y uso de la plantilla:\n\n- Previo al iniciar el llenado de la plantilla, verifique que tenga la versión vigente, descárguela si es necesario.\n- presione el botón \"Descargar referentes\" para que los referentes de ésta plantilla sean actualizados.\n- Diligencie los datos en la hoja \"VALIDACION\"\n- Presionar el botón \"Estandarizar datos\" para copiar los datos a la hoja \"DATOS\"\n- Presionar el botón \"Validacion datos\" para validar los datos diligenciados\n- Luego de validar los datos con éxito, haga clic sobre el botón \"Generar tablas\" para que los datos sean organizados antes de cargarlos al Sistema de Información.\n- Antes de presionar el botón \"\"Generar tablas\"\" verifique que:\na. No haya celdas con valores como \"#N/A\" o \"#¡REF!\".\nb. No se estén aplicando filtros en la hoja de datos.\nPara transferir los datos de esta plantilla a la base de datos del sistema, presione el botón \"Cargar datos\"."]
[]
["Cod_Proyecto:",{"$f":"IF(B10<>\"\",INDEX('OTRAS REFERENCIAS'!G6:H30,MATCH(DIGITADOR!B10,'OTRAS REFERENCIAS'!H6:H30,0),1),\"\")","v":""}]
["Nombre:"]
["Nombre del archivo:",{"$f":"MID(CELL(\"FILENAME\",N50),FIND(\"[\",CELL(\"FILENAME\",N50))+1,   FIND(\"]\",CELL(\"FILENAME\",N50))-FIND(\"[\",CELL(\"FILENAME\",N50))-1)","v":"REDCAM_ANH_20240614i.xlsm"},null,"Si requiere ayuda contacte a:\nJefe Laboratorio Servicio de información (jefatura.labsis@invemar.org.co)  - Apoyo técnico software"]
["DOI Metadato:",null,null,"El custodio de los datos es el único autorizado para distribuir este conjunto de datos. El observador y el digitador se comprometen a tomar las medidas necesarias para salvaguardar este conjunto de datos de modo que copia de los mismos no sean obtenidas y/o usadas por terceros no relacionados con el propósito para la cual se recolectó."]
["Fuente Plantilla:","http://cinto.invemar.org.co/download/Plantillas_ARGOS_Plus/"]
[]
[]
[]
[]
[]
[null,"REGISTROS GENERADOS","REGISTROS CARGADOS"]
[{"$f":"configuracion!A47","v":"MUESTREOS"},{"$f":"configuracion!B47","v":0},{"$f":"configuracion!C47","v":0}]
{"$rows_left_out":8}
{"sheet":"DATOS","index":3,"n_rows":400,"n_cols":75,"rows_kept":400,"cut":false,"hidden":false,"merged":[[20,12,21,12],[20,13,21,13],[0,73,4,74],[0,4,4,72],[5,4,5,74],[9,8,9,12],[8,8,8,12],[7,6,7,13],[20,4,21,4],[20,5,21,5],[20,6,21,6],[20,7,21,7],[20,9,21,9],[20,10,21,10],[20,11,21,11],[20,8,21,8]]}
[null,null,null,null,null,null,null,null,null,null,null,null,null,null,null,null,null,null,null,null,null,null,null,null,null,null,null,null,null,null,null,null,null,null,null,null,null,null,null,null,null,null,null,null,null,null,null,null,null,null,null,null,null,null,null,null,null,null,null,null,null,null,null,null,null,null,null,null,null,null,null,null,null,"FT-ESC-002\nVersión: 01"]
[]
[]
[]
[]
[null,null,null,null,"REPORTE DATOS DE MUESTREO"]
[]
[{"$f":"NOW()","v":"2024-06-14T07:53:05.160"}]
[{"$f":"CONCATENATE(YEAR(A8),TEXT(A8,\"mmddhhmmss\"))","v":"20240614075305"},null,null,null,null,null,"Entidad:",{"$f":"IF(I9=\"\",\"\",INDEX(REFERENTES!$AB:$AC,MATCH(DATOS!I9,REFERENTES!$AC:$AC,0),1))","v":""}]
[null,null,null,null,null,null,"Proyecto:",{"$f":"IF(I10=\"\",\"\",INDEX(REFERENTES!$A$2:$B$60,MATCH(DATOS!I10,REFERENTES!$B$2:$B$60,0),1))","v":""}]
[null,null,null,null,null,null,"Responsables: ",{"$f":"IF(I11<>\"\",INDEX(REFERENTES!AK:AL,MATCH(I11,REFERENTES!$AL:$AL,0),1),\"\")","v":""},null,{"$f":"IF(K11<>\"\",INDEX(REFERENTES!AK:AL,MATCH(K11,REFERENTES!$AL:$AL,0),1),\"\")","v":""},null,{"$f":"IF(M11<>\"\",INDEX(REFERENTES!AK:AL,MATCH(M11,REFERENTES!$AL:$AL,0),1),\"\")","v":""}]
[null,null,null,null,null,null,"Rol:",{"$f":"IF(I12<>\"\",INDEX('OTRAS REFERENCIAS'!D6:E11,MATCH(I12,'OTRAS REFERENCIAS'!E6:E10,0),1),\"\")","v":""},null,{"$f":"IF(K12<>\"\",INDEX('OTRAS REFERENCIAS'!D6:E11,MATCH(K12,'OTRAS REFERENCIAS'!E6:E10,0),1),\"\")","v":""},null,{"$f":"IF(M12<>\"\",INDEX('OTRAS REFERENCIAS'!D6:E11,MATCH(M12,'OTRAS REFERENCIAS'!E6:E10,0),1),\"\")","v":""}]
[]
[null,null,null,null,null,null,null,{"$f":"IF(H12<>\"\",1,\"\")","v":""},null,{"$f":"IF(J12<>\"\",IF(J12=H12,H14+1,1),\"\")","v":""},null,{"$f":"IF(L12<>\"\",IF(L12=J12,J14+1,IF(L12=H12,H14+1,1)))","v":false},{"$f":"IF(H12<>\"\",MAX(H14:L14)+1,\"\")","v":""}]
[null,null,null,null,null,null,null,null,null,null,null,null,null,null,"variable:"]
[null,null,null,null,null,null,null,null,null,null,null,null,null,null,"consecutivo:"]
[null,null,null,null,null,null,null,null,null,null,null,null,null,null,"codigo unidad:"]
[null,null,null,null,null,null,null,null,null,null,null,null,null,null,"metodo:"]
[null,null,null,null,null,null,null,null,null,null,null,null,null,null,"validacion"]
[null,null,null,null,null,null,null,null,null,null,null,null,null,null,"Limite de deteccion"]
{"$rows_left_out":381}
{"sheet":"REFERENTES","index":4,"n_rows":0,"n_cols":0,"rows_kept":0,"cut":false,"hidden":false,"merged":[[0,37,0,38]]}

{"sheet":"DETALLESVARIABLES","index":5,"n_rows":23,"n_cols":8,"rows_kept":23,"cut":false,"hidden":true,"merged":[]}
[]
[]
[]
[]
[]
[]
[]
[]
[]
[]
[]
[]
[]
[]
[]
[]
[]
[]
[]
[]
{"$rows_left_out":4}
{"sheet":"MUESTRAS","index":6,"n_rows":23,"n_cols":4,"rows_kept":23,"cut":false,"hidden":true,"merged":[]}
[]
[]
[]
[]
[]
[]
[]
[]
[]
[]
[]
[]
[]
[]
[]
[]
[]
[]
[]
[]
{"$rows_left_out":4}
{"sheet":"OTRAS REFERENCIAS","index":7,"n_rows":200,"n_cols":13,"rows_kept":200,"cut":false,"hidden":false,"merged":[[0,0,2,10],[4,0,4,1],[4,3,4,4],[4,6,4,7],[4,10,4,12]]}
["Estas son listas para variables con valores que no se encuentran codificados, pero que deben manejarse de manera estandarizada. \nSi se requiere agregar un valor nuevo hagalo debajo de la lista correspondiente"]
[]
[]
[]
["TEMPORADA",null,null,"ROLES",null,null,"PROYECTOS",null,null,null,"ESTACIONES"]
["MES","VALOR",null,10,"Colectó muestra",null,2002,"ANH Exploracion I",null,null,{"$f":"IF(REFERENTES!AE2<>\"\",REFERENTES!AE2,\"\")","v":""},{"$f":"IF(REFERENTES!AF2<>\"\",REFERENTES!AF2&\" - \"&REFERENTES!AG2,\"\")","v":""},{"$f":"IF(REFERENTES!AI2<>\"\",REFERENTES!AI2,\"\")","v":""}]
[1,"S",null,11,"Procesó muestra",null,2068,"ANH Exploracion II",null,null,{"$f":"IF(REFERENTES!AE3<>\"\",REFERENTES!AE3,\"\")","v":""},{"$f":"IF(REFERENTES!AF3<>\"\",REFERENTES!AF3&\" - \"&REFERENTES!AG3,\"\")","v":""},{"$f":"IF(REFERENTES!AI3<>\"\",REFERENTES!AI3,\"\")","v":""}]
[2,"S",null,3472,"Verificó  resultados -Jefe Sección",null,2148,"ANH ARC Jamaica",null,null,{"$f":"IF(REFERENTES!AE4<>\"\",REFERENTES!AE4,\"\")","v":""},{"$f":"IF(REFERENTES!AF4<>\"\",REFERENTES!AF4&\" - \"&REFERENTES!AG4,\"\")","v":""},{"$f":"IF(REFERENTES!AI4<>\"\",REFERENTES!AI4,\"\")","v":""}]
[3,"S",null,3473,"Verificó resultados - Jefe Laboratorio",null,2153,"ANH Caladeros de Pesca ",null,null,{"$f":"IF(REFERENTES!AE5<>\"\",REFERENTES!AE5,\"\")","v":""},{"$f":"IF(REFERENTES!AF5<>\"\",REFERENTES!AF5&\" - \"&REFERENTES!AG5,\"\")","v":""},{"$f":"IF(REFERENTES!AI5<>\"\",REFERENTES!AI5,\"\")","v":""}]
[4,"S",null,3474,"Verificó resutados -  Jefe Calidad",null,2207,"ANH Tumaco offshore 6 y 7",null,null,{"$f":"IF(REFERENTES!AE6<>\"\",REFERENTES!AE6,\"\")","v":""},{"$f":"IF(REFERENTES!AF6<>\"\",REFERENTES!AF6&\" - \"&REFERENTES!AG6,\"\")","v":""},{"$f":"IF(REFERENTES!AI6<>\"\",REFERENTES!AI6,\"\")","v":""}]
[5,"S",null,null,null,null,3000,"ANH GUA OFF 3",null,null,{"$f":"IF(REFERENTES!AE7<>\"\",REFERENTES!AE7,\"\")","v":""},{"$f":"IF(REFERENTES!AF7<>\"\",REFERENTES!AF7&\" - \"&REFERENTES!AG7,\"\")","v":""},{"$f":"IF(REFERENTES!AI7<>\"\",REFERENTES!AI7,\"\")","v":""}]
[6,"S",null,null,null,null,3304,"ANH Pastos Marinos. PRY-BEM-012-15_T2",null,null,{"$f":"IF(REFERENTES!AE8<>\"\",REFERENTES!AE8,\"\")","v":""},{"$f":"IF(REFERENTES!AF8<>\"\",REFERENTES!AF8&\" - \"&REFERENTES!AG8,\"\")","v":""},{"$f":"IF(REFERENTES!AI8<>\"\",REFERENTES!AI8,\"\")","v":""}]
[7,"L",null,null,null,null,3023,"ANH COL 4 y 5",null,null,{"$f":"IF(REFERENTES!AE9<>\"\",REFERENTES!AE9,\"\")","v":""},{"$f":"IF(REFERENTES!AF9<>\"\",REFERENTES!AF9&\" - \"&REFERENTES!AG9,\"\")","v":""},{"$f":"IF(REFERENTES!AI9<>\"\",REFERENTES!AI9,\"\")","v":""}]
[8,"L",null,null,null,null,3306,"ANH Corales de profundidad",null,null,{"$f":"IF(REFERENTES!AE10<>\"\",REFERENTES!AE10,\"\")","v":""},{"$f":"IF(REFERENTES!AF10<>\"\",REFERENTES!AF10&\" - \"&REFERENTES!AG10,\"\")","v":""},{"$f":"IF(REFERENTES!AI10<>\"\",REFERENTES!AI10,\"\")","v":""}]
[9,"L",null,null,null,null,3303,"ANH COL 1 y COL 2 Fase I PRY-BEM-012-15_T1",null,null,{"$f":"IF(REFERENTES!AE11<>\"\",REFERENTES!AE11,\"\")","v":""},{"$f":"IF(REFERENTES!AF11<>\"\",REFERENTES!AF11&\" - \"&REFERENTES!AG11,\"\")","v":""},{"$f":"IF(REFERENTES!AI11<>\"\",REFERENTES!AI11,\"\")","v":""}]
[10,"L",null,null,null,null,3343,"ANH Pastos Marinos Fase 2 Guajira y Chocó",null,null,{"$f":"IF(REFERENTES!AE12<>\"\",REFERENTES!AE12,\"\")","v":""},{"$f":"IF(REFERENTES!AF12<>\"\",REFERENTES!AF12&\" - \"&REFERENTES!AG12,\"\")","v":""},{"$f":"IF(REFERENTES!AI12<>\"\",REFERENTES!AI12,\"\")","v":""}]
[11,"L",null,null,null,null,3389,"ANH COL 3",null,null,{"$f":"IF(REFERENTES!AE13<>\"\",REFERENTES!AE13,\"\")","v":""},{"$f":"IF(REFERENTES!AF13<>\"\",REFERENTES!AF13&\" - \"&REFERENTES!AG13,\"\")","v":""},{"$f":"IF(REFERENTES!AI13<>\"\",REFERENTES!AI13,\"\")","v":""}]
[12,"S",null,null,null,null,3031,"ANH RC4 RC5",null,null,{"$f":"IF(REFERENTES!AE14<>\"\",REFERENTES!AE14,\"\")","v":""},{"$f":"IF(REFERENTES!AF14<>\"\",REFERENTES!AF14&\" - \"&REFERENTES!AG14,\"\")","v":""},{"$f":"IF(REFERENTES!AI14<>\"\",REFERENTES!AI14,\"\")","v":""}]
[null,null,null,null,null,null,3592,"ANH Baja Guajira",null,null,{"$f":"IF(REFERENTES!AE15<>\"\",REFERENTES!AE15,\"\")","v":""},{"$f":"IF(REFERENTES!AF15<>\"\",REFERENTES!AF15&\" - \"&REFERENTES!AG15,\"\")","v":""},{"$f":"IF(REFERENTES!AI15<>\"\",REFERENTES!AI15,\"\")","v":""}]
[null,null,null,null,null,null,3571,"ANH CHO-OFF-5 MSA",null,null,{"$f":"IF(REFERENTES!AE16<>\"\",REFERENTES!AE16,\"\")","v":""},{"$f":"IF(REFERENTES!AF16<>\"\",REFERENTES!AF16&\" - \"&REFERENTES!AG16,\"\")","v":""},{"$f":"IF(REFERENTES!AI16<>\"\",REFERENTES!AI16,\"\")","v":""}]
{"$rows_left_out":181}
{"sheet":"INSTRUCCIONES","index":8,"n_rows":123,"n_cols":6,"rows_kept":123,"cut":false,"hidden":false,"merged":[]}
["Instrucciones de diligenciamiento de la plantilla"]
["CASILLA","DESCRIPCIÓN"]
["ENTIDAD","Entidad que reporta los datos"]
["PROYECTO","seleccione el proyecto al cual se relacionan los datos"]
["RESPONSABLE(S)","Indique el nombre del responsable e identifique claramente las personas que verificaron la calidad de los datos."]
[]
["CÓDIGO","Código de la estación muestreada"]
["ESTACIÓN","Nombre de la estación muestreada"]
["SUSTRATO","Sustrato o matriz para el analito"]
["FECHA","Fecha en la que tomaron la muestra"]
["HORA","Hora en la que tomaron la muestra"]
["PROFUNDIDAD","Profundidad cualitativa que se tomaron las muestras"]
["Variable","Código de la variable que se va a reportar"]
["Unidad","Unidad de medida. Utilice solo las medidas estandar de REDCAM e indique en la nota la unidad de medida del instrumento, sobre todo cuando es de precision inferior"]
["Límite Detección","Cuando el valor no sea detectado escriba ND. En los otros casos en los que no fue posible determinar el valor de concetración utilice >LC o <LC (Limite de cuantificación) si puede documente los resutlados de calibración del blanco para el instrumento"]
["OBSERVACIONES","Indique las novedades en Campo"]
[]
["Nota aclaratoria: "]
[]
[]
{"$rows_left_out":104}
{"sheet":"AGD_MUESTREOS","index":9,"n_rows":0,"n_cols":0,"rows_kept":0,"cut":false,"hidden":true,"merged":[]}

{"sheet":"AGD_MUESTRAS","index":10,"n_rows":0,"n_cols":0,"rows_kept":0,"cut":false,"hidden":true,"merged":[]}

{"sheet":"AGD_PARAMETRO","index":11,"n_rows":0,"n_cols":0,"rows_kept":0,"cut":false,"hidden":true,"merged":[]}

{"sheet":"AGD_MUESTRAS_VARIABLES","index":12,"n_rows":0,"n_cols":0,"rows_kept":0,"cut":false,"hidden":true,"merged":[]}

{"sheet":"AGD_AUTORIAS","index":13,"n_rows":0,"n_cols":0,"rows_kept":0,"cut":false,"hidden":true,"merged":[]}