{"text_format":"1","workbook":"xlsx","n_sheets":14,"sheets":["Registro de cambios","configuracion","DIGITADOR","REFERENTES","DATOS","DETALLESVARIABLES","MUESTRAS","OTRAS REFERENCIAS","INSTRUCCIONES","AGD_MUESTREOS","AGD_PARAMETRO","AGD_MUESTRAS","AGD_MUESTRAS_VARIABLES","AGD_AUTORIAS"],"not_rendered":{"charts":0,"images":1,"macros":1,"external_links":0,"defined_names":5,"comments":0,"pivot_tables":0},"unopened":[],"bounds":{"document_bytes":16777216,"sheet_cells":100000,"rows_first":2000,"rows_last":500,"rows_between":2000,"halvings":0,"cell_chars":16384,"cell_head_chars":4096},"cells_cut":0,"cells_raw":0,"read":"whole","date_system":"1900"}

{"sheet":"Registro de cambios","index":0,"n_rows":17,"n_cols":6,"rows_kept":17,"cut":false,"hidden":true,"merged":[[2,0,9,1],[1,3,1,5]]}
[]
[null,null,null,"REGISTRO DE CAMBIOS"]
["SIEMPRE EN LA FILA 4 columna D la ULTIMA VERSION (Para no modificar la formula de la hoja digitador)",null,null,"VERSIÓN No.","CAMBIO REALIZADO","VIGENTE DESDE"]
[null,null,null,"20240614i","* Se modifica el código de descarga referentes y carga de datos, implementado las nuevas API, servicios para descarga y carga de datos:\n\nhttps://argos.invemar.org.co/api/\n\n* Se incluye el botón denominado \"validación datos\" en la hoja DIGITADOR, proceso encargado de validar la información ingresada.","2024-06-13"]
[null,null,null,"20211112i","* Se realizan formulas en la hoja \"DATOS\" - \"Fila 14\" con condiciones que asigna el orden con el rol de la persona, priorizando al personal que colecto, proceso y verificó los resultados y por ultimo a la persona que digitalizó los datos, con el fin de que en la vista materializada se refleje de primero la entidad la cual colecto las muestras y reporto los datos y así conocer que los datos pertenecen a la primera entidad que se observa en la columna","2021-11-12"]
[null,null,null,"20210908m","Error en la consulta de referente, se actualizo en la macro la forma en que concatena la variable consulta = consul1 + consul2 + consul3 + consul4 + consul5 + consul6","2021-09-08"]
[null,null,null,"20210707i","* Se incluyen reglas de validación en los datos que son requeridos para el ingreso al sistema, la cual si hace falta un dato que es obligarorio le envia un mensaje indicando la celda que esta null.","2021-07-07"]
[null,null,null,"20210322i","Se incluye reglas de validación en los datos que son requeridos para el ingreso al sistema (Información de ingreso de datos)","2021-03-22"]
[null,null,null,"20200828i","*Se incluye en el codigo la conversión del valor de la muestra que se encuentre en el limite de cuantificación, si el valor viene reportado menor \"<\" al limite cuantificación se ingresa en la concentración \"<LC\", si el valor viene reportado mayor al limite cuantificación se ingresa en la concentración como \">LC\".\n* Se corrige error en el codigo el mapeo del valor \"ES_REPLICA\", la cual no estaba ingresandolo a todas las muestras.\n*Se elimina la validación en la hoja configuración y en la hoja \"DATOS\".\n*2. Se modifica el código donde se tenía que ingresar un espacio en blanco al final de los valores menores y mayores al límite de cuantificación para que este sea mapeado, ahora se ingresa el valor sin espacios y se hacen las respectivas conversiones.\n\nSe introducen los roles por investigador para el control de calidad de los datos","2020-08-25"]
[null,null,null,"20200107m","La metodologia 800 maneja 3 plantillas para control de version es necesaria que todas esten en la misma version","2020-02-07"]
[null,null,null,"20200103i","Para trazabilididad la hoja se incluye el nombre del archivo fuente y la posibilidad de anotar el DOI principal del metadato\nPor usabilidad las pestañas que son de interes para el usuario son las verdes\nSi se define mas de un proyecto los referentes de estaciones e investigadores se descargan consecutivo en las mismas columnas\nSe controla la versión para la plantilla mediante comparación dato en AGLOV de la BD.","2020-01-30"]
[null,null,null,"20191121m","Se corrigio error en el codigo  que mapea los datos para registros  maestro detalle del modo apropiado: solo uno por estacion.\nConfiguracion se documenta, almacena la ultima fila con datos para optimizar tiempo de mapeo","2019-11-21"]
[null,null,null,"20190710i","Se agrega la hoja de \"VALIDACION\"","2019-07-10"]
[null,null,null,"20181218m","Se elimina la fecha del encabezado.","2018-12-18"]
[null,null,null,"20181212m","Se agregan columnas para que la plantilla contenga la misma información que la plantilla de REDCAM.","2018-12-12"]
[null,null,null,"20181114i","Se amplian la capacidad para ingresar 5000 registros en la hoja de datos y se agrega el campo Código SISLAB.","2018-11-14"]
[null,null,null,"20181102i","Se crea la primera versión de ésta plantilla.","2018-11-02"]

{"sheet":"configuracion","index":1,"n_rows":71,"n_cols":10,"rows_kept":71,"cut":false,"hidden":true,"merged":[[28,0,35,0],[37,0,42,0],[45,0,45,1],[0,0,2,0],[3,0,5,0],[7,0,8,0],[9,0,15,0],[17,0,21,0],[23,0,26,0]]}
["general","urlServicio","https://argos.invemar.org.co/api/","TIPO_NODO_EST",40]
[null,"fila de inicio",23]
[null,"fila de fin",500]
["metodologias","Metodologias",800]
[null,"Referentes",100]
[null,"Cantidad maxima de referentes ",10000]
["estaciones/investigadores","proyectos",{"$f":"DIGITADOR!B9","v":2050}]
["Lista especies","metodologias"]
[null,"proyectos"]
["MUESTREOS","ID_MUESTREO","DATOS,A"]
[null,"ID_ESTACION","DATOS,C"]
[null,"ID_PROYECTO",{"$f":"DIGITADOR!B9","v":2050}]
[null,"ID_METODOLOGIA",800]
[null,"ID_TEMATICAS",201]
[null,"FECHA","DATOS,D"]
[null,"NOTAS","DATOS,M"]
[null,"cantidad",150]
["parametro muestreo","ID_MUESTREO","DATOS,A","DATOS,A","DATOS,A","DATOS,A","DATOS,A","DATOS,A","DATOS,A","DATOS,A"]
[null,"ID_PARAMETRO",118,119,120,127,825,1055,1169,1170]
[null,"ID_METODOLOGIA",800,800,800,800,800,800,800,800]
{"$rows_left_out":52}
{"sheet":"DIGITADOR","index":2,"n_rows":27,"n_cols":4,"rows_kept":27,"cut":false,"hidden":false,"merged":[[25,1,25,2],[26,1,26,2],[11,3,13,9],[5,0,6,0],[0,0,0,1],[0,3,5,9],[24,1,24,2],[10,3,10,9],[6,3,9,9]]}
["Plantilla para la recolección de datos para la Calidad Ambiental marina",null,null,"Recomendaciones generales: \n- ¡Precaución! No inserte Filas o Columnas.\n- En los casos en que falte un valor a ingresar que provenga de la hoja de referencias, informe para que el administrador del sistema haga las adiciones necesarias.\nEsta es una plantilla programada. Las columnas de color oscuro se llenan automáticamente, principalmente a partir de los contenidos de la hoja de referencias. \nNO UTILICE PUNTO Y COMA (;) en ningún campo, por ser el separador de variables (columnas). Tampoco escriba las unidades de medida, no son necesarias.\n- Para el correcto funcionamiento de la hoja debe estar activa la opción de Excel de ejecutar macros (al abrir la hoja acepte la opción habilitar macros, mensaje de Excel que aparece en la parte superior de la hoja en un recuadro amarillo). La extensión del archivo debe ser .xlsm\n- Se recomienda renombrar el archivo de la siguiente manera: Departamento_proyecto_sustrato-númeromuestreo_año.xlsm"]
["CODIGO:",{"$f":"IF(B3=\"\",\"\",INDEX(REFERENTES!$AK:$AL,MATCH(DIGITADOR!B3,REFERENTES!$AL:$AL,0),1))","v":""}]
["NOMBRE:"]
[]
["Versión Plantilla:",{"$f":"'Registro de cambios'!D4","v":"20240614i"}]
["Fecha en la que ingresa los datos en esta hoja","DD/MM/AAAA"]
[null,"3000-01-01",null,"* Instrucciones para el adecuado diligenciamiento y uso de la plantilla:\n\n- Previo al iniciar el llenado de la plantilla, verifique que tenga la versión vigente, descárguela si es necesario.\n- presione el botón \"Descargar referentes\" para que los referentes de ésta plantilla sean actualizados.\n- Diligencie los datos en la hoja \"VALIDACION\"\n- Presionar el botón \"Estandarizar datos\" para copiar los datos a la hoja \"DATOS\"\n- Presionar el botón \"Validacion datos\" para validar los datos diligenciados\n- Luego de validar los datos con éxito, haga clic sobre el botón \"Generar tablas\" para que los datos sean organizados antes de cargarlos al Sistema de Información.\n- Antes de presionar el botón \"Generar tablas\" verifique que:\na. No haya celdas con valores como \"#N/A\" o \"#¡REF!\".\nb. No se estén aplicando filtros en la hoja de datos.\nPara transferir los datos de esta plantilla a la base de datos del sistema, presione el botón \"Cargar datos\"."]
[]
["Cod_Proyecto:",2050]
["Nombre:","REDCAM"]
["Nombre del archivo:",{"$f":"MID(CELL(\"FILENAME\",N50),FIND(\"[\",CELL(\"FILENAME\",N50))+1,   FIND(\"]\",CELL(\"FILENAME\",N50))-FIND(\"[\",CELL(\"FILENAME\",N50))-1)","v":"REDCAM_20240613i.xlsm"},null,"Si requiere ayuda contacte a:\nJefe Laboratorio Servicios de información (jefatura.labsis@invemar.org.co) - Apoyo técnico software"]
["DOI Metadato:",null,null,"El custodio de los datos es el único autorizado para distribuir este conjunto de datos. El observador y el digitador se comprometen a tomar las medidas necesarias para salvaguardar este conjunto de datos de modo que copia de los mismos no sean obtenidas y/o usadas por terceros no relacionados con el propósito para la cual se recolectó."]
["Fuente Plantilla:","http://cinto.invemar.org.co/download/Plantillas_ARGOS_Plus/"]
[]
[]
[]
[]
[]
[null,"REGISTROS GENERADOS","REGISTROS CARGADOS"]
[{"$f":"configuracion!A47","v":"MUESTREOS"},{"$f":"configuracion!B47","v":0},{"$f":"configuracion!C47","v":0}]
{"$rows_left_out":8}
{"sheet":"REFERENTES","index":3,"n_rows":0,"n_cols":0,"rows_kept":0,"cut":false,"hidden":false,"merged":[]}

{"sheet":"DATOS","index":4,"n_rows":123,"n_cols":76,"rows_kept":123,"cut":false,"hidden":false,"merged":[[9,8,9,12],[8,8,8,12],[7,6,7,13],[20,4,21,4],[20,5,21,5],[0,75,4,75],[0,6,4,74],[5,11,5,75],[5,6,5,10],[20,6,21,6],[20,7,21,7],[20,9,21,9],[20,10,21,10],[20,11,21,11],[20,8,21,8],[20,12,21,12],[20,13,21,13]]}
[null,null,null,null,null,null,null,null,null,null,null,null,null,null,null,null,null,null,null,null,null,null,null,null,null,null,null,null,null,null,null,null,null,null,null,null,null,null,null,null,null,null,null,null,null,null,null,null,null,null,null,null,null,null,null,null,null,null,null,null,null,null,null,null,null,null,null,null,null,null,null,null,null,null,null,"FT-ESC-002\nVersión: 01"]
[]
[]
[]
[]
[null,null,null,null,null,null,"Página 1 DE 1",null,null,null,null,"REPORTE DATOS DE MUESTREO"]
[]
[{"$f":"NOW()","v":"2024-06-14T16:06:27.510"}]
[{"$f":"CONCATENATE(YEAR(A8),TEXT(A8,\"mmddhhmmss\"))","v":"20240614160628"},null,null,null,null,null,"Entidad:",{"$f":"IF(I9=\"\",\"\",INDEX(REFERENTES!$AB:$AC,MATCH(DATOS!I9,REFERENTES!$AC:$AC,0),1))","v":""}]
[null,null,null,null,null,null,"Proyecto:",{"$f":"IF(I10=\"\",\"\",INDEX(REFERENTES!$A$2:$B$33,MATCH(DATOS!I10,REFERENTES!$B$2:$B$33,0),1))","v":""}]
[null,null,null,null,null,null,"Responsables: ",{"$f":"IF(I11<>\"\",INDEX(REFERENTES!AK:AL,MATCH(I11,REFERENTES!$AL:$AL,0),1),\"\")","v":""},null,{"$f":"IF(K11<>\"\",INDEX(REFERENTES!AK:AL,MATCH(K11,REFERENTES!$AL:$AL,0),1),\"\")","v":""},null,{"$f":"IF(M11<>\"\",INDEX(REFERENTES!AK:AL,MATCH(M11,REFERENTES!$AL:$AL,0),1),\"\")","v":""}]
[null,null,null,null,null,null,"Rol:",{"$f":"IF(I12<>\"\",INDEX('OTRAS REFERENCIAS'!D6:E11,MATCH(I12,'OTRAS REFERENCIAS'!E6:E10,0),1),\"\")","v":""},null,{"$f":"IF(K12<>\"\",INDEX('OTRAS REFERENCIAS'!D6:E11,MATCH(K12,'OTRAS REFERENCIAS'!E6:E10,0),1),\"\")","v":""},null,{"$f":"IF(M12<>\"\",INDEX('OTRAS REFERENCIAS'!D6:E11,MATCH(M12,'OTRAS REFERENCIAS'!E6:E10,0),1),\"\")","v":""}]
[]
[null,null,null,null,null,null,null,{"$f":"IF(H12<>\"\",1,\"\")","v":""},null,{"$f":"IF(J12<>\"\",IF(J12=H12,H14+1,1),\"\")","v":""},null,{"$f":"IF(L12<>\"\",IF(L12=J12,J14+1,IF(L12=H12,H14+1,1)))","v":false},{"$f":"IF(H12<>\"\",MAX(H14:L14)+1,\"\")","v":""}]
[null,null,null,null,null,null,null,null,null,null,null,null,null,null,"variable:"]
[null,null,null,null,null,null,null,null,null,null,null,null,null,null,"consecutivo:"]
[null,null,null,null,null,null,null,null,null,null,null,null,null,null,"codigo unidad:"]
[null,null,null,null,null,null,null,null,null,null,null,null,null,null,"metodo:"]
[null,null,null,null,null,null,null,null,null,null,null,null,null,null,"validacion"]
[null,null,null,null,null,null,null,null,null,null,null,null,null,null,"Limite de deteccion"]
{"$rows_left_out":104}
{"sheet":"DETALLESVARIABLES","index":5,"n_rows":23,"n_cols":8,"rows_kept":23,"cut":false,"hidden":true,"merged":[]}
[]
[]
[]
[]
[]
[]
[]
[]
[]
[]
[]
[]
[]
[]
[]
[]
[]
[]
[]
[]
{"$rows_left_out":4}
{"sheet":"MUESTRAS","index":6,"n_rows":23,"n_cols":4,"rows_kept":23,"cut":false,"hidden":true,"merged":[]}
[]
[]
[]
[]
[]
[]
[]
[]
[]
[]
[]
[]
[]
[]
[]
[]
[]
[]
[]
[]
{"$rows_left_out":4}
{"sheet":"OTRAS REFERENCIAS","index":7,"n_rows":18,"n_cols":5,"rows_kept":18,"cut":false,"hidden":false,"merged":[[0,0,2,10],[4,0,4,1],[4,3,4,4]]}
["Estas son listas para variables con valores que no se encuentran codificados, pero que deben manejarse de manera estandarizada. \nSi se requiere agregar un valor nuevo hagalo debajo de la lista correspondiente"]
[]
[]
[]
["TEMPORADA",null,null,"ROLES"]
["MES","VALOR",null,10,"Colectó muestra"]
[1,"S",null,11,"Procesó muestra"]
[2,"S",null,3472,"Verificó  resultados -Jefe Sección"]
[3,"S",null,3473,"Verificó resultados - Jefe Laboratorio"]
[4,"S",null,3474,"Verificó resutados -  Jefe Calidad"]
[5,"S"]
[6,"S"]
[7,"L"]
[8,"L"]
[9,"L"]
[10,"L"]
[11,"L"]
[12,"S"]

{"sheet":"INSTRUCCIONES","index":8,"n_rows":123,"n_cols":6,"rows_kept":123,"cut":false,"hidden":false,"merged":[]}
["Instrucciones de diligenciamiento de la plantilla"]
["CASILLA","DESCRIPCIÓN"]
["ENTIDAD","Entidad que reporta los datos"]
["PROYECTO","seleccione el proyecto al cual se relacionan los datos"]
["RESPONSABLE(S)","Indique el nombre del responsable e identifique claramente las personas que verificaron la calidad de los datos."]
[]
["CÓDIGO","Código de la estación muestreada"]
["ESTACIÓN","Nombre de la estación muestreada"]
["SUSTRATO","Sustrato o matriz para el analito"]
["FECHA","Fecha en la que tomaron la muestra"]
["HORA","Hora en la que tomaron la muestra"]
["PROFUNDIDAD","Profundidad cualitativa que se tomaron las muestras"]
["Variable","Código de la variable que se va a reportar"]
["Unidad","Unidad de medida. Utilice solo las medidas estandar de REDCAM e indique en la nota la unidad de medida del instrumento, sobre todo cuando es de precision inferior"]
["Límite Detección","Cuando el valor no sea detectado escriba ND. En los otros casos en los que no fue posible determinar el valor de concetración utilice >LC o <LC (Limite de cuantificación) si puede documente los resutlados de calibración del blanco para el instrumento"]
["OBSERVACIONES","Indique las novedades en Campo"]
[]
["Nota aclaratoria: "]
[]
[]
{"$rows_left_out":104}
{"sheet":"AGD_MUESTREOS","index":9,"n_rows":0,"n_cols":0,"rows_kept":0,"cut":false,"hidden":true,"merged":[]}

{"sheet":"AGD_PARAMETRO","index":10,"n_rows":0,"n_cols":0,"rows_kept":0,"cut":false,"hidden":true,"merged":[]}

{"sheet":"AGD_MUESTRAS","index":11,"n_rows":0,"n_cols":0,"rows_kept":0,"cut":false,"hidden":true,"merged":[]}

{"sheet":"AGD_MUESTRAS_VARIABLES","index":12,"n_rows":0,"n_cols":0,"rows_kept":0,"cut":false,"hidden":true,"merged":[]}

{"sheet":"AGD_AUTORIAS","index":13,"n_rows":0,"n_cols":0,"rows_kept":0,"cut":false,"hidden":true,"merged":[]}