{"text_format":"1","workbook":"xlsx","n_sheets":11,"sheets":["Registro de cambios","configuracion","DIGITADOR","DATOS","referentes","Otras referencias","AGD_MUESTREOS","AGD_PARAMETRO","AGD_MUESTRAS","AGD_MUESTRAS_VARIABLES","AGD_AUTORIAS"],"not_rendered":{"charts":0,"images":0,"macros":1,"external_links":1,"defined_names":22,"comments":2,"pivot_tables":0},"unopened":[],"bounds":{"document_bytes":16777216,"sheet_cells":100000,"rows_first":2000,"rows_last":500,"rows_between":2000,"halvings":0,"cell_chars":16384,"cell_head_chars":4096},"cells_cut":0,"cells_raw":0,"read":"whole","date_system":"1900"}

{"sheet":"Registro de cambios","index":0,"n_rows":6,"n_cols":7,"rows_kept":6,"cut":false,"hidden":true,"merged":[[2,3,2,6]]}
[]
[]
[null,null,null,"REGISTRO DE CAMBIOS"]
[null,null,null,"VERSIÓN No.","CAMBIO REALIZADO","AUTOR","VIGENTE DESDE\n(DD/MM/AAAA)"]
[null,null,null,"20240522i","Actualización del código de la macro.\n\nSe eliminó la URL de la antigua API de portete:\n       http://portete.invemar.org.co:7003/ArgosWebServices-RESTWebService-context-root/rest/1.0\n\nFue reemplazada por la URL de la API de ARGOS:\n       https://argos.invemar.org.co/api/\n\nLa API contiene End Points que permiten tener mayor control, facilitan la descarga de referentes (listas de usuarios, estaciones, especies, etc.) que corresponden a criterios específicos como el proyecto usado en la plantilla para evitar descargar data innecesaria.\n\nDel mismo modo, también permite la carga de información a la BDD del INVEMAR.\n\nLa macro toma los Endpoints desde la hoja configuracion de una tabla llamada \"Configuración referentes\", a la que se le puede modificar las rutas de la API o agregar nuevas. cabe resaltar que se puede \"quemar\" directamente en la macro los Endpoints que lo requieran.","Kevin Moreno","22/05/2024"]
[null,null,null,"20230813i","Se creó la plantilla de cero (0), los elementos que componen la plantilla funcionan para la temática de PASTOS - Estructura.\n\nSe modificó la hoja de DIGITADOR añadiendo listas de valores como el responsable de la entrega de datos y atributos adicionales como 'Observaciones generales'.\n\nSe crearon todas las columnas que componente la hoja de DATOS, se obtienen valores como la fecha, estación, transecto, número de parcela, especie, etc .\n\nSe mapeó toda la hoja de CONFIGURACIÓN para tomar los valores de los muestreos y muestras. De ese modo, se generan las tablas que sirven para subir la información al sistema.\n","Kevin Moreno","13/8/2023"]

{"sheet":"configuracion","index":1,"n_rows":75,"n_cols":21,"rows_kept":75,"cut":false,"hidden":true,"merged":[[61,0,61,2],[28,0,35,0],[37,0,42,0],[45,0,45,1],[45,5,45,7],[23,0,26,0],[0,0,2,0],[3,0,5,0],[7,0,8,0],[9,0,15,0],[17,0,21,0]]}
["general","urlServicio","https://argos.invemar.org.co/api/"]
[null,"fila de inicio",3]
[null,"fila de fin",303]
["metodologias","Metodologias",{"$f":"DIGITADOR!$B$4","v":817}]
[null,"Referentes",300]
[null,"Cantidad maxima de referentes ",300]
["estaciones/investigadores","proyectos",3036]
["Lista especies","metodologias",{"$f":"DIGITADOR!$B$4","v":817}]
[null,"proyectos",3036]
["MUESTREOS","ID_MUESTREO","DATOS,B"]
{"$rows_left_out":66}
{"sheet":"DIGITADOR","index":2,"n_rows":38,"n_cols":4,"rows_kept":38,"cut":false,"hidden":false,"merged":[[37,1,37,2],[36,1,36,2],[0,0,0,1],[15,3,15,9],[16,3,16,9],[1,3,9,9],[10,3,14,9],[7,0,8,0],[29,0,29,1],[26,0,26,2],[27,1,27,2]]}
["Recolección de Datos Monitoreo Pastos Estructura"]
["Código Digitador",{"$f":"IF(B3=\"\",\"\",INDEX(referentes!$AF$2:$AG$60,MATCH(DIGITADOR!B3,referentes!$AG$2:$AG$60,0),1))","v":""},null,"Recomendaciones generales: \n¡Precaución! No inserte Filas o Columnas.\nEn los casos en que falte un valor a ingresar que provenga de la hoja de referencias, informe para que el administrador del sistema haga las adiciones necesarias.\nEsta es una plantilla programada. Las columnas de color oscuro se llenan automaticamente, principalmente a partir de los contenidos de la hoja de referencias. \nNO UTILICE PUNTO Y COMA (;) en ningun campo, por ser el separador de variables (columnas). Las unidades de medida son las especificadas en la cabecera de la hoja.\nPara el correcto funcionamiento de la hoja debe estar activa la opcion de Excel de ejecutar macros (al abrir la hoja acepte la opcion habilitar macros, mensaje de Excel que aparece en la parte superior de la hoja en un recuadro amarillo). La extensión del archivo debe ser .xlsm.. \nAl finalizar, renombre el archivo de modo que su contenido sea claro, ejemplo:\nAAAAMMDD_METODOLOGIA_TEMATICA_ESTACION.xlsm. El nombre no debe tener espacios en blanco vocales tildadas o ñ."]
["Nombre del responsable",null,{"$f":"IF(G3=\"\",\"\",CONCATENATE(DIGITADOR!$M$1,G3,E3))","v":""}]
["Código Monitoreo",{"$f":"IF(B5=\"\",\"\",INDEX('Otras referencias'!$K$7:$L$9,MATCH(DIGITADOR!B5,'Otras referencias'!$L$7:$L$9,0),1))","v":817}]
["Monitoreo","Pastos-Estructura"]
["Entidad","Instituto de Investigaciones Marinas y Costeras"]
["Versión de la plantilla",{"$f":"'Registro de cambios'!$D$5","v":"20240522i"}]
["Fecha en la que ingresa los datos en esta hoja","DD/MM/AAAA"]
[null,"3000-12-12"]
[]
{"$rows_left_out":29}
{"sheet":"DATOS","index":3,"n_rows":303,"n_cols":40,"rows_kept":303,"cut":false,"hidden":false,"merged":[[0,6,0,12],[0,13,0,39]]}
[null,null,null,null,null,null,"MUESTREO ",null,null,null,null,null,null,"MUESTRA"]
[{"$f":"TEXT(DIGITADOR!$B$9,\"yyyymmdd\")","v":"30001212"},"AGM MUESTREO","ID MUESTREO","ID MUESTRA","ID ESTACION",null,null,"COD Estación","Estación","Fecha\n(DD/MM/AAAA)",null,null,null,"Transecto","Número\nParcela","COMBINACIÓN\n(Transecto - Num parcela)","CUADRANTE","COD\nTamaño Cuadrante","Tamaño Cuadrante","COD\nEspecie","Especie","Cobertura\n(%)","H1","H2","H3","Promedio H","W1","W2","W3","Promedio W","Densidad","Herbivoria","COD\nHerbivoria","Afectación por  Labyrinthula sp ","COD\nAfectación L sp","Flores","COD\nFlores","Frutos","COD\nFrutos","Observaciones"]
[null,{"$f":"IF(C3=\"\",\"\",IF(COUNTIF($C$3:C3, C3)>1, \"\", C3))","v":""},{"$f":"IF(J3=\"\",\"\",IF(H3=\"\",\"\",CONCATENATE(DIGITADOR!$M$1,J3,E3)))","v":""},{"$f":"IF(C3=\"\",\"\",CONCATENATE(C3,ROW()-2))","v":""},{"$f":"IF(H3=\"\",\"\",VLOOKUP(H3,'Otras referencias'!$A$24:$E$48,2,FALSE))","v":""},null,null,null,{"$f":"IF(H3=\"\",\"\",VLOOKUP(H3,'Otras referencias'!$A$24:$E$48,5,FALSE))","v":""},null,null,null,null,null,null,{"$f":"CONCATENATE(N3,O3)","v":""},{"$f":"IF(AND(P3<>\"\",O3<>\"\"),IF(N3=\"A\",VLOOKUP(P3,'Otras referencias'!$J$24:$K$35,2,FALSE),IF(N3=\"B\",VLOOKUP(P3,'Otras referencias'!$N$24:$O$35,2,),IF(N3=\"C\",VLOOKUP(P3,'Otras referencias'!$R$24:$S$35,2,FALSE)))),\"\")","v":""},{"$f":"IF(S3=\"\",\"\",INDEX(referentes!$G$2:$H$5,MATCH(S3,referentes!$H$2:$H$5,0),1))","v":""},null,null,{"$f":"IF(T3=\"\",\"\",VLOOKUP(T3,referentes!$Q$2:$X$209,2,FALSE))","v":""},null,null,null,null,{"$f":"IF(OR(W3=\"\",X3=\"\",Y3=\"\"),\"\",AVERAGE(W3,X3,Y3))","v":""},null,null,null,{"$f":"IF(OR(AA3=\"\",AB3=\"\",AC3=\"\"),\"\",AVERAGE(AA3,AB3,AC3))","v":""}]
[null,{"$f":"IF(C4=\"\",\"\",IF(COUNTIF($C$3:C4, C4)>1, \"\", C4))","v":""},{"$f":"IF(J4=\"\",\"\",CONCATENATE(DIGITADOR!$M$1,J4,E4))","v":""},{"$f":"IF(C4=\"\",\"\",CONCATENATE(C4,ROW()-2))","v":""},{"$f":"IF(H4=\"\",\"\",VLOOKUP(H4,'Otras referencias'!$A$24:$E$48,2,FALSE))","v":""},null,null,null,{"$f":"IF(H4=\"\",\"\",VLOOKUP(H4,'Otras referencias'!$A$24:$E$48,5,FALSE))","v":""},null,null,null,null,null,null,{"$f":"CONCATENATE(N4,O4)","v":""},{"$f":"IF(AND(P4<>\"\",O4<>\"\"),IF(N4=\"A\",VLOOKUP(P4,'Otras referencias'!$J$24:$K$35,2,FALSE),IF(N4=\"B\",VLOOKUP(P4,'Otras referencias'!$N$24:$O$35,2,),IF(N4=\"C\",VLOOKUP(P4,'Otras referencias'!$R$24:$S$35,2,FALSE)))),\"\")","v":""},{"$f":"IF(S4=\"\",\"\",INDEX(referentes!$G$2:$H$5,MATCH(S4,referentes!$H$2:$H$5,0),1))","v":""},null,null,{"$f":"IF(T4=\"\",\"\",VLOOKUP(T4,referentes!$Q$2:$X$209,2,FALSE))","v":""},null,null,null,null,{"$f":"IF(OR(W4=\"\",X4=\"\",Y4=\"\"),\"\",AVERAGE(W4,X4,Y4))","v":""},null,null,null,{"$f":"IF(OR(AA4=\"\",AB4=\"\",AC4=\"\"),\"\",AVERAGE(AA4,AB4,AC4))","v":""},null,null,{"$f":"IF(AF4<>\"\",VLOOKUP(AF4,'Otras referencias'!$H$19:$I$20,2,FALSE),\"\")","v":""},null,{"$f":"IF(AH4<>\"\",VLOOKUP(AH4,'Otras referencias'!$H$19:$I$20,2,FALSE),\"\")","v":""},null,{"$f":"IF(AJ4<>\"\",VLOOKUP(AJ4,'Otras referencias'!$H$19:$I$20,2,FALSE),\"\")","v":""},null,{"$f":"IF(AL4<>\"\",VLOOKUP(AL4,'Otras referencias'!$H$19:$I$20,2,FALSE),\"\")","v":""}]
[null,{"$f":"IF(C5=\"\",\"\",IF(COUNTIF($C$3:C5, C5)>1, \"\", C5))","v":""},{"$f":"IF(J5=\"\",\"\",CONCATENATE(DIGITADOR!$M$1,J5,E5))","v":""},"",{"$f":"IF(H5=\"\",\"\",VLOOKUP(H5,'Otras referencias'!$A$24:$E$48,2,FALSE))","v":""},null,null,null,{"$f":"IF(H5=\"\",\"\",VLOOKUP(H5,'Otras referencias'!$A$24:$E$48,5,FALSE))","v":""},null,null,null,null,null,null,"",{"$f":"IF(AND(P5<>\"\",O5<>\"\"),IF(N5=\"A\",VLOOKUP(P5,'Otras referencias'!$J$24:$K$35,2,FALSE),IF(N5=\"B\",VLOOKUP(P5,'Otras referencias'!$N$24:$O$35,2,),IF(N5=\"C\",VLOOKUP(P5,'Otras referencias'!$R$24:$S$35,2,FALSE)))),\"\")","v":""},{"$f":"IF(S5=\"\",\"\",INDEX(referentes!$G$2:$H$5,MATCH(S5,referentes!$H$2:$H$5,0),1))","v":""},null,null,{"$f":"IF(T5=\"\",\"\",VLOOKUP(T5,referentes!$Q$2:$X$209,2,FALSE))","v":""},null,null,null,null,"",null,null,null,"",null,null,{"$f":"IF(AF5<>\"\",VLOOKUP(AF5,'Otras referencias'!$H$19:$I$20,2,FALSE),\"\")","v":""},null,{"$f":"IF(AH5<>\"\",VLOOKUP(AH5,'Otras referencias'!$H$19:$I$20,2,FALSE),\"\")","v":""},null,{"$f":"IF(AJ5<>\"\",VLOOKUP(AJ5,'Otras referencias'!$H$19:$I$20,2,FALSE),\"\")","v":""},null,{"$f":"IF(AL5<>\"\",VLOOKUP(AL5,'Otras referencias'!$H$19:$I$20,2,FALSE),\"\")","v":""}]
[null,{"$f":"IF(C6=\"\",\"\",IF(COUNTIF($C$3:C6, C6)>1, \"\", C6))","v":""},{"$f":"IF(J6=\"\",\"\",CONCATENATE(DIGITADOR!$M$1,J6,E6))","v":""},"",{"$f":"IF(H6=\"\",\"\",VLOOKUP(H6,'Otras referencias'!$A$24:$E$48,2,FALSE))","v":""},null,null,null,{"$f":"IF(H6=\"\",\"\",VLOOKUP(H6,'Otras referencias'!$A$24:$E$48,5,FALSE))","v":""},null,null,null,null,null,null,"",{"$f":"IF(AND(P6<>\"\",O6<>\"\"),IF(N6=\"A\",VLOOKUP(P6,'Otras referencias'!$J$24:$K$35,2,FALSE),IF(N6=\"B\",VLOOKUP(P6,'Otras referencias'!$N$24:$O$35,2,),IF(N6=\"C\",VLOOKUP(P6,'Otras referencias'!$R$24:$S$35,2,FALSE)))),\"\")","v":""},{"$f":"IF(S6=\"\",\"\",INDEX(referentes!$G$2:$H$5,MATCH(S6,referentes!$H$2:$H$5,0),1))","v":""},null,null,{"$f":"IF(T6=\"\",\"\",VLOOKUP(T6,referentes!$Q$2:$X$209,2,FALSE))","v":""},null,null,null,null,"",null,null,null,"",null,null,{"$f":"IF(AF6<>\"\",VLOOKUP(AF6,'Otras referencias'!$H$19:$I$20,2,FALSE),\"\")","v":""},null,{"$f":"IF(AH6<>\"\",VLOOKUP(AH6,'Otras referencias'!$H$19:$I$20,2,FALSE),\"\")","v":""},null,{"$f":"IF(AJ6<>\"\",VLOOKUP(AJ6,'Otras referencias'!$H$19:$I$20,2,FALSE),\"\")","v":""},null,{"$f":"IF(AL6<>\"\",VLOOKUP(AL6,'Otras referencias'!$H$19:$I$20,2,FALSE),\"\")","v":""}]
[null,{"$f":"IF(C7=\"\",\"\",IF(COUNTIF($C$3:C7, C7)>1, \"\", C7))","v":""},{"$f":"IF(J7=\"\",\"\",CONCATENATE(DIGITADOR!$M$1,J7,E7))","v":""},"",{"$f":"IF(H7=\"\",\"\",VLOOKUP(H7,'Otras referencias'!$A$24:$E$48,2,FALSE))","v":""},null,null,null,{"$f":"IF(H7=\"\",\"\",VLOOKUP(H7,'Otras referencias'!$A$24:$E$48,5,FALSE))","v":""},null,null,null,null,null,null,"",{"$f":"IF(AND(P7<>\"\",O7<>\"\"),IF(N7=\"A\",VLOOKUP(P7,'Otras referencias'!$J$24:$K$35,2,FALSE),IF(N7=\"B\",VLOOKUP(P7,'Otras referencias'!$N$24:$O$35,2,),IF(N7=\"C\",VLOOKUP(P7,'Otras referencias'!$R$24:$S$35,2,FALSE)))),\"\")","v":""},{"$f":"IF(S7=\"\",\"\",INDEX(referentes!$G$2:$H$5,MATCH(S7,referentes!$H$2:$H$5,0),1))","v":""},null,null,{"$f":"IF(T7=\"\",\"\",VLOOKUP(T7,referentes!$Q$2:$X$209,2,FALSE))","v":""},null,null,null,null,"",null,null,null,"",null,null,{"$f":"IF(AF7<>\"\",VLOOKUP(AF7,'Otras referencias'!$H$19:$I$20,2,FALSE),\"\")","v":""},null,{"$f":"IF(AH7<>\"\",VLOOKUP(AH7,'Otras referencias'!$H$19:$I$20,2,FALSE),\"\")","v":""},null,{"$f":"IF(AJ7<>\"\",VLOOKUP(AJ7,'Otras referencias'!$H$19:$I$20,2,FALSE),\"\")","v":""},null,{"$f":"IF(AL7<>\"\",VLOOKUP(AL7,'Otras referencias'!$H$19:$I$20,2,FALSE),\"\")","v":""}]
[null,{"$f":"IF(C8=\"\",\"\",IF(COUNTIF($C$3:C8, C8)>1, \"\", C8))","v":""},{"$f":"IF(J8=\"\",\"\",CONCATENATE(DIGITADOR!$M$1,J8,E8))","v":""},"",{"$f":"IF(H8=\"\",\"\",VLOOKUP(H8,'Otras referencias'!$A$24:$E$48,2,FALSE))","v":""},null,null,null,{"$f":"IF(H8=\"\",\"\",VLOOKUP(H8,'Otras referencias'!$A$24:$E$48,5,FALSE))","v":""},null,null,null,null,null,null,"",{"$f":"IF(AND(P8<>\"\",O8<>\"\"),IF(N8=\"A\",VLOOKUP(P8,'Otras referencias'!$J$24:$K$35,2,FALSE),IF(N8=\"B\",VLOOKUP(P8,'Otras referencias'!$N$24:$O$35,2,),IF(N8=\"C\",VLOOKUP(P8,'Otras referencias'!$R$24:$S$35,2,FALSE)))),\"\")","v":""},{"$f":"IF(S8=\"\",\"\",INDEX(referentes!$G$2:$H$5,MATCH(S8,referentes!$H$2:$H$5,0),1))","v":""},null,null,{"$f":"IF(T8=\"\",\"\",VLOOKUP(T8,referentes!$Q$2:$X$209,2,FALSE))","v":""},null,null,null,null,"",null,null,null,"",null,null,{"$f":"IF(AF8<>\"\",VLOOKUP(AF8,'Otras referencias'!$H$19:$I$20,2,FALSE),\"\")","v":""},null,{"$f":"IF(AH8<>\"\",VLOOKUP(AH8,'Otras referencias'!$H$19:$I$20,2,FALSE),\"\")","v":""},null,{"$f":"IF(AJ8<>\"\",VLOOKUP(AJ8,'Otras referencias'!$H$19:$I$20,2,FALSE),\"\")","v":""},null,{"$f":"IF(AL8<>\"\",VLOOKUP(AL8,'Otras referencias'!$H$19:$I$20,2,FALSE),\"\")","v":""}]
[null,{"$f":"IF(C9=\"\",\"\",IF(COUNTIF($C$3:C9, C9)>1, \"\", C9))","v":""},{"$f":"IF(J9=\"\",\"\",CONCATENATE(DIGITADOR!$M$1,J9,E9))","v":""},"",{"$f":"IF(H9=\"\",\"\",VLOOKUP(H9,'Otras referencias'!$A$24:$E$48,2,FALSE))","v":""},null,null,null,{"$f":"IF(H9=\"\",\"\",VLOOKUP(H9,'Otras referencias'!$A$24:$E$48,5,FALSE))","v":""},null,null,null,null,null,null,"",{"$f":"IF(AND(P9<>\"\",O9<>\"\"),IF(N9=\"A\",VLOOKUP(P9,'Otras referencias'!$J$24:$K$35,2,FALSE),IF(N9=\"B\",VLOOKUP(P9,'Otras referencias'!$N$24:$O$35,2,),IF(N9=\"C\",VLOOKUP(P9,'Otras referencias'!$R$24:$S$35,2,FALSE)))),\"\")","v":""},{"$f":"IF(S9=\"\",\"\",INDEX(referentes!$G$2:$H$5,MATCH(S9,referentes!$H$2:$H$5,0),1))","v":""},null,null,{"$f":"IF(T9=\"\",\"\",VLOOKUP(T9,referentes!$Q$2:$X$209,2,FALSE))","v":""},null,null,null,null,"",null,null,null,"",null,null,{"$f":"IF(AF9<>\"\",VLOOKUP(AF9,'Otras referencias'!$H$19:$I$20,2,FALSE),\"\")","v":""},null,{"$f":"IF(AH9<>\"\",VLOOKUP(AH9,'Otras referencias'!$H$19:$I$20,2,FALSE),\"\")","v":""},null,{"$f":"IF(AJ9<>\"\",VLOOKUP(AJ9,'Otras referencias'!$H$19:$I$20,2,FALSE),\"\")","v":""},null,{"$f":"IF(AL9<>\"\",VLOOKUP(AL9,'Otras referencias'!$H$19:$I$20,2,FALSE),\"\")","v":""}]
[null,{"$f":"IF(C10=\"\",\"\",IF(COUNTIF($C$3:C10, C10)>1, \"\", C10))","v":""},{"$f":"IF(J10=\"\",\"\",CONCATENATE(DIGITADOR!$M$1,J10,E10))","v":""},"",{"$f":"IF(H10=\"\",\"\",VLOOKUP(H10,'Otras referencias'!$A$24:$E$48,2,FALSE))","v":""},null,null,null,{"$f":"IF(H10=\"\",\"\",VLOOKUP(H10,'Otras referencias'!$A$24:$E$48,5,FALSE))","v":""},null,null,null,null,null,null,"",{"$f":"IF(AND(P10<>\"\",O10<>\"\"),IF(N10=\"A\",VLOOKUP(P10,'Otras referencias'!$J$24:$K$35,2,FALSE),IF(N10=\"B\",VLOOKUP(P10,'Otras referencias'!$N$24:$O$35,2,),IF(N10=\"C\",VLOOKUP(P10,'Otras referencias'!$R$24:$S$35,2,FALSE)))),\"\")","v":""},{"$f":"IF(S10=\"\",\"\",INDEX(referentes!$G$2:$H$5,MATCH(S10,referentes!$H$2:$H$5,0),1))","v":""},null,null,{"$f":"IF(T10=\"\",\"\",VLOOKUP(T10,referentes!$Q$2:$X$209,2,FALSE))","v":""},null,null,null,null,"",null,null,null,"",null,null,{"$f":"IF(AF10<>\"\",VLOOKUP(AF10,'Otras referencias'!$H$19:$I$20,2,FALSE),\"\")","v":""},null,{"$f":"IF(AH10<>\"\",VLOOKUP(AH10,'Otras referencias'!$H$19:$I$20,2,FALSE),\"\")","v":""},null,{"$f":"IF(AJ10<>\"\",VLOOKUP(AJ10,'Otras referencias'!$H$19:$I$20,2,FALSE),\"\")","v":""},null,{"$f":"IF(AL10<>\"\",VLOOKUP(AL10,'Otras referencias'!$H$19:$I$20,2,FALSE),\"\")","v":""}]
{"$rows_left_out":294}
{"sheet":"referentes","index":4,"n_rows":139,"n_cols":37,"rows_kept":139,"cut":false,"hidden":false,"merged":[]}
["codigo","descripcion",null,"codigo","descripcion",null,"codigo","descripcion",null,"codigo","descripcion",null,"codigo","descripcion",null,null,"cod_letras","descripcion","clave_sibm","phylum","clase","orden","familia","genero",null,"prefijo_cdg_est_loc","secuencia_loc","lugar","codigo_estacion_loc","descripcion_estacion_loc",null,"codigo","nombre",null,null,"NOMBRE_IN","CODIGO_IN"]
["CORALINA","CORALINA",null,3343,"ANH Pastos Guajira Choco (3343)",null,2701,"25x25",null,"HWRI","Halodule wrightii ",null,2750,"Lodo",null,null,"HBAI","Halophila baillonis","2040.55.1005","Tracheophyta","Magnoliopsida","Alismatales","Hydrocharitaceae",null,null,"AHUY",57180,"Ahuyama",1,"MN-Ahuyama",null,3907,"Ameth  Vargas Campo",null,null,null,"Administración Desarrollo Complejo Portuario  Limón Moin Costa Rica"]
["F. Malpelo","Fundacion Malpelo",null,3422,"Coralina 02 2018 (3422)",null,2702,"12,5x12,5",null,"HBAI","Halophila baillonis",null,2751,"Arena muy fina",null,null,"HDEC","Halophila decipiens","2040.55.1010","Tracheophyta","Magnoliopsida","Alismatales","Hydrocharitaceae",null,null,"BPOR",43727,"Bahía Portete",3,"MN-Bahía Portete",null,593,"Andrea Polanco",null,null,null,"Anadarko Colombia Company"]
["INVEMAR","Instituto de Investigaciones Marinas y Costeras",null,"Monitoreo Pastos - BPIN","Monitoreo Pastos - BPIN (COD_ALFABETICO anterior: 3494)",null,2703,"20x20",null,"HDEC","Halophila decipiens",null,2752,"Arena fina",null,null,"HWRI","Halodule wrightii ","2040.55.1000","Tracheophyta","Magnoliopsida","Alismatales","Cymodoceaceae",null,null,"BALL",48586,"Ballenas",1,"MN-Ballenas",null,4408,"Andres Felipe Acosta Chaparro",null,null,null,"Aquabiosfera SAS"]
["ParquesNacionales","Parques Nacionales",null,3304,"ANH Pastos Marinos. PRY-BEM-012-15_T2",null,2704,"50x50",null,"RMAR","Ruppia maritima",null,2753,"Arena media",null,null,"RMAR","Ruppia maritima","2040.55.30","Tracheophyta","Magnoliopsida","Alismatales","Lilianae",null,null,"CVEL",48584,"Cabo de la Vela",3,"MN-Cabo de la Vela",null,4109,"Angélica Rodríguez",null,null,null,"Asociación Calidris"]
["PNN_GORGONA","PNN_GORGONA",null,null,null,null,null,null,null,"SFIL","Syringodium filiforme",null,2754,"Arena mixta",null,null,"SFIL","Syringodium filiforme","2040.55.1015","Tracheophyta","Magnoliopsida","Alismatales","Cymodoceaceae",null,null,"CVNU",49303,"Cabo de la Vela",2,"MN-Cabo Nuevo",null,3956,"Carlos Aponte",null,null,null,"Asociación de Corporaciones Autónomas Regionales"]
["UJTL","UJTL",null,null,null,null,null,null,null,"TTES","Thalassia testudinum",null,2755,"Arena gruesa",null,null,"TTES","Thalassia testudinum","2040.55.1500","Tracheophyta","Magnoliopsida","Alismatales","Hydrocharitaceae",null,null,"CPLA",57179,"Cabo playa",1,"MN-Cabo playa",null,3147,"Christian Michael Díaz Sánchez",null,null,null,"Autoridad Nacional de Licencias Ambientales"]
["UNal","Universidad Nacional",null,null,null,null,null,null,null,null,null,null,2756,"Arena muy gruesa",null,null,null,null,null,null,null,null,null,null,null,"CARR",57178,"Carrizal",1,"MN-Carrizal",null,4407,"Cristian Camilo Salinas zapata",null,null,null,"Autoridad de Recursos Acuáticos de Panamá"]
["UNIVALLE","Universidad del Valle",null,null,null,null,null,null,null,null,null,null,2757,"Grava",null,null,null,null,null,null,null,null,null,null,null,"CHEN",43120,"Chengue",2,"MN-Chengue",null,3829,"Diana Carolina Ballesteros Contreras",null,null,null,"Caribbean-Wide Orca Project"]
[null,null,null,null,null,null,null,null,null,null,null,null,2758,"Bloques",null,null,null,null,null,null,null,null,null,null,null,"CINT",43121,"Cinto",3,"MN-Cinto",null,1834,"Diana Isabel Gómez López",null,null,null,"Centro de Estudios Ambientales de Cienfuegos"]
{"$rows_left_out":130}
{"sheet":"Otras referencias","index":5,"n_rows":48,"n_cols":20,"rows_kept":48,"cut":false,"hidden":false,"merged":[[0,0,2,6],[4,0,4,1],[4,10,4,11],[21,0,21,5],[23,5,25,5],[26,5,47,5],[21,7,21,18],[4,13,4,15],[4,3,4,5],[4,7,4,8],[11,7,11,8],[17,7,17,8],[4,17,4,19]]}
["Estas son listas para variables con valores que no se encuentran codificados, pero que deben manejarse de manera estandarizada. \nSi se requiere agregar un valor nuevo hagalo debajo de la lista correspondiente"]
[]
[]
[]
["UNIDADES DE MEDIDA",null,null,"PROYECTO",null,null,null,"ROLES",null,null,"METODOLOGIAS",null,null,"TEMATICAS",null,null,null,"CODIGOS LOV"]
["CODIGO","DESCRIPCION",null,"COD","PROYECTO","PROYECTO DESC",null,4,"Captura en campo",null,"CODIGO","DESCRIPCION",null,"COD METODOLOGIA","COD TEMATICA","DESCRIPCION",null,"DESCRIPCIÓN","CÓDIGO","GRUPO"]
[10,"cm",null,3036,"Monitoreo Pastos - BPIN","Monitoreo de Pastos Marinos de Colombia",null,6,"Revisar datos",null,817,"Pastos-Estructura",null,817,221,"ESTRUCTURA",null,"Departamento",10,2]
[11,"m",null,null,null,null,null,3497,"Coordinador actividad de campo",null,null,null,null,null,null,null,null,"Sector",20,2]
[69,"g",null,null,null,null,null,4526,"Procesamiento en laboratorio",null,null,null,null,null,null,null,null,"Punto",30,2]
[142,"Ind/Estación",null,null,null,null,null,null,null,null,null,null,null,null,null,null,null,"Parcela",35,2]
{"$rows_left_out":39}
{"sheet":"AGD_MUESTREOS","index":6,"n_rows":0,"n_cols":0,"rows_kept":0,"cut":false,"hidden":true,"merged":[]}

{"sheet":"AGD_PARAMETRO","index":7,"n_rows":0,"n_cols":0,"rows_kept":0,"cut":false,"hidden":true,"merged":[]}

{"sheet":"AGD_MUESTRAS","index":8,"n_rows":0,"n_cols":0,"rows_kept":0,"cut":false,"hidden":true,"merged":[]}

{"sheet":"AGD_MUESTRAS_VARIABLES","index":9,"n_rows":0,"n_cols":0,"rows_kept":0,"cut":false,"hidden":true,"merged":[]}

{"sheet":"AGD_AUTORIAS","index":10,"n_rows":0,"n_cols":0,"rows_kept":0,"cut":false,"hidden":true,"merged":[]}