{"text_format":"1","workbook":"xlsx","n_sheets":11,"sheets":["Registro de cambios","configuracion","DIGITADOR","DATOS","referentes","Otras referencias","AGD_MUESTREOS","AGD_PARAMETRO","AGD_MUESTRAS","AGD_MUESTRAS_VARIABLES","AGD_AUTORIAS"],"not_rendered":{"charts":0,"images":0,"macros":1,"external_links":1,"defined_names":22,"comments":2,"pivot_tables":0},"unopened":[],"bounds":{"document_bytes":16777216,"sheet_cells":100000,"rows_first":2000,"rows_last":500,"rows_between":2000,"halvings":0,"cell_chars":16384,"cell_head_chars":4096},"cells_cut":0,"cells_raw":0,"read":"whole","date_system":"1900"}

{"sheet":"Registro de cambios","index":0,"n_rows":6,"n_cols":7,"rows_kept":6,"cut":false,"hidden":true,"merged":[[2,3,2,6]]}
[]
[]
[null,null,null,"REGISTRO DE CAMBIOS"]
[null,null,null,"VERSIÓN No.","CAMBIO REALIZADO","AUTOR","VIGENTE DESDE\n(DD/MM/AAAA)"]
[null,null,null,"20240522i","Actualización del código de la macro.\n\nSe eliminó la URL de la antigua API de portete:\n       http://portete.invemar.org.co:7003/ArgosWebServices-RESTWebService-context-root/rest/1.0\n\nFue reemplazada por la URL de la API de ARGOS:\n       https://argos.invemar.org.co/api/\n\nLa API contiene End Points que permiten tener mayor control, facilitan la descarga de referentes (listas de usuarios, estaciones, especies, etc.) que corresponden a criterios específicos como el proyecto usado en la plantilla para evitar descargar data innecesaria.\n\nDel mismo modo, también permite la carga de información a la BDD del INVEMAR.\n\nLa macro toma los Endpoints desde la hoja configuracion de una tabla llamada \"Configuración referentes\", a la que se le puede modificar las rutas de la API o agregar nuevas. cabe resaltar que se puede \"quemar\" directamente en la macro los Endpoints que lo requieran.","Kevin Moreno","22/05/2024"]
[null,null,null,"20230813i","Se creó la plantilla de cero (0), los elementos que componen la plantilla funcionan para la temática de PASTOS - Estructura.\n\nSe modificó la hoja de DIGITADOR añadiendo listas de valores como el responsable de la entrega de datos y atributos adicionales como 'Observaciones generales'.\n\nSe crearon todas las columnas que componente la hoja de DATOS, se obtienen valores como la fecha, estación, transecto, número de parcela, especie, etc .\n\nSe mapeó toda la hoja de CONFIGURACIÓN para tomar los valores de los muestreos y muestras. De ese modo, se generan las tablas que sirven para subir la información al sistema.\n","Kevin Moreno","13/8/2023"]

{"sheet":"configuracion","index":1,"n_rows":75,"n_cols":21,"rows_kept":75,"cut":false,"hidden":true,"merged":[[61,0,61,2],[28,0,35,0],[37,0,42,0],[45,0,45,1],[45,5,45,7],[23,0,26,0],[0,0,2,0],[3,0,5,0],[7,0,8,0],[9,0,15,0],[17,0,21,0]]}
["general","urlServicio","https://argos.invemar.org.co/api/"]
[null,"fila de inicio",3]
[null,"fila de fin",303]
["metodologias","Metodologias",{"$f":"DIGITADOR!$B$4","v":817}]
[null,"Referentes",300]
[null,"Cantidad maxima de referentes ",300]
["estaciones/investigadores","proyectos",3036]
["Lista especies","metodologias",{"$f":"DIGITADOR!$B$4","v":817}]
[null,"proyectos",3036]
["MUESTREOS","ID_MUESTREO","DATOS,B"]
[null,"ID_ESTACION","DATOS,E"]
[null,"ID_PROYECTO",{"$f":"DIGITADOR!B11","v":3036}]
[null,"ID_METODOLOGIA",{"$f":"DIGITADOR!$B$4","v":817}]
[null,"ID_TEMATICAS",{"$f":"IF(C4=\"\",\"\",VLOOKUP(C4,'Otras referencias'!N7:P9,2,FALSE))","v":221}]
[null,"FECHA","DATOS,J"]
[null,"NOTAS","DIGITADOR,B,28"]
[null,"cantidad",303]
["parametro muestreo","ID_MUESTREO","DATOS,B","DATOS,B","DATOS,B","DATOS,B"]
[null,"ID_PARAMETRO",1169,1055,1170,127]
[null,"ID_METODOLOGIA",{"$f":"DIGITADOR!$B$4","v":817},{"$f":"DIGITADOR!$B$4","v":817},{"$f":"DIGITADOR!$B$4","v":817},{"$f":"DIGITADOR!$B$4","v":817}]
[null,"ID_UNIDAD_MEDIDA",100,100,100,100]
[null,"VALOR","DIGITADOR,B,14","DIGITADOR,B,7","DIGITADOR,B,13","DIGITADOR,B,12"]
[null,"cantidad",303,303,303,303]
["muestra","ID_MUESTRA","DATOS,D"]
[null,"ID_MUESTREO","DATOS,C"]
[null,"NOTAS","DATOS,AN"]
[null,"ES_REPLICA",1]
[null,"cantidad",303]
["muestra variable","ID_PARAMETRO",135,840,841,842,585,843,844,845,846,847,1757,1758,1759,1760,569,572,573,575,574]
[null,"ID_METODOLOGIA",{"$f":"DIGITADOR!$B$4","v":817},{"$f":"DIGITADOR!$B$4","v":817},{"$f":"DIGITADOR!$B$4","v":817},{"$f":"DIGITADOR!$B$4","v":817},{"$f":"DIGITADOR!$B$4","v":817},{"$f":"DIGITADOR!$B$4","v":817},{"$f":"DIGITADOR!$B$4","v":817},{"$f":"DIGITADOR!$B$4","v":817},{"$f":"DIGITADOR!$B$4","v":817},{"$f":"DIGITADOR!$B$4","v":817},{"$f":"DIGITADOR!$B$4","v":817},{"$f":"DIGITADOR!$B$4","v":817},{"$f":"DIGITADOR!$B$4","v":817},{"$f":"DIGITADOR!$B$4","v":817},{"$f":"DIGITADOR!$B$4","v":817},{"$f":"DIGITADOR!$B$4","v":817},{"$f":"DIGITADOR!$B$4","v":817},{"$f":"DIGITADOR!$B$4","v":817},{"$f":"DIGITADOR!$B$4","v":817}]
[null,"ID_UNIDAD_MEDIDA",100,100,100,10,100,4,10,10,10,10,10,10,10,10,63,100,100,100,100]
[null,"ID_MUESTRA","DATOS,D","DATOS,D","DATOS,D","DATOS,D","DATOS,D","DATOS,D","DATOS,D","DATOS,D","DATOS,D","DATOS,D","DATOS,D","DATOS,D","DATOS,D","DATOS,D","DATOS,D","DATOS,D","DATOS,D","DATOS,D","DATOS,D"]
[null,"ID_METODO",95,95,95,95,95,95,95,95,95,95,95,95,95,95,95,95,95,95,95]
[null,"VALOR","DATOS,N","DATOS,O","DATOS,Q","DATOS,R","DATOS,T","DATOS,V","DATOS,W","DATOS,X","DATOS,Y","DATOS,Z","DATOS,AA","DATOS,AB","DATOS,AC","DATOS,AD","DATOS,AE","DATOS,AG","DATOS,AI","DATOS,AK","DATOS,AM"]
[null,"QUALITY_FLAG"]
[null,"PRECISION"]
[null,"cantidad",303,303,303,303,303,303,303,303,303,303,303,303,303,303,303,303,303,303,303]
["autoria","ID_FUNCIONARIO","DIGITADOR,B,2","DIGITADOR,B,18","DIGITADOR,B,20","DIGITADOR,B,22","DIGITADOR,B,24"]
[null,"ID_TAREA",5,"DIGITADOR,A,18","DIGITADOR,A,20","DIGITADOR,A,22","DIGITADOR,A,24"]
[null,"ORDEN",1,2,3,4,5]
[null,"FECHA","DIGITADOR,B,9","DATOS,J","DATOS,J","DATOS,J","DATOS,J"]
[null,"ID_MUESTREO","DATOS,B","DATOS,B","DATOS,B","DATOS,B","DATOS,B"]
[null,"ENTIDAD","DIGITADOR,B,6","DIGITADOR,B,6","DIGITADOR,B,6","DIGITADOR,B,6","DIGITADOR,B,6"]
[null,"cantidad",303,303,303,303,303]
[]
["REGISTROS GENERADOS",null,"REGISTROS CARGADOS",null,null,"PASTOS ABUNDANCIA - METODOLOGIA 818"]
["MUESTREOS",null,null,null,null,"ID_PARAMETRO","NOMBRE_COLUMNA","ID_UNIDAD_MEDIDA"]
["parametro muestreo",null,null,null,null,1055,"VERSION_PLANTILLA",100]
["muestra",null,null,null,null,1170,"ARCHIVO_FUENTE",100]
["muestra variable",null,null,null,null,1169,"URL_METADATO",100]
["autoria",null,null,null,null,828,"ENTIDAD",100]
["registros correctos",null,null,null,null,127,"PROYECTO",100]
["Fecha de carga",null,null,null,null,135,"TRANSECTO",100]
["json error",null,null,null,null,840,"PARCELA",100]
["error",null,null,null,null,841,"CUADRANTE",100]
[null,null,null,null,null,842,"TAMANIO_CUADRANTE",10]
[null,null,null,null,null,585,"ESPECIE",100]
["Atributo","Descripción","Código",null,null,843,"PORC_COBERTURA",4]
["Tipo Nodo","Estaciones",{"$f":"VLOOKUP(B59,'Otras referencias'!R7:T17,2,FALSE)","v":40},null,null,844,"HV_1",10]
[null,null,null,null,null,845,"HV_2",10]
[null,null,null,null,null,846,"HV_3",10]
["CONFIGURACION REFERENTES",null,null,null,null,847,"PROM_HV",10]
["Ruta de la API","Endpoint","Descripción",null,null,1757,"W_1",10]
["URL - AGM Campo",{"$f":"CONCATENATE(\"parametros/agmcampo/\",$C$4,\"\")","v":"parametros/agmcampo/817"},"Listado de referentes AGM_CAMPO",null,null,1758,"W_2",10]
["URL - Especies",{"$f":"IF($C$8=\"\",\"\",CONCATENATE(\"especies/filt/\",$C$9,\",\",$C$8,\"/\"))","v":"especies/filt/3036,817/"},"Especies por proyecto\n(No todos los proyectos tienen asociados una lista de especies)",null,null,1759,"W_3",10]
["URL - Estaciones",{"$f":"CONCATENATE(\"estaciones/\", $C$59, \"/\",$C$9,\"\")","v":"estaciones/40/3036"},"Estaciones/parcelas por proyecto, cambia dependiendo del Tipo de Nodo, cuyo estado sea VIGENTE.",null,null,1760,"PROM_W",10]
["URL - Usuarios",{"$f":"CONCATENATE(\"parametros/usersByProject/\",$C$7,\"\")","v":"parametros/usersByProject/3036"},"Usuarios por proyecto.",null,null,569,"DENSIDAD_VASTAGOS",63]
["URL - Entidades","estaciones/get-entidades","Listado de entidades.",null,null,572,"PRESENCIA_HERBIVORA",100]
["Atributos de la API","codigo_in","nombre_in",null,null,573,"AFECTACION_LABYRINTH",100]
["Rango de atributos de la API","B70:C71","nombre_in",null,null,575,"PRESENCIA_FLORES",100]
["URL - Plantillas","plantillas/","Endpoint para la carga de datos al sistema.",null,null,574,"PRESENCIA_FRUTOS",100]
[null,null,null,null,null,823,"NRO_ESPECIES",19]
[null,null,null,null,null,89,"SALINIDAD",115]
[null,null,null,null,null,151,"TEMPERATURA_AGUA",5]
[null,null,null,null,null,848,"GRANULOMETRIA",100]

{"sheet":"DIGITADOR","index":2,"n_rows":38,"n_cols":4,"rows_kept":38,"cut":false,"hidden":false,"merged":[[37,1,37,2],[36,1,36,2],[0,0,0,1],[15,3,15,9],[16,3,16,9],[1,3,9,9],[10,3,14,9],[7,0,8,0],[29,0,29,1],[26,0,26,2],[27,1,27,2]]}
["Recolección de Datos Monitoreo Pastos Estructura"]
["Código Digitador",{"$f":"IF(B3=\"\",\"\",INDEX(referentes!$AF$2:$AG$60,MATCH(DIGITADOR!B3,referentes!$AG$2:$AG$60,0),1))","v":""},null,"Recomendaciones generales: \n¡Precaución! No inserte Filas o Columnas.\nEn los casos en que falte un valor a ingresar que provenga de la hoja de referencias, informe para que el administrador del sistema haga las adiciones necesarias.\nEsta es una plantilla programada. Las columnas de color oscuro se llenan automaticamente, principalmente a partir de los contenidos de la hoja de referencias. \nNO UTILICE PUNTO Y COMA (;) en ningun campo, por ser el separador de variables (columnas). Las unidades de medida son las especificadas en la cabecera de la hoja.\nPara el correcto funcionamiento de la hoja debe estar activa la opcion de Excel de ejecutar macros (al abrir la hoja acepte la opcion habilitar macros, mensaje de Excel que aparece en la parte superior de la hoja en un recuadro amarillo). La extensión del archivo debe ser .xlsm.. \nAl finalizar, renombre el archivo de modo que su contenido sea claro, ejemplo:\nAAAAMMDD_METODOLOGIA_TEMATICA_ESTACION.xlsm. El nombre no debe tener espacios en blanco vocales tildadas o ñ."]
["Nombre del responsable",null,{"$f":"IF(G3=\"\",\"\",CONCATENATE(DIGITADOR!$M$1,G3,E3))","v":""}]
["Código Monitoreo",{"$f":"IF(B5=\"\",\"\",INDEX('Otras referencias'!$K$7:$L$9,MATCH(DIGITADOR!B5,'Otras referencias'!$L$7:$L$9,0),1))","v":817}]
["Monitoreo","Pastos-Estructura"]
["Entidad","Instituto de Investigaciones Marinas y Costeras"]
["Versión de la plantilla",{"$f":"'Registro de cambios'!$D$5","v":"20240522i"}]
["Fecha en la que ingresa los datos en esta hoja","DD/MM/AAAA"]
[null,"3000-12-12"]
[]
["Código del proyecto",{"$f":"IF(B12=\"\",\"\",INDEX('Otras referencias'!$D$7:$E$7,MATCH(DIGITADOR!B12,'Otras referencias'!$E$7:$E$7,0),1))","v":3036},null,"Previamente a iniciar el llenado de la plantilla, debe presionar el botón \"Descargar referentes\" para que los referentes de ésta plantilla sean actualizados. \nLuego de llenar completamente la plantilla verifique que:\na. No haya celdas con valores como \"#N/A\" o \"#¡REF!\".\nb. No se estén aplicando filtros en la hoja de datos.\nEnvíe la plantilla diligenciada al correo kevin.moreno@invemar.org.co"]
["Proyecto que financia","Monitoreo Pastos - BPIN"]
["Nombre del Archivo",{"$f":"MID(CELL(\"FILENAME\",N63),FIND(\"[\",CELL(\"FILENAME\",N63))+1,   FIND(\"]\",CELL(\"FILENAME\",N63))-FIND(\"[\",CELL(\"FILENAME\",N63))-1)","v":"PASTOS_ESTRUCTURA_20240522i.xlsm"}]
["DOI Metadato"]
["Fuente Plantilla ","http://cinto.invemar.org.co/download/Plantillas_ARGOS_Plus/"]
[null,null,null,"Si requiere ayuda contacte a:\nKevin S. Moreno (kevin.moreno@invemar.org.co)"]
["ROLES INVOLUCRADOS","NOMBRE DE LA PERSONA",null,"El custodio de los datos es el único autorizado para distribuir este conjunto de datos. El observador y el digitador se comprometen a tomar las medidas necesarias para salvaguardar este conjunto de datos de modo que copia de los mismos no sean obtenidas y/o usadas por terceros no relacionados con el propósito para la cual se recolectó."]
[{"$f":"IF(A19=\"\",\"\",INDEX('Otras referencias'!$H$6:$I$9,MATCH(DIGITADOR!A19,'Otras referencias'!$I$6:$I$9,0),1))","v":""},{"$f":"IF(B19=\"\",\"\",INDEX(referentes!$AF$2:$AG$60,MATCH(DIGITADOR!B19,referentes!$AG$2:$AG$60,0),1))","v":""}]
[]
[{"$f":"IF(A21=\"\",\"\",INDEX('Otras referencias'!$H$6:$I$9,MATCH(DIGITADOR!A21,'Otras referencias'!$I$6:$I$9,0),1))","v":""},{"$f":"IF(B21=\"\",\"\",INDEX(referentes!$AF$2:$AG$60,MATCH(DIGITADOR!B21,referentes!$AG$2:$AG$60,0),1))","v":""}]
[]
[{"$f":"IF(A23=\"\",\"\",INDEX('Otras referencias'!$H$6:$I$9,MATCH(DIGITADOR!A23,'Otras referencias'!$I$6:$I$9,0),1))","v":""},{"$f":"IF(B23=\"\",\"\",INDEX(referentes!$AF$2:$AG$60,MATCH(DIGITADOR!B23,referentes!$AG$2:$AG$60,0),1))","v":""}]
[]
[{"$f":"IF(A25=\"\",\"\",INDEX('Otras referencias'!$H$6:$I$9,MATCH(DIGITADOR!A25,'Otras referencias'!$I$6:$I$9,0),1))","v":""},{"$f":"IF(B25=\"\",\"\",INDEX(referentes!$AF$2:$AG$60,MATCH(DIGITADOR!B25,referentes!$AG$2:$AG$60,0),1))","v":""}]
[]
[]
["ATRIBUTOS ADICIONALES"]
["Observaciones generales"]
[]
["REGISTROS GENERADOS",null,"CARGADOS"]
["Muestreos",{"$f":"IF(configuracion!B47=\"\",\"\",configuracion!B47)","v":""},{"$f":"IF(configuracion!C47=\"\",\"\",configuracion!C47)","v":""}]
["Parámetros del muestreo",{"$f":"IF(configuracion!B48=\"\",\"\",configuracion!B48)","v":""},{"$f":"IF(configuracion!C48=\"\",\"\",configuracion!C48)","v":""}]
["Registros",{"$f":"IF(configuracion!B49=\"\",\"\",configuracion!B49)","v":""},{"$f":"IF(configuracion!C49=\"\",\"\",configuracion!C49)","v":""}]
["Variables",{"$f":"IF(configuracion!B50=\"\",\"\",configuracion!B50)","v":""},{"$f":"IF(configuracion!C50=\"\",\"\",configuracion!C50)","v":""}]
["Autorías",{"$f":"IF(configuracion!B51=\"\",\"\",configuracion!B51)","v":""},{"$f":"IF(configuracion!C51=\"\",\"\",configuracion!C51)","v":""}]
["Registros correctos",{"$f":"IF(configuracion!B52=\"\",\"\",configuracion!B52)","v":""},{"$f":"IF(configuracion!C52=\"\",\"\",configuracion!C52)","v":""}]
["json error",{"$f":"IF(C41=\"\",\"\",IF(C41=0,0,IF(B41-C41=0,C41,\"Fallaron \"&B41-C41&\" registros\")))","v":""}]
["error",{"$f":"IF(C42=\"\",\"\",IF(C42=0,0,IF(B42-C42=0,C42,\"Fallaron \"&B42-C42&\" registros\")))","v":""}]

{"sheet":"DATOS","index":3,"n_rows":303,"n_cols":40,"rows_kept":303,"cut":false,"hidden":false,"merged":[[0,6,0,12],[0,13,0,39]]}
[null,null,null,null,null,null,"MUESTREO ",null,null,null,null,null,null,"MUESTRA"]
[{"$f":"TEXT(DIGITADOR!$B$9,\"yyyymmdd\")","v":"30001212"},"AGM MUESTREO","ID MUESTREO","ID MUESTRA","ID ESTACION",null,null,"COD Estación","Estación","Fecha\n(DD/MM/AAAA)",null,null,null,"Transecto","Número\nParcela","COMBINACIÓN\n(Transecto - Num parcela)","CUADRANTE","COD\nTamaño Cuadrante","Tamaño Cuadrante","COD\nEspecie","Especie","Cobertura\n(%)","H1","H2","H3","Promedio H","W1","W2","W3","Promedio W","Densidad","Herbivoria","COD\nHerbivoria","Afectación por  Labyrinthula sp ","COD\nAfectación L sp","Flores","COD\nFlores","Frutos","COD\nFrutos","Observaciones"]
[null,{"$f":"IF(C3=\"\",\"\",IF(COUNTIF($C$3:C3, C3)>1, \"\", C3))","v":""},{"$f":"IF(J3=\"\",\"\",IF(H3=\"\",\"\",CONCATENATE(DIGITADOR!$M$1,J3,E3)))","v":""},{"$f":"IF(C3=\"\",\"\",CONCATENATE(C3,ROW()-2))","v":""},{"$f":"IF(H3=\"\",\"\",VLOOKUP(H3,'Otras referencias'!$A$24:$E$48,2,FALSE))","v":""},null,null,null,{"$f":"IF(H3=\"\",\"\",VLOOKUP(H3,'Otras referencias'!$A$24:$E$48,5,FALSE))","v":""},null,null,null,null,null,null,{"$f":"CONCATENATE(N3,O3)","v":""},{"$f":"IF(AND(P3<>\"\",O3<>\"\"),IF(N3=\"A\",VLOOKUP(P3,'Otras referencias'!$J$24:$K$35,2,FALSE),IF(N3=\"B\",VLOOKUP(P3,'Otras referencias'!$N$24:$O$35,2,),IF(N3=\"C\",VLOOKUP(P3,'Otras referencias'!$R$24:$S$35,2,FALSE)))),\"\")","v":""},{"$f":"IF(S3=\"\",\"\",INDEX(referentes!$G$2:$H$5,MATCH(S3,referentes!$H$2:$H$5,0),1))","v":""},null,null,{"$f":"IF(T3=\"\",\"\",VLOOKUP(T3,referentes!$Q$2:$X$209,2,FALSE))","v":""},null,null,null,null,{"$f":"IF(OR(W3=\"\",X3=\"\",Y3=\"\"),\"\",AVERAGE(W3,X3,Y3))","v":""},null,null,null,{"$f":"IF(OR(AA3=\"\",AB3=\"\",AC3=\"\"),\"\",AVERAGE(AA3,AB3,AC3))","v":""}]
[null,{"$f":"IF(C4=\"\",\"\",IF(COUNTIF($C$3:C4, C4)>1, \"\", C4))","v":""},{"$f":"IF(J4=\"\",\"\",CONCATENATE(DIGITADOR!$M$1,J4,E4))","v":""},{"$f":"IF(C4=\"\",\"\",CONCATENATE(C4,ROW()-2))","v":""},{"$f":"IF(H4=\"\",\"\",VLOOKUP(H4,'Otras referencias'!$A$24:$E$48,2,FALSE))","v":""},null,null,null,{"$f":"IF(H4=\"\",\"\",VLOOKUP(H4,'Otras referencias'!$A$24:$E$48,5,FALSE))","v":""},null,null,null,null,null,null,{"$f":"CONCATENATE(N4,O4)","v":""},{"$f":"IF(AND(P4<>\"\",O4<>\"\"),IF(N4=\"A\",VLOOKUP(P4,'Otras referencias'!$J$24:$K$35,2,FALSE),IF(N4=\"B\",VLOOKUP(P4,'Otras referencias'!$N$24:$O$35,2,),IF(N4=\"C\",VLOOKUP(P4,'Otras referencias'!$R$24:$S$35,2,FALSE)))),\"\")","v":""},{"$f":"IF(S4=\"\",\"\",INDEX(referentes!$G$2:$H$5,MATCH(S4,referentes!$H$2:$H$5,0),1))","v":""},null,null,{"$f":"IF(T4=\"\",\"\",VLOOKUP(T4,referentes!$Q$2:$X$209,2,FALSE))","v":""},null,null,null,null,{"$f":"IF(OR(W4=\"\",X4=\"\",Y4=\"\"),\"\",AVERAGE(W4,X4,Y4))","v":""},null,null,null,{"$f":"IF(OR(AA4=\"\",AB4=\"\",AC4=\"\"),\"\",AVERAGE(AA4,AB4,AC4))","v":""},null,null,{"$f":"IF(AF4<>\"\",VLOOKUP(AF4,'Otras referencias'!$H$19:$I$20,2,FALSE),\"\")","v":""},null,{"$f":"IF(AH4<>\"\",VLOOKUP(AH4,'Otras referencias'!$H$19:$I$20,2,FALSE),\"\")","v":""},null,{"$f":"IF(AJ4<>\"\",VLOOKUP(AJ4,'Otras referencias'!$H$19:$I$20,2,FALSE),\"\")","v":""},null,{"$f":"IF(AL4<>\"\",VLOOKUP(AL4,'Otras referencias'!$H$19:$I$20,2,FALSE),\"\")","v":""}]
[null,{"$f":"IF(C5=\"\",\"\",IF(COUNTIF($C$3:C5, C5)>1, \"\", C5))","v":""},{"$f":"IF(J5=\"\",\"\",CONCATENATE(DIGITADOR!$M$1,J5,E5))","v":""},"",{"$f":"IF(H5=\"\",\"\",VLOOKUP(H5,'Otras referencias'!$A$24:$E$48,2,FALSE))","v":""},null,null,null,{"$f":"IF(H5=\"\",\"\",VLOOKUP(H5,'Otras referencias'!$A$24:$E$48,5,FALSE))","v":""},null,null,null,null,null,null,"",{"$f":"IF(AND(P5<>\"\",O5<>\"\"),IF(N5=\"A\",VLOOKUP(P5,'Otras referencias'!$J$24:$K$35,2,FALSE),IF(N5=\"B\",VLOOKUP(P5,'Otras referencias'!$N$24:$O$35,2,),IF(N5=\"C\",VLOOKUP(P5,'Otras referencias'!$R$24:$S$35,2,FALSE)))),\"\")","v":""},{"$f":"IF(S5=\"\",\"\",INDEX(referentes!$G$2:$H$5,MATCH(S5,referentes!$H$2:$H$5,0),1))","v":""},null,null,{"$f":"IF(T5=\"\",\"\",VLOOKUP(T5,referentes!$Q$2:$X$209,2,FALSE))","v":""},null,null,null,null,"",null,null,null,"",null,null,{"$f":"IF(AF5<>\"\",VLOOKUP(AF5,'Otras referencias'!$H$19:$I$20,2,FALSE),\"\")","v":""},null,{"$f":"IF(AH5<>\"\",VLOOKUP(AH5,'Otras referencias'!$H$19:$I$20,2,FALSE),\"\")","v":""},null,{"$f":"IF(AJ5<>\"\",VLOOKUP(AJ5,'Otras referencias'!$H$19:$I$20,2,FALSE),\"\")","v":""},null,{"$f":"IF(AL5<>\"\",VLOOKUP(AL5,'Otras referencias'!$H$19:$I$20,2,FALSE),\"\")","v":""}]
[null,{"$f":"IF(C6=\"\",\"\",IF(COUNTIF($C$3:C6, C6)>1, \"\", C6))","v":""},{"$f":"IF(J6=\"\",\"\",CONCATENATE(DIGITADOR!$M$1,J6,E6))","v":""},"",{"$f":"IF(H6=\"\",\"\",VLOOKUP(H6,'Otras referencias'!$A$24:$E$48,2,FALSE))","v":""},null,null,null,{"$f":"IF(H6=\"\",\"\",VLOOKUP(H6,'Otras referencias'!$A$24:$E$48,5,FALSE))","v":""},null,null,null,null,null,null,"",{"$f":"IF(AND(P6<>\"\",O6<>\"\"),IF(N6=\"A\",VLOOKUP(P6,'Otras referencias'!$J$24:$K$35,2,FALSE),IF(N6=\"B\",VLOOKUP(P6,'Otras referencias'!$N$24:$O$35,2,),IF(N6=\"C\",VLOOKUP(P6,'Otras referencias'!$R$24:$S$35,2,FALSE)))),\"\")","v":""},{"$f":"IF(S6=\"\",\"\",INDEX(referentes!$G$2:$H$5,MATCH(S6,referentes!$H$2:$H$5,0),1))","v":""},null,null,{"$f":"IF(T6=\"\",\"\",VLOOKUP(T6,referentes!$Q$2:$X$209,2,FALSE))","v":""},null,null,null,null,"",null,null,null,"",null,null,{"$f":"IF(AF6<>\"\",VLOOKUP(AF6,'Otras referencias'!$H$19:$I$20,2,FALSE),\"\")","v":""},null,{"$f":"IF(AH6<>\"\",VLOOKUP(AH6,'Otras referencias'!$H$19:$I$20,2,FALSE),\"\")","v":""},null,{"$f":"IF(AJ6<>\"\",VLOOKUP(AJ6,'Otras referencias'!$H$19:$I$20,2,FALSE),\"\")","v":""},null,{"$f":"IF(AL6<>\"\",VLOOKUP(AL6,'Otras referencias'!$H$19:$I$20,2,FALSE),\"\")","v":""}]
[null,{"$f":"IF(C7=\"\",\"\",IF(COUNTIF($C$3:C7, C7)>1, \"\", C7))","v":""},{"$f":"IF(J7=\"\",\"\",CONCATENATE(DIGITADOR!$M$1,J7,E7))","v":""},"",{"$f":"IF(H7=\"\",\"\",VLOOKUP(H7,'Otras referencias'!$A$24:$E$48,2,FALSE))","v":""},null,null,null,{"$f":"IF(H7=\"\",\"\",VLOOKUP(H7,'Otras referencias'!$A$24:$E$48,5,FALSE))","v":""},null,null,null,null,null,null,"",{"$f":"IF(AND(P7<>\"\",O7<>\"\"),IF(N7=\"A\",VLOOKUP(P7,'Otras referencias'!$J$24:$K$35,2,FALSE),IF(N7=\"B\",VLOOKUP(P7,'Otras referencias'!$N$24:$O$35,2,),IF(N7=\"C\",VLOOKUP(P7,'Otras referencias'!$R$24:$S$35,2,FALSE)))),\"\")","v":""},{"$f":"IF(S7=\"\",\"\",INDEX(referentes!$G$2:$H$5,MATCH(S7,referentes!$H$2:$H$5,0),1))","v":""},null,null,{"$f":"IF(T7=\"\",\"\",VLOOKUP(T7,referentes!$Q$2:$X$209,2,FALSE))","v":""},null,null,null,null,"",null,null,null,"",null,null,{"$f":"IF(AF7<>\"\",VLOOKUP(AF7,'Otras referencias'!$H$19:$I$20,2,FALSE),\"\")","v":""},null,{"$f":"IF(AH7<>\"\",VLOOKUP(AH7,'Otras referencias'!$H$19:$I$20,2,FALSE),\"\")","v":""},null,{"$f":"IF(AJ7<>\"\",VLOOKUP(AJ7,'Otras referencias'!$H$19:$I$20,2,FALSE),\"\")","v":""},null,{"$f":"IF(AL7<>\"\",VLOOKUP(AL7,'Otras referencias'!$H$19:$I$20,2,FALSE),\"\")","v":""}]
[null,{"$f":"IF(C8=\"\",\"\",IF(COUNTIF($C$3:C8, C8)>1, \"\", C8))","v":""},{"$f":"IF(J8=\"\",\"\",CONCATENATE(DIGITADOR!$M$1,J8,E8))","v":""},"",{"$f":"IF(H8=\"\",\"\",VLOOKUP(H8,'Otras referencias'!$A$24:$E$48,2,FALSE))","v":""},null,null,null,{"$f":"IF(H8=\"\",\"\",VLOOKUP(H8,'Otras referencias'!$A$24:$E$48,5,FALSE))","v":""},null,null,null,null,null,null,"",{"$f":"IF(AND(P8<>\"\",O8<>\"\"),IF(N8=\"A\",VLOOKUP(P8,'Otras referencias'!$J$24:$K$35,2,FALSE),IF(N8=\"B\",VLOOKUP(P8,'Otras referencias'!$N$24:$O$35,2,),IF(N8=\"C\",VLOOKUP(P8,'Otras referencias'!$R$24:$S$35,2,FALSE)))),\"\")","v":""},{"$f":"IF(S8=\"\",\"\",INDEX(referentes!$G$2:$H$5,MATCH(S8,referentes!$H$2:$H$5,0),1))","v":""},null,null,{"$f":"IF(T8=\"\",\"\",VLOOKUP(T8,referentes!$Q$2:$X$209,2,FALSE))","v":""},null,null,null,null,"",null,null,null,"",null,null,{"$f":"IF(AF8<>\"\",VLOOKUP(AF8,'Otras referencias'!$H$19:$I$20,2,FALSE),\"\")","v":""},null,{"$f":"IF(AH8<>\"\",VLOOKUP(AH8,'Otras referencias'!$H$19:$I$20,2,FALSE),\"\")","v":""},null,{"$f":"IF(AJ8<>\"\",VLOOKUP(AJ8,'Otras referencias'!$H$19:$I$20,2,FALSE),\"\")","v":""},null,{"$f":"IF(AL8<>\"\",VLOOKUP(AL8,'Otras referencias'!$H$19:$I$20,2,FALSE),\"\")","v":""}]
[null,{"$f":"IF(C9=\"\",\"\",IF(COUNTIF($C$3:C9, C9)>1, \"\", C9))","v":""},{"$f":"IF(J9=\"\",\"\",CONCATENATE(DIGITADOR!$M$1,J9,E9))","v":""},"",{"$f":"IF(H9=\"\",\"\",VLOOKUP(H9,'Otras referencias'!$A$24:$E$48,2,FALSE))","v":""},null,null,null,{"$f":"IF(H9=\"\",\"\",VLOOKUP(H9,'Otras referencias'!$A$24:$E$48,5,FALSE))","v":""},null,null,null,null,null,null,"",{"$f":"IF(AND(P9<>\"\",O9<>\"\"),IF(N9=\"A\",VLOOKUP(P9,'Otras referencias'!$J$24:$K$35,2,FALSE),IF(N9=\"B\",VLOOKUP(P9,'Otras referencias'!$N$24:$O$35,2,),IF(N9=\"C\",VLOOKUP(P9,'Otras referencias'!$R$24:$S$35,2,FALSE)))),\"\")","v":""},{"$f":"IF(S9=\"\",\"\",INDEX(referentes!$G$2:$H$5,MATCH(S9,referentes!$H$2:$H$5,0),1))","v":""},null,null,{"$f":"IF(T9=\"\",\"\",VLOOKUP(T9,referentes!$Q$2:$X$209,2,FALSE))","v":""},null,null,null,null,"",null,null,null,"",null,null,{"$f":"IF(AF9<>\"\",VLOOKUP(AF9,'Otras referencias'!$H$19:$I$20,2,FALSE),\"\")","v":""},null,{"$f":"IF(AH9<>\"\",VLOOKUP(AH9,'Otras referencias'!$H$19:$I$20,2,FALSE),\"\")","v":""},null,{"$f":"IF(AJ9<>\"\",VLOOKUP(AJ9,'Otras referencias'!$H$19:$I$20,2,FALSE),\"\")","v":""},null,{"$f":"IF(AL9<>\"\",VLOOKUP(AL9,'Otras referencias'!$H$19:$I$20,2,FALSE),\"\")","v":""}]
[null,{"$f":"IF(C10=\"\",\"\",IF(COUNTIF($C$3:C10, C10)>1, \"\", C10))","v":""},{"$f":"IF(J10=\"\",\"\",CONCATENATE(DIGITADOR!$M$1,J10,E10))","v":""},"",{"$f":"IF(H10=\"\",\"\",VLOOKUP(H10,'Otras referencias'!$A$24:$E$48,2,FALSE))","v":""},null,null,null,{"$f":"IF(H10=\"\",\"\",VLOOKUP(H10,'Otras referencias'!$A$24:$E$48,5,FALSE))","v":""},null,null,null,null,null,null,"",{"$f":"IF(AND(P10<>\"\",O10<>\"\"),IF(N10=\"A\",VLOOKUP(P10,'Otras referencias'!$J$24:$K$35,2,FALSE),IF(N10=\"B\",VLOOKUP(P10,'Otras referencias'!$N$24:$O$35,2,),IF(N10=\"C\",VLOOKUP(P10,'Otras referencias'!$R$24:$S$35,2,FALSE)))),\"\")","v":""},{"$f":"IF(S10=\"\",\"\",INDEX(referentes!$G$2:$H$5,MATCH(S10,referentes!$H$2:$H$5,0),1))","v":""},null,null,{"$f":"IF(T10=\"\",\"\",VLOOKUP(T10,referentes!$Q$2:$X$209,2,FALSE))","v":""},null,null,null,null,"",null,null,null,"",null,null,{"$f":"IF(AF10<>\"\",VLOOKUP(AF10,'Otras referencias'!$H$19:$I$20,2,FALSE),\"\")","v":""},null,{"$f":"IF(AH10<>\"\",VLOOKUP(AH10,'Otras referencias'!$H$19:$I$20,2,FALSE),\"\")","v":""},null,{"$f":"IF(AJ10<>\"\",VLOOKUP(AJ10,'Otras referencias'!$H$19:$I$20,2,FALSE),\"\")","v":""},null,{"$f":"IF(AL10<>\"\",VLOOKUP(AL10,'Otras referencias'!$H$19:$I$20,2,FALSE),\"\")","v":""}]
[null,{"$f":"IF(C11=\"\",\"\",IF(COUNTIF($C$3:C11, C11)>1, \"\", C11))","v":""},{"$f":"IF(J11=\"\",\"\",CONCATENATE(DIGITADOR!$M$1,J11,E11))","v":""},"",{"$f":"IF(H11=\"\",\"\",VLOOKUP(H11,'Otras referencias'!$A$24:$E$48,2,FALSE))","v":""},null,null,null,{"$f":"IF(H11=\"\",\"\",VLOOKUP(H11,'Otras referencias'!$A$24:$E$48,5,FALSE))","v":""},null,null,null,null,null,null,"",{"$f":"IF(AND(P11<>\"\",O11<>\"\"),IF(N11=\"A\",VLOOKUP(P11,'Otras referencias'!$J$24:$K$35,2,FALSE),IF(N11=\"B\",VLOOKUP(P11,'Otras referencias'!$N$24:$O$35,2,),IF(N11=\"C\",VLOOKUP(P11,'Otras referencias'!$R$24:$S$35,2,FALSE)))),\"\")","v":""},{"$f":"IF(S11=\"\",\"\",INDEX(referentes!$G$2:$H$5,MATCH(S11,referentes!$H$2:$H$5,0),1))","v":""},null,null,{"$f":"IF(T11=\"\",\"\",VLOOKUP(T11,referentes!$Q$2:$X$209,2,FALSE))","v":""},null,null,null,null,"",null,null,null,"",null,null,{"$f":"IF(AF11<>\"\",VLOOKUP(AF11,'Otras referencias'!$H$19:$I$20,2,FALSE),\"\")","v":""},null,{"$f":"IF(AH11<>\"\",VLOOKUP(AH11,'Otras referencias'!$H$19:$I$20,2,FALSE),\"\")","v":""},null,{"$f":"IF(AJ11<>\"\",VLOOKUP(AJ11,'Otras referencias'!$H$19:$I$20,2,FALSE),\"\")","v":""},null,{"$f":"IF(AL11<>\"\",VLOOKUP(AL11,'Otras referencias'!$H$19:$I$20,2,FALSE),\"\")","v":""}]
[null,{"$f":"IF(C12=\"\",\"\",IF(COUNTIF($C$3:C12, C12)>1, \"\", C12))","v":""},{"$f":"IF(J12=\"\",\"\",CONCATENATE(DIGITADOR!$M$1,J12,E12))","v":""},"",{"$f":"IF(H12=\"\",\"\",VLOOKUP(H12,'Otras referencias'!$A$24:$E$48,2,FALSE))","v":""},null,null,null,{"$f":"IF(H12=\"\",\"\",VLOOKUP(H12,'Otras referencias'!$A$24:$E$48,5,FALSE))","v":""},null,null,null,null,null,null,"",{"$f":"IF(AND(P12<>\"\",O12<>\"\"),IF(N12=\"A\",VLOOKUP(P12,'Otras referencias'!$J$24:$K$35,2,FALSE),IF(N12=\"B\",VLOOKUP(P12,'Otras referencias'!$N$24:$O$35,2,),IF(N12=\"C\",VLOOKUP(P12,'Otras referencias'!$R$24:$S$35,2,FALSE)))),\"\")","v":""},{"$f":"IF(S12=\"\",\"\",INDEX(referentes!$G$2:$H$5,MATCH(S12,referentes!$H$2:$H$5,0),1))","v":""},null,null,{"$f":"IF(T12=\"\",\"\",VLOOKUP(T12,referentes!$Q$2:$X$209,2,FALSE))","v":""},null,null,null,null,"",null,null,null,"",null,null,{"$f":"IF(AF12<>\"\",VLOOKUP(AF12,'Otras referencias'!$H$19:$I$20,2,FALSE),\"\")","v":""},null,{"$f":"IF(AH12<>\"\",VLOOKUP(AH12,'Otras referencias'!$H$19:$I$20,2,FALSE),\"\")","v":""},null,{"$f":"IF(AJ12<>\"\",VLOOKUP(AJ12,'Otras referencias'!$H$19:$I$20,2,FALSE),\"\")","v":""},null,{"$f":"IF(AL12<>\"\",VLOOKUP(AL12,'Otras referencias'!$H$19:$I$20,2,FALSE),\"\")","v":""}]
[null,{"$f":"IF(C13=\"\",\"\",IF(COUNTIF($C$3:C13, C13)>1, \"\", C13))","v":""},{"$f":"IF(J13=\"\",\"\",CONCATENATE(DIGITADOR!$M$1,J13,E13))","v":""},"",{"$f":"IF(H13=\"\",\"\",VLOOKUP(H13,'Otras referencias'!$A$24:$E$48,2,FALSE))","v":""},null,null,null,{"$f":"IF(H13=\"\",\"\",VLOOKUP(H13,'Otras referencias'!$A$24:$E$48,5,FALSE))","v":""},null,null,null,null,null,null,"",{"$f":"IF(AND(P13<>\"\",O13<>\"\"),IF(N13=\"A\",VLOOKUP(P13,'Otras referencias'!$J$24:$K$35,2,FALSE),IF(N13=\"B\",VLOOKUP(P13,'Otras referencias'!$N$24:$O$35,2,),IF(N13=\"C\",VLOOKUP(P13,'Otras referencias'!$R$24:$S$35,2,FALSE)))),\"\")","v":""},{"$f":"IF(S13=\"\",\"\",INDEX(referentes!$G$2:$H$5,MATCH(S13,referentes!$H$2:$H$5,0),1))","v":""},null,null,{"$f":"IF(T13=\"\",\"\",VLOOKUP(T13,referentes!$Q$2:$X$209,2,FALSE))","v":""},null,null,null,null,"",null,null,null,"",null,null,{"$f":"IF(AF13<>\"\",VLOOKUP(AF13,'Otras referencias'!$H$19:$I$20,2,FALSE),\"\")","v":""},null,{"$f":"IF(AH13<>\"\",VLOOKUP(AH13,'Otras referencias'!$H$19:$I$20,2,FALSE),\"\")","v":""},null,{"$f":"IF(AJ13<>\"\",VLOOKUP(AJ13,'Otras referencias'!$H$19:$I$20,2,FALSE),\"\")","v":""},null,{"$f":"IF(AL13<>\"\",VLOOKUP(AL13,'Otras referencias'!$H$19:$I$20,2,FALSE),\"\")","v":""}]
[null,{"$f":"IF(C14=\"\",\"\",IF(COUNTIF($C$3:C14, C14)>1, \"\", C14))","v":""},{"$f":"IF(J14=\"\",\"\",CONCATENATE(DIGITADOR!$M$1,J14,E14))","v":""},"",{"$f":"IF(H14=\"\",\"\",VLOOKUP(H14,'Otras referencias'!$A$24:$E$48,2,FALSE))","v":""},null,null,null,{"$f":"IF(H14=\"\",\"\",VLOOKUP(H14,'Otras referencias'!$A$24:$E$48,5,FALSE))","v":""},null,null,null,null,null,null,"",{"$f":"IF(AND(P14<>\"\",O14<>\"\"),IF(N14=\"A\",VLOOKUP(P14,'Otras referencias'!$J$24:$K$35,2,FALSE),IF(N14=\"B\",VLOOKUP(P14,'Otras referencias'!$N$24:$O$35,2,),IF(N14=\"C\",VLOOKUP(P14,'Otras referencias'!$R$24:$S$35,2,FALSE)))),\"\")","v":""},{"$f":"IF(S14=\"\",\"\",INDEX(referentes!$G$2:$H$5,MATCH(S14,referentes!$H$2:$H$5,0),1))","v":""},null,null,{"$f":"IF(T14=\"\",\"\",VLOOKUP(T14,referentes!$Q$2:$X$209,2,FALSE))","v":""},null,null,null,null,"",null,null,null,"",null,null,{"$f":"IF(AF14<>\"\",VLOOKUP(AF14,'Otras referencias'!$H$19:$I$20,2,FALSE),\"\")","v":""},null,{"$f":"IF(AH14<>\"\",VLOOKUP(AH14,'Otras referencias'!$H$19:$I$20,2,FALSE),\"\")","v":""},null,{"$f":"IF(AJ14<>\"\",VLOOKUP(AJ14,'Otras referencias'!$H$19:$I$20,2,FALSE),\"\")","v":""},null,{"$f":"IF(AL14<>\"\",VLOOKUP(AL14,'Otras referencias'!$H$19:$I$20,2,FALSE),\"\")","v":""}]
[null,{"$f":"IF(C15=\"\",\"\",IF(COUNTIF($C$3:C15, C15)>1, \"\", C15))","v":""},{"$f":"IF(J15=\"\",\"\",CONCATENATE(DIGITADOR!$M$1,J15,E15))","v":""},"",{"$f":"IF(H15=\"\",\"\",VLOOKUP(H15,'Otras referencias'!$A$24:$E$48,2,FALSE))","v":""},null,null,null,{"$f":"IF(H15=\"\",\"\",VLOOKUP(H15,'Otras referencias'!$A$24:$E$48,5,FALSE))","v":""},null,null,null,null,null,null,"",{"$f":"IF(AND(P15<>\"\",O15<>\"\"),IF(N15=\"A\",VLOOKUP(P15,'Otras referencias'!$J$24:$K$35,2,FALSE),IF(N15=\"B\",VLOOKUP(P15,'Otras referencias'!$N$24:$O$35,2,),IF(N15=\"C\",VLOOKUP(P15,'Otras referencias'!$R$24:$S$35,2,FALSE)))),\"\")","v":""},{"$f":"IF(S15=\"\",\"\",INDEX(referentes!$G$2:$H$5,MATCH(S15,referentes!$H$2:$H$5,0),1))","v":""},null,null,{"$f":"IF(T15=\"\",\"\",VLOOKUP(T15,referentes!$Q$2:$X$209,2,FALSE))","v":""},null,null,null,null,"",null,null,null,"",null,null,{"$f":"IF(AF15<>\"\",VLOOKUP(AF15,'Otras referencias'!$H$19:$I$20,2,FALSE),\"\")","v":""},null,{"$f":"IF(AH15<>\"\",VLOOKUP(AH15,'Otras referencias'!$H$19:$I$20,2,FALSE),\"\")","v":""},null,{"$f":"IF(AJ15<>\"\",VLOOKUP(AJ15,'Otras referencias'!$H$19:$I$20,2,FALSE),\"\")","v":""},null,{"$f":"IF(AL15<>\"\",VLOOKUP(AL15,'Otras referencias'!$H$19:$I$20,2,FALSE),\"\")","v":""}]
[null,{"$f":"IF(C16=\"\",\"\",IF(COUNTIF($C$3:C16, C16)>1, \"\", C16))","v":""},{"$f":"IF(J16=\"\",\"\",CONCATENATE(DIGITADOR!$M$1,J16,E16))","v":""},"",{"$f":"IF(H16=\"\",\"\",VLOOKUP(H16,'Otras referencias'!$A$24:$E$48,2,FALSE))","v":""},null,null,null,{"$f":"IF(H16=\"\",\"\",VLOOKUP(H16,'Otras referencias'!$A$24:$E$48,5,FALSE))","v":""},null,null,null,null,null,null,"",{"$f":"IF(AND(P16<>\"\",O16<>\"\"),IF(N16=\"A\",VLOOKUP(P16,'Otras referencias'!$J$24:$K$35,2,FALSE),IF(N16=\"B\",VLOOKUP(P16,'Otras referencias'!$N$24:$O$35,2,),IF(N16=\"C\",VLOOKUP(P16,'Otras referencias'!$R$24:$S$35,2,FALSE)))),\"\")","v":""},{"$f":"IF(S16=\"\",\"\",INDEX(referentes!$G$2:$H$5,MATCH(S16,referentes!$H$2:$H$5,0),1))","v":""},null,null,{"$f":"IF(T16=\"\",\"\",VLOOKUP(T16,referentes!$Q$2:$X$209,2,FALSE))","v":""},null,null,null,null,"",null,null,null,"",null,null,{"$f":"IF(AF16<>\"\",VLOOKUP(AF16,'Otras referencias'!$H$19:$I$20,2,FALSE),\"\")","v":""},null,{"$f":"IF(AH16<>\"\",VLOOKUP(AH16,'Otras referencias'!$H$19:$I$20,2,FALSE),\"\")","v":""},null,{"$f":"IF(AJ16<>\"\",VLOOKUP(AJ16,'Otras referencias'!$H$19:$I$20,2,FALSE),\"\")","v":""},null,{"$f":"IF(AL16<>\"\",VLOOKUP(AL16,'Otras referencias'!$H$19:$I$20,2,FALSE),\"\")","v":""}]
[null,{"$f":"IF(C17=\"\",\"\",IF(COUNTIF($C$3:C17, C17)>1, \"\", C17))","v":""},{"$f":"IF(J17=\"\",\"\",CONCATENATE(DIGITADOR!$M$1,J17,E17))","v":""},"",{"$f":"IF(H17=\"\",\"\",VLOOKUP(H17,'Otras referencias'!$A$24:$E$48,2,FALSE))","v":""},null,null,null,{"$f":"IF(H17=\"\",\"\",VLOOKUP(H17,'Otras referencias'!$A$24:$E$48,5,FALSE))","v":""},null,null,null,null,null,null,"",{"$f":"IF(AND(P17<>\"\",O17<>\"\"),IF(N17=\"A\",VLOOKUP(P17,'Otras referencias'!$J$24:$K$35,2,FALSE),IF(N17=\"B\",VLOOKUP(P17,'Otras referencias'!$N$24:$O$35,2,),IF(N17=\"C\",VLOOKUP(P17,'Otras referencias'!$R$24:$S$35,2,FALSE)))),\"\")","v":""},{"$f":"IF(S17=\"\",\"\",INDEX(referentes!$G$2:$H$5,MATCH(S17,referentes!$H$2:$H$5,0),1))","v":""},null,null,{"$f":"IF(T17=\"\",\"\",VLOOKUP(T17,referentes!$Q$2:$X$209,2,FALSE))","v":""},null,null,null,null,"",null,null,null,"",null,null,{"$f":"IF(AF17<>\"\",VLOOKUP(AF17,'Otras referencias'!$H$19:$I$20,2,FALSE),\"\")","v":""},null,{"$f":"IF(AH17<>\"\",VLOOKUP(AH17,'Otras referencias'!$H$19:$I$20,2,FALSE),\"\")","v":""},null,{"$f":"IF(AJ17<>\"\",VLOOKUP(AJ17,'Otras referencias'!$H$19:$I$20,2,FALSE),\"\")","v":""},null,{"$f":"IF(AL17<>\"\",VLOOKUP(AL17,'Otras referencias'!$H$19:$I$20,2,FALSE),\"\")","v":""}]
[null,{"$f":"IF(C18=\"\",\"\",IF(COUNTIF($C$3:C18, C18)>1, \"\", C18))","v":""},{"$f":"IF(J18=\"\",\"\",CONCATENATE(DIGITADOR!$M$1,J18,E18))","v":""},"",{"$f":"IF(H18=\"\",\"\",VLOOKUP(H18,'Otras referencias'!$A$24:$E$48,2,FALSE))","v":""},null,null,null,{"$f":"IF(H18=\"\",\"\",VLOOKUP(H18,'Otras referencias'!$A$24:$E$48,5,FALSE))","v":""},null,null,null,null,null,null,"",{"$f":"IF(AND(P18<>\"\",O18<>\"\"),IF(N18=\"A\",VLOOKUP(P18,'Otras referencias'!$J$24:$K$35,2,FALSE),IF(N18=\"B\",VLOOKUP(P18,'Otras referencias'!$N$24:$O$35,2,),IF(N18=\"C\",VLOOKUP(P18,'Otras referencias'!$R$24:$S$35,2,FALSE)))),\"\")","v":""},{"$f":"IF(S18=\"\",\"\",INDEX(referentes!$G$2:$H$5,MATCH(S18,referentes!$H$2:$H$5,0),1))","v":""},null,null,{"$f":"IF(T18=\"\",\"\",VLOOKUP(T18,referentes!$Q$2:$X$209,2,FALSE))","v":""},null,null,null,null,"",null,null,null,"",null,null,{"$f":"IF(AF18<>\"\",VLOOKUP(AF18,'Otras referencias'!$H$19:$I$20,2,FALSE),\"\")","v":""},null,{"$f":"IF(AH18<>\"\",VLOOKUP(AH18,'Otras referencias'!$H$19:$I$20,2,FALSE),\"\")","v":""},null,{"$f":"IF(AJ18<>\"\",VLOOKUP(AJ18,'Otras referencias'!$H$19:$I$20,2,FALSE),\"\")","v":""},null,{"$f":"IF(AL18<>\"\",VLOOKUP(AL18,'Otras referencias'!$H$19:$I$20,2,FALSE),\"\")","v":""}]
[null,{"$f":"IF(C19=\"\",\"\",IF(COUNTIF($C$3:C19, C19)>1, \"\", C19))","v":""},{"$f":"IF(J19=\"\",\"\",CONCATENATE(DIGITADOR!$M$1,J19,E19))","v":""},"",{"$f":"IF(H19=\"\",\"\",VLOOKUP(H19,'Otras referencias'!$A$24:$E$48,2,FALSE))","v":""},null,null,null,{"$f":"IF(H19=\"\",\"\",VLOOKUP(H19,'Otras referencias'!$A$24:$E$48,5,FALSE))","v":""},null,null,null,null,null,null,"",{"$f":"IF(AND(P19<>\"\",O19<>\"\"),IF(N19=\"A\",VLOOKUP(P19,'Otras referencias'!$J$24:$K$35,2,FALSE),IF(N19=\"B\",VLOOKUP(P19,'Otras referencias'!$N$24:$O$35,2,),IF(N19=\"C\",VLOOKUP(P19,'Otras referencias'!$R$24:$S$35,2,FALSE)))),\"\")","v":""},{"$f":"IF(S19=\"\",\"\",INDEX(referentes!$G$2:$H$5,MATCH(S19,referentes!$H$2:$H$5,0),1))","v":""},null,null,{"$f":"IF(T19=\"\",\"\",VLOOKUP(T19,referentes!$Q$2:$X$209,2,FALSE))","v":""},null,null,null,null,"",null,null,null,"",null,null,{"$f":"IF(AF19<>\"\",VLOOKUP(AF19,'Otras referencias'!$H$19:$I$20,2,FALSE),\"\")","v":""},null,{"$f":"IF(AH19<>\"\",VLOOKUP(AH19,'Otras referencias'!$H$19:$I$20,2,FALSE),\"\")","v":""},null,{"$f":"IF(AJ19<>\"\",VLOOKUP(AJ19,'Otras referencias'!$H$19:$I$20,2,FALSE),\"\")","v":""},null,{"$f":"IF(AL19<>\"\",VLOOKUP(AL19,'Otras referencias'!$H$19:$I$20,2,FALSE),\"\")","v":""}]
[null,{"$f":"IF(C20=\"\",\"\",IF(COUNTIF($C$3:C20, C20)>1, \"\", C20))","v":""},{"$f":"IF(J20=\"\",\"\",CONCATENATE(DIGITADOR!$M$1,J20,E20))","v":""},"",{"$f":"IF(H20=\"\",\"\",VLOOKUP(H20,'Otras referencias'!$A$24:$E$48,2,FALSE))","v":""},null,null,null,{"$f":"IF(H20=\"\",\"\",VLOOKUP(H20,'Otras referencias'!$A$24:$E$48,5,FALSE))","v":""},null,null,null,null,null,null,"",{"$f":"IF(AND(P20<>\"\",O20<>\"\"),IF(N20=\"A\",VLOOKUP(P20,'Otras referencias'!$J$24:$K$35,2,FALSE),IF(N20=\"B\",VLOOKUP(P20,'Otras referencias'!$N$24:$O$35,2,),IF(N20=\"C\",VLOOKUP(P20,'Otras referencias'!$R$24:$S$35,2,FALSE)))),\"\")","v":""},{"$f":"IF(S20=\"\",\"\",INDEX(referentes!$G$2:$H$5,MATCH(S20,referentes!$H$2:$H$5,0),1))","v":""},null,null,{"$f":"IF(T20=\"\",\"\",VLOOKUP(T20,referentes!$Q$2:$X$209,2,FALSE))","v":""},null,null,null,null,"",null,null,null,"",null,null,{"$f":"IF(AF20<>\"\",VLOOKUP(AF20,'Otras referencias'!$H$19:$I$20,2,FALSE),\"\")","v":""},null,{"$f":"IF(AH20<>\"\",VLOOKUP(AH20,'Otras referencias'!$H$19:$I$20,2,FALSE),\"\")","v":""},null,{"$f":"IF(AJ20<>\"\",VLOOKUP(AJ20,'Otras referencias'!$H$19:$I$20,2,FALSE),\"\")","v":""},null,{"$f":"IF(AL20<>\"\",VLOOKUP(AL20,'Otras referencias'!$H$19:$I$20,2,FALSE),\"\")","v":""}]
[null,{"$f":"IF(C21=\"\",\"\",IF(COUNTIF($C$3:C21, C21)>1, \"\", C21))","v":""},{"$f":"IF(J21=\"\",\"\",CONCATENATE(DIGITADOR!$M$1,J21,E21))","v":""},"",{"$f":"IF(H21=\"\",\"\",VLOOKUP(H21,'Otras referencias'!$A$24:$E$48,2,FALSE))","v":""},null,null,null,{"$f":"IF(H21=\"\",\"\",VLOOKUP(H21,'Otras referencias'!$A$24:$E$48,5,FALSE))","v":""},null,null,null,null,null,null,"",{"$f":"IF(AND(P21<>\"\",O21<>\"\"),IF(N21=\"A\",VLOOKUP(P21,'Otras referencias'!$J$24:$K$35,2,FALSE),IF(N21=\"B\",VLOOKUP(P21,'Otras referencias'!$N$24:$O$35,2,),IF(N21=\"C\",VLOOKUP(P21,'Otras referencias'!$R$24:$S$35,2,FALSE)))),\"\")","v":""},{"$f":"IF(S21=\"\",\"\",INDEX(referentes!$G$2:$H$5,MATCH(S21,referentes!$H$2:$H$5,0),1))","v":""},null,null,{"$f":"IF(T21=\"\",\"\",VLOOKUP(T21,referentes!$Q$2:$X$209,2,FALSE))","v":""},null,null,null,null,"",null,null,null,"",null,null,{"$f":"IF(AF21<>\"\",VLOOKUP(AF21,'Otras referencias'!$H$19:$I$20,2,FALSE),\"\")","v":""},null,{"$f":"IF(AH21<>\"\",VLOOKUP(AH21,'Otras referencias'!$H$19:$I$20,2,FALSE),\"\")","v":""},null,{"$f":"IF(AJ21<>\"\",VLOOKUP(AJ21,'Otras referencias'!$H$19:$I$20,2,FALSE),\"\")","v":""},null,{"$f":"IF(AL21<>\"\",VLOOKUP(AL21,'Otras referencias'!$H$19:$I$20,2,FALSE),\"\")","v":""}]
[null,{"$f":"IF(C22=\"\",\"\",IF(COUNTIF($C$3:C22, C22)>1, \"\", C22))","v":""},{"$f":"IF(J22=\"\",\"\",CONCATENATE(DIGITADOR!$M$1,J22,E22))","v":""},"",{"$f":"IF(H22=\"\",\"\",VLOOKUP(H22,'Otras referencias'!$A$24:$E$48,2,FALSE))","v":""},null,null,null,{"$f":"IF(H22=\"\",\"\",VLOOKUP(H22,'Otras referencias'!$A$24:$E$48,5,FALSE))","v":""},null,null,null,null,null,null,"",{"$f":"IF(AND(P22<>\"\",O22<>\"\"),IF(N22=\"A\",VLOOKUP(P22,'Otras referencias'!$J$24:$K$35,2,FALSE),IF(N22=\"B\",VLOOKUP(P22,'Otras referencias'!$N$24:$O$35,2,),IF(N22=\"C\",VLOOKUP(P22,'Otras referencias'!$R$24:$S$35,2,FALSE)))),\"\")","v":""},{"$f":"IF(S22=\"\",\"\",INDEX(referentes!$G$2:$H$5,MATCH(S22,referentes!$H$2:$H$5,0),1))","v":""},null,null,{"$f":"IF(T22=\"\",\"\",VLOOKUP(T22,referentes!$Q$2:$X$209,2,FALSE))","v":""},null,null,null,null,"",null,null,null,"",null,null,{"$f":"IF(AF22<>\"\",VLOOKUP(AF22,'Otras referencias'!$H$19:$I$20,2,FALSE),\"\")","v":""},null,{"$f":"IF(AH22<>\"\",VLOOKUP(AH22,'Otras referencias'!$H$19:$I$20,2,FALSE),\"\")","v":""},null,{"$f":"IF(AJ22<>\"\",VLOOKUP(AJ22,'Otras referencias'!$H$19:$I$20,2,FALSE),\"\")","v":""},null,{"$f":"IF(AL22<>\"\",VLOOKUP(AL22,'Otras referencias'!$H$19:$I$20,2,FALSE),\"\")","v":""}]
[null,{"$f":"IF(C23=\"\",\"\",IF(COUNTIF($C$3:C23, C23)>1, \"\", C23))","v":""},{"$f":"IF(J23=\"\",\"\",CONCATENATE(DIGITADOR!$M$1,J23,E23))","v":""},"",{"$f":"IF(H23=\"\",\"\",VLOOKUP(H23,'Otras referencias'!$A$24:$E$48,2,FALSE))","v":""},null,null,null,{"$f":"IF(H23=\"\",\"\",VLOOKUP(H23,'Otras referencias'!$A$24:$E$48,5,FALSE))","v":""},null,null,null,null,null,null,"",{"$f":"IF(AND(P23<>\"\",O23<>\"\"),IF(N23=\"A\",VLOOKUP(P23,'Otras referencias'!$J$24:$K$35,2,FALSE),IF(N23=\"B\",VLOOKUP(P23,'Otras referencias'!$N$24:$O$35,2,),IF(N23=\"C\",VLOOKUP(P23,'Otras referencias'!$R$24:$S$35,2,FALSE)))),\"\")","v":""},{"$f":"IF(S23=\"\",\"\",INDEX(referentes!$G$2:$H$5,MATCH(S23,referentes!$H$2:$H$5,0),1))","v":""},null,null,{"$f":"IF(T23=\"\",\"\",VLOOKUP(T23,referentes!$Q$2:$X$209,2,FALSE))","v":""},null,null,null,null,"",null,null,null,"",null,null,{"$f":"IF(AF23<>\"\",VLOOKUP(AF23,'Otras referencias'!$H$19:$I$20,2,FALSE),\"\")","v":""},null,{"$f":"IF(AH23<>\"\",VLOOKUP(AH23,'Otras referencias'!$H$19:$I$20,2,FALSE),\"\")","v":""},null,{"$f":"IF(AJ23<>\"\",VLOOKUP(AJ23,'Otras referencias'!$H$19:$I$20,2,FALSE),\"\")","v":""},null,{"$f":"IF(AL23<>\"\",VLOOKUP(AL23,'Otras referencias'!$H$19:$I$20,2,FALSE),\"\")","v":""}]
[null,{"$f":"IF(C24=\"\",\"\",IF(COUNTIF($C$3:C24, C24)>1, \"\", C24))","v":""},{"$f":"IF(J24=\"\",\"\",CONCATENATE(DIGITADOR!$M$1,J24,E24))","v":""},"",{"$f":"IF(H24=\"\",\"\",VLOOKUP(H24,'Otras referencias'!$A$24:$E$48,2,FALSE))","v":""},null,null,null,{"$f":"IF(H24=\"\",\"\",VLOOKUP(H24,'Otras referencias'!$A$24:$E$48,5,FALSE))","v":""},null,null,null,null,null,null,"",{"$f":"IF(AND(P24<>\"\",O24<>\"\"),IF(N24=\"A\",VLOOKUP(P24,'Otras referencias'!$J$24:$K$35,2,FALSE),IF(N24=\"B\",VLOOKUP(P24,'Otras referencias'!$N$24:$O$35,2,),IF(N24=\"C\",VLOOKUP(P24,'Otras referencias'!$R$24:$S$35,2,FALSE)))),\"\")","v":""},{"$f":"IF(S24=\"\",\"\",INDEX(referentes!$G$2:$H$5,MATCH(S24,referentes!$H$2:$H$5,0),1))","v":""},null,null,{"$f":"IF(T24=\"\",\"\",VLOOKUP(T24,referentes!$Q$2:$X$209,2,FALSE))","v":""},null,null,null,null,"",null,null,null,"",null,null,{"$f":"IF(AF24<>\"\",VLOOKUP(AF24,'Otras referencias'!$H$19:$I$20,2,FALSE),\"\")","v":""},null,{"$f":"IF(AH24<>\"\",VLOOKUP(AH24,'Otras referencias'!$H$19:$I$20,2,FALSE),\"\")","v":""},null,{"$f":"IF(AJ24<>\"\",VLOOKUP(AJ24,'Otras referencias'!$H$19:$I$20,2,FALSE),\"\")","v":""},null,{"$f":"IF(AL24<>\"\",VLOOKUP(AL24,'Otras referencias'!$H$19:$I$20,2,FALSE),\"\")","v":""}]
[null,{"$f":"IF(C25=\"\",\"\",IF(COUNTIF($C$3:C25, C25)>1, \"\", C25))","v":""},{"$f":"IF(J25=\"\",\"\",CONCATENATE(DIGITADOR!$M$1,J25,E25))","v":""},"",{"$f":"IF(H25=\"\",\"\",VLOOKUP(H25,'Otras referencias'!$A$24:$E$48,2,FALSE))","v":""},null,null,null,{"$f":"IF(H25=\"\",\"\",VLOOKUP(H25,'Otras referencias'!$A$24:$E$48,5,FALSE))","v":""},null,null,null,null,null,null,"",{"$f":"IF(AND(P25<>\"\",O25<>\"\"),IF(N25=\"A\",VLOOKUP(P25,'Otras referencias'!$J$24:$K$35,2,FALSE),IF(N25=\"B\",VLOOKUP(P25,'Otras referencias'!$N$24:$O$35,2,),IF(N25=\"C\",VLOOKUP(P25,'Otras referencias'!$R$24:$S$35,2,FALSE)))),\"\")","v":""},{"$f":"IF(S25=\"\",\"\",INDEX(referentes!$G$2:$H$5,MATCH(S25,referentes!$H$2:$H$5,0),1))","v":""},null,null,{"$f":"IF(T25=\"\",\"\",VLOOKUP(T25,referentes!$Q$2:$X$209,2,FALSE))","v":""},null,null,null,null,"",null,null,null,"",null,null,{"$f":"IF(AF25<>\"\",VLOOKUP(AF25,'Otras referencias'!$H$19:$I$20,2,FALSE),\"\")","v":""},null,{"$f":"IF(AH25<>\"\",VLOOKUP(AH25,'Otras referencias'!$H$19:$I$20,2,FALSE),\"\")","v":""},null,{"$f":"IF(AJ25<>\"\",VLOOKUP(AJ25,'Otras referencias'!$H$19:$I$20,2,FALSE),\"\")","v":""},null,{"$f":"IF(AL25<>\"\",VLOOKUP(AL25,'Otras referencias'!$H$19:$I$20,2,FALSE),\"\")","v":""}]
[null,{"$f":"IF(C26=\"\",\"\",IF(COUNTIF($C$3:C26, C26)>1, \"\", C26))","v":""},{"$f":"IF(J26=\"\",\"\",CONCATENATE(DIGITADOR!$M$1,J26,E26))","v":""},"",{"$f":"IF(H26=\"\",\"\",VLOOKUP(H26,'Otras referencias'!$A$24:$E$48,2,FALSE))","v":""},null,null,null,{"$f":"IF(H26=\"\",\"\",VLOOKUP(H26,'Otras referencias'!$A$24:$E$48,5,FALSE))","v":""},null,null,null,null,null,null,"",{"$f":"IF(AND(P26<>\"\",O26<>\"\"),IF(N26=\"A\",VLOOKUP(P26,'Otras referencias'!$J$24:$K$35,2,FALSE),IF(N26=\"B\",VLOOKUP(P26,'Otras referencias'!$N$24:$O$35,2,),IF(N26=\"C\",VLOOKUP(P26,'Otras referencias'!$R$24:$S$35,2,FALSE)))),\"\")","v":""},{"$f":"IF(S26=\"\",\"\",INDEX(referentes!$G$2:$H$5,MATCH(S26,referentes!$H$2:$H$5,0),1))","v":""},null,null,{"$f":"IF(T26=\"\",\"\",VLOOKUP(T26,referentes!$Q$2:$X$209,2,FALSE))","v":""},null,null,null,null,"",null,null,null,"",null,null,{"$f":"IF(AF26<>\"\",VLOOKUP(AF26,'Otras referencias'!$H$19:$I$20,2,FALSE),\"\")","v":""},null,{"$f":"IF(AH26<>\"\",VLOOKUP(AH26,'Otras referencias'!$H$19:$I$20,2,FALSE),\"\")","v":""},null,{"$f":"IF(AJ26<>\"\",VLOOKUP(AJ26,'Otras referencias'!$H$19:$I$20,2,FALSE),\"\")","v":""},null,{"$f":"IF(AL26<>\"\",VLOOKUP(AL26,'Otras referencias'!$H$19:$I$20,2,FALSE),\"\")","v":""}]
[null,{"$f":"IF(C27=\"\",\"\",IF(COUNTIF($C$3:C27, C27)>1, \"\", C27))","v":""},{"$f":"IF(J27=\"\",\"\",CONCATENATE(DIGITADOR!$M$1,J27,E27))","v":""},"",{"$f":"IF(H27=\"\",\"\",VLOOKUP(H27,'Otras referencias'!$A$24:$E$48,2,FALSE))","v":""},null,null,null,{"$f":"IF(H27=\"\",\"\",VLOOKUP(H27,'Otras referencias'!$A$24:$E$48,5,FALSE))","v":""},null,null,null,null,null,null,"",{"$f":"IF(AND(P27<>\"\",O27<>\"\"),IF(N27=\"A\",VLOOKUP(P27,'Otras referencias'!$J$24:$K$35,2,FALSE),IF(N27=\"B\",VLOOKUP(P27,'Otras referencias'!$N$24:$O$35,2,),IF(N27=\"C\",VLOOKUP(P27,'Otras referencias'!$R$24:$S$35,2,FALSE)))),\"\")","v":""},{"$f":"IF(S27=\"\",\"\",INDEX(referentes!$G$2:$H$5,MATCH(S27,referentes!$H$2:$H$5,0),1))","v":""},null,null,{"$f":"IF(T27=\"\",\"\",VLOOKUP(T27,referentes!$Q$2:$X$209,2,FALSE))","v":""},null,null,null,null,"",null,null,null,"",null,null,{"$f":"IF(AF27<>\"\",VLOOKUP(AF27,'Otras referencias'!$H$19:$I$20,2,FALSE),\"\")","v":""},null,{"$f":"IF(AH27<>\"\",VLOOKUP(AH27,'Otras referencias'!$H$19:$I$20,2,FALSE),\"\")","v":""},null,{"$f":"IF(AJ27<>\"\",VLOOKUP(AJ27,'Otras referencias'!$H$19:$I$20,2,FALSE),\"\")","v":""},null,{"$f":"IF(AL27<>\"\",VLOOKUP(AL27,'Otras referencias'!$H$19:$I$20,2,FALSE),\"\")","v":""}]
[null,{"$f":"IF(C28=\"\",\"\",IF(COUNTIF($C$3:C28, C28)>1, \"\", C28))","v":""},{"$f":"IF(J28=\"\",\"\",CONCATENATE(DIGITADOR!$M$1,J28,E28))","v":""},"",{"$f":"IF(H28=\"\",\"\",VLOOKUP(H28,'Otras referencias'!$A$24:$E$48,2,FALSE))","v":""},null,null,null,{"$f":"IF(H28=\"\",\"\",VLOOKUP(H28,'Otras referencias'!$A$24:$E$48,5,FALSE))","v":""},null,null,null,null,null,null,"",{"$f":"IF(AND(P28<>\"\",O28<>\"\"),IF(N28=\"A\",VLOOKUP(P28,'Otras referencias'!$J$24:$K$35,2,FALSE),IF(N28=\"B\",VLOOKUP(P28,'Otras referencias'!$N$24:$O$35,2,),IF(N28=\"C\",VLOOKUP(P28,'Otras referencias'!$R$24:$S$35,2,FALSE)))),\"\")","v":""},{"$f":"IF(S28=\"\",\"\",INDEX(referentes!$G$2:$H$5,MATCH(S28,referentes!$H$2:$H$5,0),1))","v":""},null,null,{"$f":"IF(T28=\"\",\"\",VLOOKUP(T28,referentes!$Q$2:$X$209,2,FALSE))","v":""},null,null,null,null,"",null,null,null,"",null,null,{"$f":"IF(AF28<>\"\",VLOOKUP(AF28,'Otras referencias'!$H$19:$I$20,2,FALSE),\"\")","v":""},null,{"$f":"IF(AH28<>\"\",VLOOKUP(AH28,'Otras referencias'!$H$19:$I$20,2,FALSE),\"\")","v":""},null,{"$f":"IF(AJ28<>\"\",VLOOKUP(AJ28,'Otras referencias'!$H$19:$I$20,2,FALSE),\"\")","v":""},null,{"$f":"IF(AL28<>\"\",VLOOKUP(AL28,'Otras referencias'!$H$19:$I$20,2,FALSE),\"\")","v":""}]
[null,{"$f":"IF(C29=\"\",\"\",IF(COUNTIF($C$3:C29, C29)>1, \"\", C29))","v":""},{"$f":"IF(J29=\"\",\"\",CONCATENATE(DIGITADOR!$M$1,J29,E29))","v":""},"",{"$f":"IF(H29=\"\",\"\",VLOOKUP(H29,'Otras referencias'!$A$24:$E$48,2,FALSE))","v":""},null,null,null,{"$f":"IF(H29=\"\",\"\",VLOOKUP(H29,'Otras referencias'!$A$24:$E$48,5,FALSE))","v":""},null,null,null,null,null,null,"",{"$f":"IF(AND(P29<>\"\",O29<>\"\"),IF(N29=\"A\",VLOOKUP(P29,'Otras referencias'!$J$24:$K$35,2,FALSE),IF(N29=\"B\",VLOOKUP(P29,'Otras referencias'!$N$24:$O$35,2,),IF(N29=\"C\",VLOOKUP(P29,'Otras referencias'!$R$24:$S$35,2,FALSE)))),\"\")","v":""},{"$f":"IF(S29=\"\",\"\",INDEX(referentes!$G$2:$H$5,MATCH(S29,referentes!$H$2:$H$5,0),1))","v":""},null,null,{"$f":"IF(T29=\"\",\"\",VLOOKUP(T29,referentes!$Q$2:$X$209,2,FALSE))","v":""},null,null,null,null,"",null,null,null,"",null,null,{"$f":"IF(AF29<>\"\",VLOOKUP(AF29,'Otras referencias'!$H$19:$I$20,2,FALSE),\"\")","v":""},null,{"$f":"IF(AH29<>\"\",VLOOKUP(AH29,'Otras referencias'!$H$19:$I$20,2,FALSE),\"\")","v":""},null,{"$f":"IF(AJ29<>\"\",VLOOKUP(AJ29,'Otras referencias'!$H$19:$I$20,2,FALSE),\"\")","v":""},null,{"$f":"IF(AL29<>\"\",VLOOKUP(AL29,'Otras referencias'!$H$19:$I$20,2,FALSE),\"\")","v":""}]
[null,{"$f":"IF(C30=\"\",\"\",IF(COUNTIF($C$3:C30, C30)>1, \"\", C30))","v":""},{"$f":"IF(J30=\"\",\"\",CONCATENATE(DIGITADOR!$M$1,J30,E30))","v":""},"",{"$f":"IF(H30=\"\",\"\",VLOOKUP(H30,'Otras referencias'!$A$24:$E$48,2,FALSE))","v":""},null,null,null,{"$f":"IF(H30=\"\",\"\",VLOOKUP(H30,'Otras referencias'!$A$24:$E$48,5,FALSE))","v":""},null,null,null,null,null,null,"",{"$f":"IF(AND(P30<>\"\",O30<>\"\"),IF(N30=\"A\",VLOOKUP(P30,'Otras referencias'!$J$24:$K$35,2,FALSE),IF(N30=\"B\",VLOOKUP(P30,'Otras referencias'!$N$24:$O$35,2,),IF(N30=\"C\",VLOOKUP(P30,'Otras referencias'!$R$24:$S$35,2,FALSE)))),\"\")","v":""},{"$f":"IF(S30=\"\",\"\",INDEX(referentes!$G$2:$H$5,MATCH(S30,referentes!$H$2:$H$5,0),1))","v":""},null,null,{"$f":"IF(T30=\"\",\"\",VLOOKUP(T30,referentes!$Q$2:$X$209,2,FALSE))","v":""},null,null,null,null,"",null,null,null,"",null,null,{"$f":"IF(AF30<>\"\",VLOOKUP(AF30,'Otras referencias'!$H$19:$I$20,2,FALSE),\"\")","v":""},null,{"$f":"IF(AH30<>\"\",VLOOKUP(AH30,'Otras referencias'!$H$19:$I$20,2,FALSE),\"\")","v":""},null,{"$f":"IF(AJ30<>\"\",VLOOKUP(AJ30,'Otras referencias'!$H$19:$I$20,2,FALSE),\"\")","v":""},null,{"$f":"IF(AL30<>\"\",VLOOKUP(AL30,'Otras referencias'!$H$19:$I$20,2,FALSE),\"\")","v":""}]
[null,{"$f":"IF(C31=\"\",\"\",IF(COUNTIF($C$3:C31, C31)>1, \"\", C31))","v":""},{"$f":"IF(J31=\"\",\"\",CONCATENATE(DIGITADOR!$M$1,J31,E31))","v":""},"",{"$f":"IF(H31=\"\",\"\",VLOOKUP(H31,'Otras referencias'!$A$24:$E$48,2,FALSE))","v":""},null,null,null,{"$f":"IF(H31=\"\",\"\",VLOOKUP(H31,'Otras referencias'!$A$24:$E$48,5,FALSE))","v":""},null,null,null,null,null,null,"",{"$f":"IF(AND(P31<>\"\",O31<>\"\"),IF(N31=\"A\",VLOOKUP(P31,'Otras referencias'!$J$24:$K$35,2,FALSE),IF(N31=\"B\",VLOOKUP(P31,'Otras referencias'!$N$24:$O$35,2,),IF(N31=\"C\",VLOOKUP(P31,'Otras referencias'!$R$24:$S$35,2,FALSE)))),\"\")","v":""},{"$f":"IF(S31=\"\",\"\",INDEX(referentes!$G$2:$H$5,MATCH(S31,referentes!$H$2:$H$5,0),1))","v":""},null,null,{"$f":"IF(T31=\"\",\"\",VLOOKUP(T31,referentes!$Q$2:$X$209,2,FALSE))","v":""},null,null,null,null,"",null,null,null,"",null,null,{"$f":"IF(AF31<>\"\",VLOOKUP(AF31,'Otras referencias'!$H$19:$I$20,2,FALSE),\"\")","v":""},null,{"$f":"IF(AH31<>\"\",VLOOKUP(AH31,'Otras referencias'!$H$19:$I$20,2,FALSE),\"\")","v":""},null,{"$f":"IF(AJ31<>\"\",VLOOKUP(AJ31,'Otras referencias'!$H$19:$I$20,2,FALSE),\"\")","v":""},null,{"$f":"IF(AL31<>\"\",VLOOKUP(AL31,'Otras referencias'!$H$19:$I$20,2,FALSE),\"\")","v":""}]
[null,{"$f":"IF(C32=\"\",\"\",IF(COUNTIF($C$3:C32, C32)>1, \"\", C32))","v":""},{"$f":"IF(J32=\"\",\"\",CONCATENATE(DIGITADOR!$M$1,J32,E32))","v":""},"",{"$f":"IF(H32=\"\",\"\",VLOOKUP(H32,'Otras referencias'!$A$24:$E$48,2,FALSE))","v":""},null,null,null,{"$f":"IF(H32=\"\",\"\",VLOOKUP(H32,'Otras referencias'!$A$24:$E$48,5,FALSE))","v":""},null,null,null,null,null,null,"",{"$f":"IF(AND(P32<>\"\",O32<>\"\"),IF(N32=\"A\",VLOOKUP(P32,'Otras referencias'!$J$24:$K$35,2,FALSE),IF(N32=\"B\",VLOOKUP(P32,'Otras referencias'!$N$24:$O$35,2,),IF(N32=\"C\",VLOOKUP(P32,'Otras referencias'!$R$24:$S$35,2,FALSE)))),\"\")","v":""},{"$f":"IF(S32=\"\",\"\",INDEX(referentes!$G$2:$H$5,MATCH(S32,referentes!$H$2:$H$5,0),1))","v":""},null,null,{"$f":"IF(T32=\"\",\"\",VLOOKUP(T32,referentes!$Q$2:$X$209,2,FALSE))","v":""},null,null,null,null,"",null,null,null,"",null,null,{"$f":"IF(AF32<>\"\",VLOOKUP(AF32,'Otras referencias'!$H$19:$I$20,2,FALSE),\"\")","v":""},null,{"$f":"IF(AH32<>\"\",VLOOKUP(AH32,'Otras referencias'!$H$19:$I$20,2,FALSE),\"\")","v":""},null,{"$f":"IF(AJ32<>\"\",VLOOKUP(AJ32,'Otras referencias'!$H$19:$I$20,2,FALSE),\"\")","v":""},null,{"$f":"IF(AL32<>\"\",VLOOKUP(AL32,'Otras referencias'!$H$19:$I$20,2,FALSE),\"\")","v":""}]
[null,{"$f":"IF(C33=\"\",\"\",IF(COUNTIF($C$3:C33, C33)>1, \"\", C33))","v":""},{"$f":"IF(J33=\"\",\"\",CONCATENATE(DIGITADOR!$M$1,J33,E33))","v":""},"",{"$f":"IF(H33=\"\",\"\",VLOOKUP(H33,'Otras referencias'!$A$24:$E$48,2,FALSE))","v":""},null,null,null,{"$f":"IF(H33=\"\",\"\",VLOOKUP(H33,'Otras referencias'!$A$24:$E$48,5,FALSE))","v":""},null,null,null,null,null,null,"",{"$f":"IF(AND(P33<>\"\",O33<>\"\"),IF(N33=\"A\",VLOOKUP(P33,'Otras referencias'!$J$24:$K$35,2,FALSE),IF(N33=\"B\",VLOOKUP(P33,'Otras referencias'!$N$24:$O$35,2,),IF(N33=\"C\",VLOOKUP(P33,'Otras referencias'!$R$24:$S$35,2,FALSE)))),\"\")","v":""},{"$f":"IF(S33=\"\",\"\",INDEX(referentes!$G$2:$H$5,MATCH(S33,referentes!$H$2:$H$5,0),1))","v":""},null,null,{"$f":"IF(T33=\"\",\"\",VLOOKUP(T33,referentes!$Q$2:$X$209,2,FALSE))","v":""},null,null,null,null,"",null,null,null,"",null,null,{"$f":"IF(AF33<>\"\",VLOOKUP(AF33,'Otras referencias'!$H$19:$I$20,2,FALSE),\"\")","v":""},null,{"$f":"IF(AH33<>\"\",VLOOKUP(AH33,'Otras referencias'!$H$19:$I$20,2,FALSE),\"\")","v":""},null,{"$f":"IF(AJ33<>\"\",VLOOKUP(AJ33,'Otras referencias'!$H$19:$I$20,2,FALSE),\"\")","v":""},null,{"$f":"IF(AL33<>\"\",VLOOKUP(AL33,'Otras referencias'!$H$19:$I$20,2,FALSE),\"\")","v":""}]
[null,{"$f":"IF(C34=\"\",\"\",IF(COUNTIF($C$3:C34, C34)>1, \"\", C34))","v":""},{"$f":"IF(J34=\"\",\"\",CONCATENATE(DIGITADOR!$M$1,J34,E34))","v":""},"",{"$f":"IF(H34=\"\",\"\",VLOOKUP(H34,'Otras referencias'!$A$24:$E$48,2,FALSE))","v":""},null,null,null,{"$f":"IF(H34=\"\",\"\",VLOOKUP(H34,'Otras referencias'!$A$24:$E$48,5,FALSE))","v":""},null,null,null,null,null,null,"",{"$f":"IF(AND(P34<>\"\",O34<>\"\"),IF(N34=\"A\",VLOOKUP(P34,'Otras referencias'!$J$24:$K$35,2,FALSE),IF(N34=\"B\",VLOOKUP(P34,'Otras referencias'!$N$24:$O$35,2,),IF(N34=\"C\",VLOOKUP(P34,'Otras referencias'!$R$24:$S$35,2,FALSE)))),\"\")","v":""},{"$f":"IF(S34=\"\",\"\",INDEX(referentes!$G$2:$H$5,MATCH(S34,referentes!$H$2:$H$5,0),1))","v":""},null,null,{"$f":"IF(T34=\"\",\"\",VLOOKUP(T34,referentes!$Q$2:$X$209,2,FALSE))","v":""},null,null,null,null,"",null,null,null,"",null,null,{"$f":"IF(AF34<>\"\",VLOOKUP(AF34,'Otras referencias'!$H$19:$I$20,2,FALSE),\"\")","v":""},null,{"$f":"IF(AH34<>\"\",VLOOKUP(AH34,'Otras referencias'!$H$19:$I$20,2,FALSE),\"\")","v":""},null,{"$f":"IF(AJ34<>\"\",VLOOKUP(AJ34,'Otras referencias'!$H$19:$I$20,2,FALSE),\"\")","v":""},null,{"$f":"IF(AL34<>\"\",VLOOKUP(AL34,'Otras referencias'!$H$19:$I$20,2,FALSE),\"\")","v":""}]
[null,{"$f":"IF(C35=\"\",\"\",IF(COUNTIF($C$3:C35, C35)>1, \"\", C35))","v":""},{"$f":"IF(J35=\"\",\"\",CONCATENATE(DIGITADOR!$M$1,J35,E35))","v":""},"",{"$f":"IF(H35=\"\",\"\",VLOOKUP(H35,'Otras referencias'!$A$24:$E$48,2,FALSE))","v":""},null,null,null,{"$f":"IF(H35=\"\",\"\",VLOOKUP(H35,'Otras referencias'!$A$24:$E$48,5,FALSE))","v":""},null,null,null,null,null,null,"",{"$f":"IF(AND(P35<>\"\",O35<>\"\"),IF(N35=\"A\",VLOOKUP(P35,'Otras referencias'!$J$24:$K$35,2,FALSE),IF(N35=\"B\",VLOOKUP(P35,'Otras referencias'!$N$24:$O$35,2,),IF(N35=\"C\",VLOOKUP(P35,'Otras referencias'!$R$24:$S$35,2,FALSE)))),\"\")","v":""},{"$f":"IF(S35=\"\",\"\",INDEX(referentes!$G$2:$H$5,MATCH(S35,referentes!$H$2:$H$5,0),1))","v":""},null,null,{"$f":"IF(T35=\"\",\"\",VLOOKUP(T35,referentes!$Q$2:$X$209,2,FALSE))","v":""},null,null,null,null,"",null,null,null,"",null,null,{"$f":"IF(AF35<>\"\",VLOOKUP(AF35,'Otras referencias'!$H$19:$I$20,2,FALSE),\"\")","v":""},null,{"$f":"IF(AH35<>\"\",VLOOKUP(AH35,'Otras referencias'!$H$19:$I$20,2,FALSE),\"\")","v":""},null,{"$f":"IF(AJ35<>\"\",VLOOKUP(AJ35,'Otras referencias'!$H$19:$I$20,2,FALSE),\"\")","v":""},null,{"$f":"IF(AL35<>\"\",VLOOKUP(AL35,'Otras referencias'!$H$19:$I$20,2,FALSE),\"\")","v":""}]
[null,{"$f":"IF(C36=\"\",\"\",IF(COUNTIF($C$3:C36, C36)>1, \"\", C36))","v":""},{"$f":"IF(J36=\"\",\"\",CONCATENATE(DIGITADOR!$M$1,J36,E36))","v":""},"",{"$f":"IF(H36=\"\",\"\",VLOOKUP(H36,'Otras referencias'!$A$24:$E$48,2,FALSE))","v":""},null,null,null,{"$f":"IF(H36=\"\",\"\",VLOOKUP(H36,'Otras referencias'!$A$24:$E$48,5,FALSE))","v":""},null,null,null,null,null,null,"",{"$f":"IF(AND(P36<>\"\",O36<>\"\"),IF(N36=\"A\",VLOOKUP(P36,'Otras referencias'!$J$24:$K$35,2,FALSE),IF(N36=\"B\",VLOOKUP(P36,'Otras referencias'!$N$24:$O$35,2,),IF(N36=\"C\",VLOOKUP(P36,'Otras referencias'!$R$24:$S$35,2,FALSE)))),\"\")","v":""},{"$f":"IF(S36=\"\",\"\",INDEX(referentes!$G$2:$H$5,MATCH(S36,referentes!$H$2:$H$5,0),1))","v":""},null,null,{"$f":"IF(T36=\"\",\"\",VLOOKUP(T36,referentes!$Q$2:$X$209,2,FALSE))","v":""},null,null,null,null,"",null,null,null,"",null,null,{"$f":"IF(AF36<>\"\",VLOOKUP(AF36,'Otras referencias'!$H$19:$I$20,2,FALSE),\"\")","v":""},null,{"$f":"IF(AH36<>\"\",VLOOKUP(AH36,'Otras referencias'!$H$19:$I$20,2,FALSE),\"\")","v":""},null,{"$f":"IF(AJ36<>\"\",VLOOKUP(AJ36,'Otras referencias'!$H$19:$I$20,2,FALSE),\"\")","v":""},null,{"$f":"IF(AL36<>\"\",VLOOKUP(AL36,'Otras referencias'!$H$19:$I$20,2,FALSE),\"\")","v":""}]
[null,{"$f":"IF(C37=\"\",\"\",IF(COUNTIF($C$3:C37, C37)>1, \"\", C37))","v":""},{"$f":"IF(J37=\"\",\"\",CONCATENATE(DIGITADOR!$M$1,J37,E37))","v":""},"",{"$f":"IF(H37=\"\",\"\",VLOOKUP(H37,'Otras referencias'!$A$24:$E$48,2,FALSE))","v":""},null,null,null,{"$f":"IF(H37=\"\",\"\",VLOOKUP(H37,'Otras referencias'!$A$24:$E$48,5,FALSE))","v":""},null,null,null,null,null,null,"",{"$f":"IF(AND(P37<>\"\",O37<>\"\"),IF(N37=\"A\",VLOOKUP(P37,'Otras referencias'!$J$24:$K$35,2,FALSE),IF(N37=\"B\",VLOOKUP(P37,'Otras referencias'!$N$24:$O$35,2,),IF(N37=\"C\",VLOOKUP(P37,'Otras referencias'!$R$24:$S$35,2,FALSE)))),\"\")","v":""},{"$f":"IF(S37=\"\",\"\",INDEX(referentes!$G$2:$H$5,MATCH(S37,referentes!$H$2:$H$5,0),1))","v":""},null,null,{"$f":"IF(T37=\"\",\"\",VLOOKUP(T37,referentes!$Q$2:$X$209,2,FALSE))","v":""},null,null,null,null,"",null,null,null,"",null,null,{"$f":"IF(AF37<>\"\",VLOOKUP(AF37,'Otras referencias'!$H$19:$I$20,2,FALSE),\"\")","v":""},null,{"$f":"IF(AH37<>\"\",VLOOKUP(AH37,'Otras referencias'!$H$19:$I$20,2,FALSE),\"\")","v":""},null,{"$f":"IF(AJ37<>\"\",VLOOKUP(AJ37,'Otras referencias'!$H$19:$I$20,2,FALSE),\"\")","v":""},null,{"$f":"IF(AL37<>\"\",VLOOKUP(AL37,'Otras referencias'!$H$19:$I$20,2,FALSE),\"\")","v":""}]
[null,{"$f":"IF(C38=\"\",\"\",IF(COUNTIF($C$3:C38, C38)>1, \"\", C38))","v":""},{"$f":"IF(J38=\"\",\"\",CONCATENATE(DIGITADOR!$M$1,J38,E38))","v":""},"",{"$f":"IF(H38=\"\",\"\",VLOOKUP(H38,'Otras referencias'!$A$24:$E$48,2,FALSE))","v":""},null,null,null,{"$f":"IF(H38=\"\",\"\",VLOOKUP(H38,'Otras referencias'!$A$24:$E$48,5,FALSE))","v":""},null,null,null,null,null,null,"",{"$f":"IF(AND(P38<>\"\",O38<>\"\"),IF(N38=\"A\",VLOOKUP(P38,'Otras referencias'!$J$24:$K$35,2,FALSE),IF(N38=\"B\",VLOOKUP(P38,'Otras referencias'!$N$24:$O$35,2,),IF(N38=\"C\",VLOOKUP(P38,'Otras referencias'!$R$24:$S$35,2,FALSE)))),\"\")","v":""},{"$f":"IF(S38=\"\",\"\",INDEX(referentes!$G$2:$H$5,MATCH(S38,referentes!$H$2:$H$5,0),1))","v":""},null,null,{"$f":"IF(T38=\"\",\"\",VLOOKUP(T38,referentes!$Q$2:$X$209,2,FALSE))","v":""},null,null,null,null,"",null,null,null,"",null,null,{"$f":"IF(AF38<>\"\",VLOOKUP(AF38,'Otras referencias'!$H$19:$I$20,2,FALSE),\"\")","v":""},null,{"$f":"IF(AH38<>\"\",VLOOKUP(AH38,'Otras referencias'!$H$19:$I$20,2,FALSE),\"\")","v":""},null,{"$f":"IF(AJ38<>\"\",VLOOKUP(AJ38,'Otras referencias'!$H$19:$I$20,2,FALSE),\"\")","v":""},null,{"$f":"IF(AL38<>\"\",VLOOKUP(AL38,'Otras referencias'!$H$19:$I$20,2,FALSE),\"\")","v":""}]
[null,{"$f":"IF(C39=\"\",\"\",IF(COUNTIF($C$3:C39, C39)>1, \"\", C39))","v":""},{"$f":"IF(J39=\"\",\"\",CONCATENATE(DIGITADOR!$M$1,J39,E39))","v":""},"",{"$f":"IF(H39=\"\",\"\",VLOOKUP(H39,'Otras referencias'!$A$24:$E$48,2,FALSE))","v":""},null,null,null,{"$f":"IF(H39=\"\",\"\",VLOOKUP(H39,'Otras referencias'!$A$24:$E$48,5,FALSE))","v":""},null,null,null,null,null,null,"",{"$f":"IF(AND(P39<>\"\",O39<>\"\"),IF(N39=\"A\",VLOOKUP(P39,'Otras referencias'!$J$24:$K$35,2,FALSE),IF(N39=\"B\",VLOOKUP(P39,'Otras referencias'!$N$24:$O$35,2,),IF(N39=\"C\",VLOOKUP(P39,'Otras referencias'!$R$24:$S$35,2,FALSE)))),\"\")","v":""},{"$f":"IF(S39=\"\",\"\",INDEX(referentes!$G$2:$H$5,MATCH(S39,referentes!$H$2:$H$5,0),1))","v":""},null,null,{"$f":"IF(T39=\"\",\"\",VLOOKUP(T39,referentes!$Q$2:$X$209,2,FALSE))","v":""},null,null,null,null,"",null,null,null,"",null,null,{"$f":"IF(AF39<>\"\",VLOOKUP(AF39,'Otras referencias'!$H$19:$I$20,2,FALSE),\"\")","v":""},null,{"$f":"IF(AH39<>\"\",VLOOKUP(AH39,'Otras referencias'!$H$19:$I$20,2,FALSE),\"\")","v":""},null,{"$f":"IF(AJ39<>\"\",VLOOKUP(AJ39,'Otras referencias'!$H$19:$I$20,2,FALSE),\"\")","v":""},null,{"$f":"IF(AL39<>\"\",VLOOKUP(AL39,'Otras referencias'!$H$19:$I$20,2,FALSE),\"\")","v":""}]
[null,{"$f":"IF(C40=\"\",\"\",IF(COUNTIF($C$3:C40, C40)>1, \"\", C40))","v":""},{"$f":"IF(J40=\"\",\"\",CONCATENATE(DIGITADOR!$M$1,J40,E40))","v":""},"",{"$f":"IF(H40=\"\",\"\",VLOOKUP(H40,'Otras referencias'!$A$24:$E$48,2,FALSE))","v":""},null,null,null,{"$f":"IF(H40=\"\",\"\",VLOOKUP(H40,'Otras referencias'!$A$24:$E$48,5,FALSE))","v":""},null,null,null,null,null,null,"",{"$f":"IF(AND(P40<>\"\",O40<>\"\"),IF(N40=\"A\",VLOOKUP(P40,'Otras referencias'!$J$24:$K$35,2,FALSE),IF(N40=\"B\",VLOOKUP(P40,'Otras referencias'!$N$24:$O$35,2,),IF(N40=\"C\",VLOOKUP(P40,'Otras referencias'!$R$24:$S$35,2,FALSE)))),\"\")","v":""},{"$f":"IF(S40=\"\",\"\",INDEX(referentes!$G$2:$H$5,MATCH(S40,referentes!$H$2:$H$5,0),1))","v":""},null,null,{"$f":"IF(T40=\"\",\"\",VLOOKUP(T40,referentes!$Q$2:$X$209,2,FALSE))","v":""},null,null,null,null,"",null,null,null,"",null,null,{"$f":"IF(AF40<>\"\",VLOOKUP(AF40,'Otras referencias'!$H$19:$I$20,2,FALSE),\"\")","v":""},null,{"$f":"IF(AH40<>\"\",VLOOKUP(AH40,'Otras referencias'!$H$19:$I$20,2,FALSE),\"\")","v":""},null,{"$f":"IF(AJ40<>\"\",VLOOKUP(AJ40,'Otras referencias'!$H$19:$I$20,2,FALSE),\"\")","v":""},null,{"$f":"IF(AL40<>\"\",VLOOKUP(AL40,'Otras referencias'!$H$19:$I$20,2,FALSE),\"\")","v":""}]
[null,{"$f":"IF(C41=\"\",\"\",IF(COUNTIF($C$3:C41, C41)>1, \"\", C41))","v":""},{"$f":"IF(J41=\"\",\"\",CONCATENATE(DIGITADOR!$M$1,J41,E41))","v":""},"",{"$f":"IF(H41=\"\",\"\",VLOOKUP(H41,'Otras referencias'!$A$24:$E$48,2,FALSE))","v":""},null,null,null,{"$f":"IF(H41=\"\",\"\",VLOOKUP(H41,'Otras referencias'!$A$24:$E$48,5,FALSE))","v":""},null,null,null,null,null,null,"",{"$f":"IF(AND(P41<>\"\",O41<>\"\"),IF(N41=\"A\",VLOOKUP(P41,'Otras referencias'!$J$24:$K$35,2,FALSE),IF(N41=\"B\",VLOOKUP(P41,'Otras referencias'!$N$24:$O$35,2,),IF(N41=\"C\",VLOOKUP(P41,'Otras referencias'!$R$24:$S$35,2,FALSE)))),\"\")","v":""},{"$f":"IF(S41=\"\",\"\",INDEX(referentes!$G$2:$H$5,MATCH(S41,referentes!$H$2:$H$5,0),1))","v":""},null,null,{"$f":"IF(T41=\"\",\"\",VLOOKUP(T41,referentes!$Q$2:$X$209,2,FALSE))","v":""},null,null,null,null,"",null,null,null,"",null,null,{"$f":"IF(AF41<>\"\",VLOOKUP(AF41,'Otras referencias'!$H$19:$I$20,2,FALSE),\"\")","v":""},null,{"$f":"IF(AH41<>\"\",VLOOKUP(AH41,'Otras referencias'!$H$19:$I$20,2,FALSE),\"\")","v":""},null,{"$f":"IF(AJ41<>\"\",VLOOKUP(AJ41,'Otras referencias'!$H$19:$I$20,2,FALSE),\"\")","v":""},null,{"$f":"IF(AL41<>\"\",VLOOKUP(AL41,'Otras referencias'!$H$19:$I$20,2,FALSE),\"\")","v":""}]
[null,{"$f":"IF(C42=\"\",\"\",IF(COUNTIF($C$3:C42, C42)>1, \"\", C42))","v":""},{"$f":"IF(J42=\"\",\"\",CONCATENATE(DIGITADOR!$M$1,J42,E42))","v":""},"",{"$f":"IF(H42=\"\",\"\",VLOOKUP(H42,'Otras referencias'!$A$24:$E$48,2,FALSE))","v":""},null,null,null,{"$f":"IF(H42=\"\",\"\",VLOOKUP(H42,'Otras referencias'!$A$24:$E$48,5,FALSE))","v":""},null,null,null,null,null,null,"",{"$f":"IF(AND(P42<>\"\",O42<>\"\"),IF(N42=\"A\",VLOOKUP(P42,'Otras referencias'!$J$24:$K$35,2,FALSE),IF(N42=\"B\",VLOOKUP(P42,'Otras referencias'!$N$24:$O$35,2,),IF(N42=\"C\",VLOOKUP(P42,'Otras referencias'!$R$24:$S$35,2,FALSE)))),\"\")","v":""},{"$f":"IF(S42=\"\",\"\",INDEX(referentes!$G$2:$H$5,MATCH(S42,referentes!$H$2:$H$5,0),1))","v":""},null,null,{"$f":"IF(T42=\"\",\"\",VLOOKUP(T42,referentes!$Q$2:$X$209,2,FALSE))","v":""},null,null,null,null,"",null,null,null,"",null,null,{"$f":"IF(AF42<>\"\",VLOOKUP(AF42,'Otras referencias'!$H$19:$I$20,2,FALSE),\"\")","v":""},null,{"$f":"IF(AH42<>\"\",VLOOKUP(AH42,'Otras referencias'!$H$19:$I$20,2,FALSE),\"\")","v":""},null,{"$f":"IF(AJ42<>\"\",VLOOKUP(AJ42,'Otras referencias'!$H$19:$I$20,2,FALSE),\"\")","v":""},null,{"$f":"IF(AL42<>\"\",VLOOKUP(AL42,'Otras referencias'!$H$19:$I$20,2,FALSE),\"\")","v":""}]
[null,{"$f":"IF(C43=\"\",\"\",IF(COUNTIF($C$3:C43, C43)>1, \"\", C43))","v":""},{"$f":"IF(J43=\"\",\"\",CONCATENATE(DIGITADOR!$M$1,J43,E43))","v":""},"",{"$f":"IF(H43=\"\",\"\",VLOOKUP(H43,'Otras referencias'!$A$24:$E$48,2,FALSE))","v":""},null,null,null,{"$f":"IF(H43=\"\",\"\",VLOOKUP(H43,'Otras referencias'!$A$24:$E$48,5,FALSE))","v":""},null,null,null,null,null,null,"",{"$f":"IF(AND(P43<>\"\",O43<>\"\"),IF(N43=\"A\",VLOOKUP(P43,'Otras referencias'!$J$24:$K$35,2,FALSE),IF(N43=\"B\",VLOOKUP(P43,'Otras referencias'!$N$24:$O$35,2,),IF(N43=\"C\",VLOOKUP(P43,'Otras referencias'!$R$24:$S$35,2,FALSE)))),\"\")","v":""},{"$f":"IF(S43=\"\",\"\",INDEX(referentes!$G$2:$H$5,MATCH(S43,referentes!$H$2:$H$5,0),1))","v":""},null,null,{"$f":"IF(T43=\"\",\"\",VLOOKUP(T43,referentes!$Q$2:$X$209,2,FALSE))","v":""},null,null,null,null,"",null,null,null,"",null,null,{"$f":"IF(AF43<>\"\",VLOOKUP(AF43,'Otras referencias'!$H$19:$I$20,2,FALSE),\"\")","v":""},null,{"$f":"IF(AH43<>\"\",VLOOKUP(AH43,'Otras referencias'!$H$19:$I$20,2,FALSE),\"\")","v":""},null,{"$f":"IF(AJ43<>\"\",VLOOKUP(AJ43,'Otras referencias'!$H$19:$I$20,2,FALSE),\"\")","v":""},null,{"$f":"IF(AL43<>\"\",VLOOKUP(AL43,'Otras referencias'!$H$19:$I$20,2,FALSE),\"\")","v":""}]
[null,{"$f":"IF(C44=\"\",\"\",IF(COUNTIF($C$3:C44, C44)>1, \"\", C44))","v":""},{"$f":"IF(J44=\"\",\"\",CONCATENATE(DIGITADOR!$M$1,J44,E44))","v":""},"",{"$f":"IF(H44=\"\",\"\",VLOOKUP(H44,'Otras referencias'!$A$24:$E$48,2,FALSE))","v":""},null,null,null,{"$f":"IF(H44=\"\",\"\",VLOOKUP(H44,'Otras referencias'!$A$24:$E$48,5,FALSE))","v":""},null,null,null,null,null,null,"",{"$f":"IF(AND(P44<>\"\",O44<>\"\"),IF(N44=\"A\",VLOOKUP(P44,'Otras referencias'!$J$24:$K$35,2,FALSE),IF(N44=\"B\",VLOOKUP(P44,'Otras referencias'!$N$24:$O$35,2,),IF(N44=\"C\",VLOOKUP(P44,'Otras referencias'!$R$24:$S$35,2,FALSE)))),\"\")","v":""},{"$f":"IF(S44=\"\",\"\",INDEX(referentes!$G$2:$H$5,MATCH(S44,referentes!$H$2:$H$5,0),1))","v":""},null,null,{"$f":"IF(T44=\"\",\"\",VLOOKUP(T44,referentes!$Q$2:$X$209,2,FALSE))","v":""},null,null,null,null,"",null,null,null,"",null,null,{"$f":"IF(AF44<>\"\",VLOOKUP(AF44,'Otras referencias'!$H$19:$I$20,2,FALSE),\"\")","v":""},null,{"$f":"IF(AH44<>\"\",VLOOKUP(AH44,'Otras referencias'!$H$19:$I$20,2,FALSE),\"\")","v":""},null,{"$f":"IF(AJ44<>\"\",VLOOKUP(AJ44,'Otras referencias'!$H$19:$I$20,2,FALSE),\"\")","v":""},null,{"$f":"IF(AL44<>\"\",VLOOKUP(AL44,'Otras referencias'!$H$19:$I$20,2,FALSE),\"\")","v":""}]
[null,{"$f":"IF(C45=\"\",\"\",IF(COUNTIF($C$3:C45, C45)>1, \"\", C45))","v":""},{"$f":"IF(J45=\"\",\"\",CONCATENATE(DIGITADOR!$M$1,J45,E45))","v":""},"",{"$f":"IF(H45=\"\",\"\",VLOOKUP(H45,'Otras referencias'!$A$24:$E$48,2,FALSE))","v":""},null,null,null,{"$f":"IF(H45=\"\",\"\",VLOOKUP(H45,'Otras referencias'!$A$24:$E$48,5,FALSE))","v":""},null,null,null,null,null,null,"",{"$f":"IF(AND(P45<>\"\",O45<>\"\"),IF(N45=\"A\",VLOOKUP(P45,'Otras referencias'!$J$24:$K$35,2,FALSE),IF(N45=\"B\",VLOOKUP(P45,'Otras referencias'!$N$24:$O$35,2,),IF(N45=\"C\",VLOOKUP(P45,'Otras referencias'!$R$24:$S$35,2,FALSE)))),\"\")","v":""},{"$f":"IF(S45=\"\",\"\",INDEX(referentes!$G$2:$H$5,MATCH(S45,referentes!$H$2:$H$5,0),1))","v":""},null,null,{"$f":"IF(T45=\"\",\"\",VLOOKUP(T45,referentes!$Q$2:$X$209,2,FALSE))","v":""},null,null,null,null,"",null,null,null,"",null,null,{"$f":"IF(AF45<>\"\",VLOOKUP(AF45,'Otras referencias'!$H$19:$I$20,2,FALSE),\"\")","v":""},null,{"$f":"IF(AH45<>\"\",VLOOKUP(AH45,'Otras referencias'!$H$19:$I$20,2,FALSE),\"\")","v":""},null,{"$f":"IF(AJ45<>\"\",VLOOKUP(AJ45,'Otras referencias'!$H$19:$I$20,2,FALSE),\"\")","v":""},null,{"$f":"IF(AL45<>\"\",VLOOKUP(AL45,'Otras referencias'!$H$19:$I$20,2,FALSE),\"\")","v":""}]
[null,{"$f":"IF(C46=\"\",\"\",IF(COUNTIF($C$3:C46, C46)>1, \"\", C46))","v":""},{"$f":"IF(J46=\"\",\"\",CONCATENATE(DIGITADOR!$M$1,J46,E46))","v":""},"",{"$f":"IF(H46=\"\",\"\",VLOOKUP(H46,'Otras referencias'!$A$24:$E$48,2,FALSE))","v":""},null,null,null,{"$f":"IF(H46=\"\",\"\",VLOOKUP(H46,'Otras referencias'!$A$24:$E$48,5,FALSE))","v":""},null,null,null,null,null,null,"",{"$f":"IF(AND(P46<>\"\",O46<>\"\"),IF(N46=\"A\",VLOOKUP(P46,'Otras referencias'!$J$24:$K$35,2,FALSE),IF(N46=\"B\",VLOOKUP(P46,'Otras referencias'!$N$24:$O$35,2,),IF(N46=\"C\",VLOOKUP(P46,'Otras referencias'!$R$24:$S$35,2,FALSE)))),\"\")","v":""},{"$f":"IF(S46=\"\",\"\",INDEX(referentes!$G$2:$H$5,MATCH(S46,referentes!$H$2:$H$5,0),1))","v":""},null,null,{"$f":"IF(T46=\"\",\"\",VLOOKUP(T46,referentes!$Q$2:$X$209,2,FALSE))","v":""},null,null,null,null,"",null,null,null,"",null,null,{"$f":"IF(AF46<>\"\",VLOOKUP(AF46,'Otras referencias'!$H$19:$I$20,2,FALSE),\"\")","v":""},null,{"$f":"IF(AH46<>\"\",VLOOKUP(AH46,'Otras referencias'!$H$19:$I$20,2,FALSE),\"\")","v":""},null,{"$f":"IF(AJ46<>\"\",VLOOKUP(AJ46,'Otras referencias'!$H$19:$I$20,2,FALSE),\"\")","v":""},null,{"$f":"IF(AL46<>\"\",VLOOKUP(AL46,'Otras referencias'!$H$19:$I$20,2,FALSE),\"\")","v":""}]
[null,{"$f":"IF(C47=\"\",\"\",IF(COUNTIF($C$3:C47, C47)>1, \"\", C47))","v":""},{"$f":"IF(J47=\"\",\"\",CONCATENATE(DIGITADOR!$M$1,J47,E47))","v":""},"",{"$f":"IF(H47=\"\",\"\",VLOOKUP(H47,'Otras referencias'!$A$24:$E$48,2,FALSE))","v":""},null,null,null,{"$f":"IF(H47=\"\",\"\",VLOOKUP(H47,'Otras referencias'!$A$24:$E$48,5,FALSE))","v":""},null,null,null,null,null,null,"",{"$f":"IF(AND(P47<>\"\",O47<>\"\"),IF(N47=\"A\",VLOOKUP(P47,'Otras referencias'!$J$24:$K$35,2,FALSE),IF(N47=\"B\",VLOOKUP(P47,'Otras referencias'!$N$24:$O$35,2,),IF(N47=\"C\",VLOOKUP(P47,'Otras referencias'!$R$24:$S$35,2,FALSE)))),\"\")","v":""},{"$f":"IF(S47=\"\",\"\",INDEX(referentes!$G$2:$H$5,MATCH(S47,referentes!$H$2:$H$5,0),1))","v":""},null,null,{"$f":"IF(T47=\"\",\"\",VLOOKUP(T47,referentes!$Q$2:$X$209,2,FALSE))","v":""},null,null,null,null,"",null,null,null,"",null,null,{"$f":"IF(AF47<>\"\",VLOOKUP(AF47,'Otras referencias'!$H$19:$I$20,2,FALSE),\"\")","v":""},null,{"$f":"IF(AH47<>\"\",VLOOKUP(AH47,'Otras referencias'!$H$19:$I$20,2,FALSE),\"\")","v":""},null,{"$f":"IF(AJ47<>\"\",VLOOKUP(AJ47,'Otras referencias'!$H$19:$I$20,2,FALSE),\"\")","v":""},null,{"$f":"IF(AL47<>\"\",VLOOKUP(AL47,'Otras referencias'!$H$19:$I$20,2,FALSE),\"\")","v":""}]
[null,{"$f":"IF(C48=\"\",\"\",IF(COUNTIF($C$3:C48, C48)>1, \"\", C48))","v":""},{"$f":"IF(J48=\"\",\"\",CONCATENATE(DIGITADOR!$M$1,J48,E48))","v":""},"",{"$f":"IF(H48=\"\",\"\",VLOOKUP(H48,'Otras referencias'!$A$24:$E$48,2,FALSE))","v":""},null,null,null,{"$f":"IF(H48=\"\",\"\",VLOOKUP(H48,'Otras referencias'!$A$24:$E$48,5,FALSE))","v":""},null,null,null,null,null,null,"",{"$f":"IF(AND(P48<>\"\",O48<>\"\"),IF(N48=\"A\",VLOOKUP(P48,'Otras referencias'!$J$24:$K$35,2,FALSE),IF(N48=\"B\",VLOOKUP(P48,'Otras referencias'!$N$24:$O$35,2,),IF(N48=\"C\",VLOOKUP(P48,'Otras referencias'!$R$24:$S$35,2,FALSE)))),\"\")","v":""},{"$f":"IF(S48=\"\",\"\",INDEX(referentes!$G$2:$H$5,MATCH(S48,referentes!$H$2:$H$5,0),1))","v":""},null,null,{"$f":"IF(T48=\"\",\"\",VLOOKUP(T48,referentes!$Q$2:$X$209,2,FALSE))","v":""},null,null,null,null,"",null,null,null,"",null,null,{"$f":"IF(AF48<>\"\",VLOOKUP(AF48,'Otras referencias'!$H$19:$I$20,2,FALSE),\"\")","v":""},null,{"$f":"IF(AH48<>\"\",VLOOKUP(AH48,'Otras referencias'!$H$19:$I$20,2,FALSE),\"\")","v":""},null,{"$f":"IF(AJ48<>\"\",VLOOKUP(AJ48,'Otras referencias'!$H$19:$I$20,2,FALSE),\"\")","v":""},null,{"$f":"IF(AL48<>\"\",VLOOKUP(AL48,'Otras referencias'!$H$19:$I$20,2,FALSE),\"\")","v":""}]
[null,{"$f":"IF(C49=\"\",\"\",IF(COUNTIF($C$3:C49, C49)>1, \"\", C49))","v":""},{"$f":"IF(J49=\"\",\"\",CONCATENATE(DIGITADOR!$M$1,J49,E49))","v":""},"",{"$f":"IF(H49=\"\",\"\",VLOOKUP(H49,'Otras referencias'!$A$24:$E$48,2,FALSE))","v":""},null,null,null,{"$f":"IF(H49=\"\",\"\",VLOOKUP(H49,'Otras referencias'!$A$24:$E$48,5,FALSE))","v":""},null,null,null,null,null,null,"",{"$f":"IF(AND(P49<>\"\",O49<>\"\"),IF(N49=\"A\",VLOOKUP(P49,'Otras referencias'!$J$24:$K$35,2,FALSE),IF(N49=\"B\",VLOOKUP(P49,'Otras referencias'!$N$24:$O$35,2,),IF(N49=\"C\",VLOOKUP(P49,'Otras referencias'!$R$24:$S$35,2,FALSE)))),\"\")","v":""},{"$f":"IF(S49=\"\",\"\",INDEX(referentes!$G$2:$H$5,MATCH(S49,referentes!$H$2:$H$5,0),1))","v":""},null,null,{"$f":"IF(T49=\"\",\"\",VLOOKUP(T49,referentes!$Q$2:$X$209,2,FALSE))","v":""},null,null,null,null,"",null,null,null,"",null,null,{"$f":"IF(AF49<>\"\",VLOOKUP(AF49,'Otras referencias'!$H$19:$I$20,2,FALSE),\"\")","v":""},null,{"$f":"IF(AH49<>\"\",VLOOKUP(AH49,'Otras referencias'!$H$19:$I$20,2,FALSE),\"\")","v":""},null,{"$f":"IF(AJ49<>\"\",VLOOKUP(AJ49,'Otras referencias'!$H$19:$I$20,2,FALSE),\"\")","v":""},null,{"$f":"IF(AL49<>\"\",VLOOKUP(AL49,'Otras referencias'!$H$19:$I$20,2,FALSE),\"\")","v":""}]
[null,{"$f":"IF(C50=\"\",\"\",IF(COUNTIF($C$3:C50, C50)>1, \"\", C50))","v":""},{"$f":"IF(J50=\"\",\"\",CONCATENATE(DIGITADOR!$M$1,J50,E50))","v":""},"",{"$f":"IF(H50=\"\",\"\",VLOOKUP(H50,'Otras referencias'!$A$24:$E$48,2,FALSE))","v":""},null,null,null,{"$f":"IF(H50=\"\",\"\",VLOOKUP(H50,'Otras referencias'!$A$24:$E$48,5,FALSE))","v":""},null,null,null,null,null,null,"",{"$f":"IF(AND(P50<>\"\",O50<>\"\"),IF(N50=\"A\",VLOOKUP(P50,'Otras referencias'!$J$24:$K$35,2,FALSE),IF(N50=\"B\",VLOOKUP(P50,'Otras referencias'!$N$24:$O$35,2,),IF(N50=\"C\",VLOOKUP(P50,'Otras referencias'!$R$24:$S$35,2,FALSE)))),\"\")","v":""},{"$f":"IF(S50=\"\",\"\",INDEX(referentes!$G$2:$H$5,MATCH(S50,referentes!$H$2:$H$5,0),1))","v":""},null,null,{"$f":"IF(T50=\"\",\"\",VLOOKUP(T50,referentes!$Q$2:$X$209,2,FALSE))","v":""},null,null,null,null,"",null,null,null,"",null,null,{"$f":"IF(AF50<>\"\",VLOOKUP(AF50,'Otras referencias'!$H$19:$I$20,2,FALSE),\"\")","v":""},null,{"$f":"IF(AH50<>\"\",VLOOKUP(AH50,'Otras referencias'!$H$19:$I$20,2,FALSE),\"\")","v":""},null,{"$f":"IF(AJ50<>\"\",VLOOKUP(AJ50,'Otras referencias'!$H$19:$I$20,2,FALSE),\"\")","v":""},null,{"$f":"IF(AL50<>\"\",VLOOKUP(AL50,'Otras referencias'!$H$19:$I$20,2,FALSE),\"\")","v":""}]
[null,{"$f":"IF(C51=\"\",\"\",IF(COUNTIF($C$3:C51, C51)>1, \"\", C51))","v":""},{"$f":"IF(J51=\"\",\"\",CONCATENATE(DIGITADOR!$M$1,J51,E51))","v":""},"",{"$f":"IF(H51=\"\",\"\",VLOOKUP(H51,'Otras referencias'!$A$24:$E$48,2,FALSE))","v":""},null,null,null,{"$f":"IF(H51=\"\",\"\",VLOOKUP(H51,'Otras referencias'!$A$24:$E$48,5,FALSE))","v":""},null,null,null,null,null,null,"",{"$f":"IF(AND(P51<>\"\",O51<>\"\"),IF(N51=\"A\",VLOOKUP(P51,'Otras referencias'!$J$24:$K$35,2,FALSE),IF(N51=\"B\",VLOOKUP(P51,'Otras referencias'!$N$24:$O$35,2,),IF(N51=\"C\",VLOOKUP(P51,'Otras referencias'!$R$24:$S$35,2,FALSE)))),\"\")","v":""},{"$f":"IF(S51=\"\",\"\",INDEX(referentes!$G$2:$H$5,MATCH(S51,referentes!$H$2:$H$5,0),1))","v":""},null,null,{"$f":"IF(T51=\"\",\"\",VLOOKUP(T51,referentes!$Q$2:$X$209,2,FALSE))","v":""},null,null,null,null,"",null,null,null,"",null,null,{"$f":"IF(AF51<>\"\",VLOOKUP(AF51,'Otras referencias'!$H$19:$I$20,2,FALSE),\"\")","v":""},null,{"$f":"IF(AH51<>\"\",VLOOKUP(AH51,'Otras referencias'!$H$19:$I$20,2,FALSE),\"\")","v":""},null,{"$f":"IF(AJ51<>\"\",VLOOKUP(AJ51,'Otras referencias'!$H$19:$I$20,2,FALSE),\"\")","v":""},null,{"$f":"IF(AL51<>\"\",VLOOKUP(AL51,'Otras referencias'!$H$19:$I$20,2,FALSE),\"\")","v":""}]
[null,{"$f":"IF(C52=\"\",\"\",IF(COUNTIF($C$3:C52, C52)>1, \"\", C52))","v":""},{"$f":"IF(J52=\"\",\"\",CONCATENATE(DIGITADOR!$M$1,J52,E52))","v":""},"",{"$f":"IF(H52=\"\",\"\",VLOOKUP(H52,'Otras referencias'!$A$24:$E$48,2,FALSE))","v":""},null,null,null,{"$f":"IF(H52=\"\",\"\",VLOOKUP(H52,'Otras referencias'!$A$24:$E$48,5,FALSE))","v":""},null,null,null,null,null,null,"",{"$f":"IF(AND(P52<>\"\",O52<>\"\"),IF(N52=\"A\",VLOOKUP(P52,'Otras referencias'!$J$24:$K$35,2,FALSE),IF(N52=\"B\",VLOOKUP(P52,'Otras referencias'!$N$24:$O$35,2,),IF(N52=\"C\",VLOOKUP(P52,'Otras referencias'!$R$24:$S$35,2,FALSE)))),\"\")","v":""},{"$f":"IF(S52=\"\",\"\",INDEX(referentes!$G$2:$H$5,MATCH(S52,referentes!$H$2:$H$5,0),1))","v":""},null,null,{"$f":"IF(T52=\"\",\"\",VLOOKUP(T52,referentes!$Q$2:$X$209,2,FALSE))","v":""},null,null,null,null,"",null,null,null,"",null,null,{"$f":"IF(AF52<>\"\",VLOOKUP(AF52,'Otras referencias'!$H$19:$I$20,2,FALSE),\"\")","v":""},null,{"$f":"IF(AH52<>\"\",VLOOKUP(AH52,'Otras referencias'!$H$19:$I$20,2,FALSE),\"\")","v":""},null,{"$f":"IF(AJ52<>\"\",VLOOKUP(AJ52,'Otras referencias'!$H$19:$I$20,2,FALSE),\"\")","v":""},null,{"$f":"IF(AL52<>\"\",VLOOKUP(AL52,'Otras referencias'!$H$19:$I$20,2,FALSE),\"\")","v":""}]
[null,{"$f":"IF(C53=\"\",\"\",IF(COUNTIF($C$3:C53, C53)>1, \"\", C53))","v":""},{"$f":"IF(J53=\"\",\"\",CONCATENATE(DIGITADOR!$M$1,J53,E53))","v":""},"",{"$f":"IF(H53=\"\",\"\",VLOOKUP(H53,'Otras referencias'!$A$24:$E$48,2,FALSE))","v":""},null,null,null,{"$f":"IF(H53=\"\",\"\",VLOOKUP(H53,'Otras referencias'!$A$24:$E$48,5,FALSE))","v":""},null,null,null,null,null,null,"",{"$f":"IF(AND(P53<>\"\",O53<>\"\"),IF(N53=\"A\",VLOOKUP(P53,'Otras referencias'!$J$24:$K$35,2,FALSE),IF(N53=\"B\",VLOOKUP(P53,'Otras referencias'!$N$24:$O$35,2,),IF(N53=\"C\",VLOOKUP(P53,'Otras referencias'!$R$24:$S$35,2,FALSE)))),\"\")","v":""},{"$f":"IF(S53=\"\",\"\",INDEX(referentes!$G$2:$H$5,MATCH(S53,referentes!$H$2:$H$5,0),1))","v":""},null,null,{"$f":"IF(T53=\"\",\"\",VLOOKUP(T53,referentes!$Q$2:$X$209,2,FALSE))","v":""},null,null,null,null,"",null,null,null,"",null,null,{"$f":"IF(AF53<>\"\",VLOOKUP(AF53,'Otras referencias'!$H$19:$I$20,2,FALSE),\"\")","v":""},null,{"$f":"IF(AH53<>\"\",VLOOKUP(AH53,'Otras referencias'!$H$19:$I$20,2,FALSE),\"\")","v":""},null,{"$f":"IF(AJ53<>\"\",VLOOKUP(AJ53,'Otras referencias'!$H$19:$I$20,2,FALSE),\"\")","v":""},null,{"$f":"IF(AL53<>\"\",VLOOKUP(AL53,'Otras referencias'!$H$19:$I$20,2,FALSE),\"\")","v":""}]
[null,{"$f":"IF(C54=\"\",\"\",IF(COUNTIF($C$3:C54, C54)>1, \"\", C54))","v":""},{"$f":"IF(J54=\"\",\"\",CONCATENATE(DIGITADOR!$M$1,J54,E54))","v":""},"",{"$f":"IF(H54=\"\",\"\",VLOOKUP(H54,'Otras referencias'!$A$24:$E$48,2,FALSE))","v":""},null,null,null,{"$f":"IF(H54=\"\",\"\",VLOOKUP(H54,'Otras referencias'!$A$24:$E$48,5,FALSE))","v":""},null,null,null,null,null,null,"",{"$f":"IF(AND(P54<>\"\",O54<>\"\"),IF(N54=\"A\",VLOOKUP(P54,'Otras referencias'!$J$24:$K$35,2,FALSE),IF(N54=\"B\",VLOOKUP(P54,'Otras referencias'!$N$24:$O$35,2,),IF(N54=\"C\",VLOOKUP(P54,'Otras referencias'!$R$24:$S$35,2,FALSE)))),\"\")","v":""},{"$f":"IF(S54=\"\",\"\",INDEX(referentes!$G$2:$H$5,MATCH(S54,referentes!$H$2:$H$5,0),1))","v":""},null,null,{"$f":"IF(T54=\"\",\"\",VLOOKUP(T54,referentes!$Q$2:$X$209,2,FALSE))","v":""},null,null,null,null,"",null,null,null,"",null,null,{"$f":"IF(AF54<>\"\",VLOOKUP(AF54,'Otras referencias'!$H$19:$I$20,2,FALSE),\"\")","v":""},null,{"$f":"IF(AH54<>\"\",VLOOKUP(AH54,'Otras referencias'!$H$19:$I$20,2,FALSE),\"\")","v":""},null,{"$f":"IF(AJ54<>\"\",VLOOKUP(AJ54,'Otras referencias'!$H$19:$I$20,2,FALSE),\"\")","v":""},null,{"$f":"IF(AL54<>\"\",VLOOKUP(AL54,'Otras referencias'!$H$19:$I$20,2,FALSE),\"\")","v":""}]
[null,{"$f":"IF(C55=\"\",\"\",IF(COUNTIF($C$3:C55, C55)>1, \"\", C55))","v":""},{"$f":"IF(J55=\"\",\"\",CONCATENATE(DIGITADOR!$M$1,J55,E55))","v":""},"",{"$f":"IF(H55=\"\",\"\",VLOOKUP(H55,'Otras referencias'!$A$24:$E$48,2,FALSE))","v":""},null,null,null,{"$f":"IF(H55=\"\",\"\",VLOOKUP(H55,'Otras referencias'!$A$24:$E$48,5,FALSE))","v":""},null,null,null,null,null,null,"",{"$f":"IF(AND(P55<>\"\",O55<>\"\"),IF(N55=\"A\",VLOOKUP(P55,'Otras referencias'!$J$24:$K$35,2,FALSE),IF(N55=\"B\",VLOOKUP(P55,'Otras referencias'!$N$24:$O$35,2,),IF(N55=\"C\",VLOOKUP(P55,'Otras referencias'!$R$24:$S$35,2,FALSE)))),\"\")","v":""},{"$f":"IF(S55=\"\",\"\",INDEX(referentes!$G$2:$H$5,MATCH(S55,referentes!$H$2:$H$5,0),1))","v":""},null,null,{"$f":"IF(T55=\"\",\"\",VLOOKUP(T55,referentes!$Q$2:$X$209,2,FALSE))","v":""},null,null,null,null,"",null,null,null,"",null,null,{"$f":"IF(AF55<>\"\",VLOOKUP(AF55,'Otras referencias'!$H$19:$I$20,2,FALSE),\"\")","v":""},null,{"$f":"IF(AH55<>\"\",VLOOKUP(AH55,'Otras referencias'!$H$19:$I$20,2,FALSE),\"\")","v":""},null,{"$f":"IF(AJ55<>\"\",VLOOKUP(AJ55,'Otras referencias'!$H$19:$I$20,2,FALSE),\"\")","v":""},null,{"$f":"IF(AL55<>\"\",VLOOKUP(AL55,'Otras referencias'!$H$19:$I$20,2,FALSE),\"\")","v":""}]
[null,{"$f":"IF(C56=\"\",\"\",IF(COUNTIF($C$3:C56, C56)>1, \"\", C56))","v":""},{"$f":"IF(J56=\"\",\"\",CONCATENATE(DIGITADOR!$M$1,J56,E56))","v":""},"",{"$f":"IF(H56=\"\",\"\",VLOOKUP(H56,'Otras referencias'!$A$24:$E$48,2,FALSE))","v":""},null,null,null,{"$f":"IF(H56=\"\",\"\",VLOOKUP(H56,'Otras referencias'!$A$24:$E$48,5,FALSE))","v":""},null,null,null,null,null,null,"",{"$f":"IF(AND(P56<>\"\",O56<>\"\"),IF(N56=\"A\",VLOOKUP(P56,'Otras referencias'!$J$24:$K$35,2,FALSE),IF(N56=\"B\",VLOOKUP(P56,'Otras referencias'!$N$24:$O$35,2,),IF(N56=\"C\",VLOOKUP(P56,'Otras referencias'!$R$24:$S$35,2,FALSE)))),\"\")","v":""},{"$f":"IF(S56=\"\",\"\",INDEX(referentes!$G$2:$H$5,MATCH(S56,referentes!$H$2:$H$5,0),1))","v":""},null,null,{"$f":"IF(T56=\"\",\"\",VLOOKUP(T56,referentes!$Q$2:$X$209,2,FALSE))","v":""},null,null,null,null,"",null,null,null,"",null,null,{"$f":"IF(AF56<>\"\",VLOOKUP(AF56,'Otras referencias'!$H$19:$I$20,2,FALSE),\"\")","v":""},null,{"$f":"IF(AH56<>\"\",VLOOKUP(AH56,'Otras referencias'!$H$19:$I$20,2,FALSE),\"\")","v":""},null,{"$f":"IF(AJ56<>\"\",VLOOKUP(AJ56,'Otras referencias'!$H$19:$I$20,2,FALSE),\"\")","v":""},null,{"$f":"IF(AL56<>\"\",VLOOKUP(AL56,'Otras referencias'!$H$19:$I$20,2,FALSE),\"\")","v":""}]
[null,{"$f":"IF(C57=\"\",\"\",IF(COUNTIF($C$3:C57, C57)>1, \"\", C57))","v":""},{"$f":"IF(J57=\"\",\"\",CONCATENATE(DIGITADOR!$M$1,J57,E57))","v":""},"",{"$f":"IF(H57=\"\",\"\",VLOOKUP(H57,'Otras referencias'!$A$24:$E$48,2,FALSE))","v":""},null,null,null,{"$f":"IF(H57=\"\",\"\",VLOOKUP(H57,'Otras referencias'!$A$24:$E$48,5,FALSE))","v":""},null,null,null,null,null,null,"",{"$f":"IF(AND(P57<>\"\",O57<>\"\"),IF(N57=\"A\",VLOOKUP(P57,'Otras referencias'!$J$24:$K$35,2,FALSE),IF(N57=\"B\",VLOOKUP(P57,'Otras referencias'!$N$24:$O$35,2,),IF(N57=\"C\",VLOOKUP(P57,'Otras referencias'!$R$24:$S$35,2,FALSE)))),\"\")","v":""},{"$f":"IF(S57=\"\",\"\",INDEX(referentes!$G$2:$H$5,MATCH(S57,referentes!$H$2:$H$5,0),1))","v":""},null,null,{"$f":"IF(T57=\"\",\"\",VLOOKUP(T57,referentes!$Q$2:$X$209,2,FALSE))","v":""},null,null,null,null,"",null,null,null,"",null,null,{"$f":"IF(AF57<>\"\",VLOOKUP(AF57,'Otras referencias'!$H$19:$I$20,2,FALSE),\"\")","v":""},null,{"$f":"IF(AH57<>\"\",VLOOKUP(AH57,'Otras referencias'!$H$19:$I$20,2,FALSE),\"\")","v":""},null,{"$f":"IF(AJ57<>\"\",VLOOKUP(AJ57,'Otras referencias'!$H$19:$I$20,2,FALSE),\"\")","v":""},null,{"$f":"IF(AL57<>\"\",VLOOKUP(AL57,'Otras referencias'!$H$19:$I$20,2,FALSE),\"\")","v":""}]
[null,{"$f":"IF(C58=\"\",\"\",IF(COUNTIF($C$3:C58, C58)>1, \"\", C58))","v":""},{"$f":"IF(J58=\"\",\"\",CONCATENATE(DIGITADOR!$M$1,J58,E58))","v":""},"",{"$f":"IF(H58=\"\",\"\",VLOOKUP(H58,'Otras referencias'!$A$24:$E$48,2,FALSE))","v":""},null,null,null,{"$f":"IF(H58=\"\",\"\",VLOOKUP(H58,'Otras referencias'!$A$24:$E$48,5,FALSE))","v":""},null,null,null,null,null,null,"",{"$f":"IF(AND(P58<>\"\",O58<>\"\"),IF(N58=\"A\",VLOOKUP(P58,'Otras referencias'!$J$24:$K$35,2,FALSE),IF(N58=\"B\",VLOOKUP(P58,'Otras referencias'!$N$24:$O$35,2,),IF(N58=\"C\",VLOOKUP(P58,'Otras referencias'!$R$24:$S$35,2,FALSE)))),\"\")","v":""},{"$f":"IF(S58=\"\",\"\",INDEX(referentes!$G$2:$H$5,MATCH(S58,referentes!$H$2:$H$5,0),1))","v":""},null,null,{"$f":"IF(T58=\"\",\"\",VLOOKUP(T58,referentes!$Q$2:$X$209,2,FALSE))","v":""},null,null,null,null,"",null,null,null,"",null,null,{"$f":"IF(AF58<>\"\",VLOOKUP(AF58,'Otras referencias'!$H$19:$I$20,2,FALSE),\"\")","v":""},null,{"$f":"IF(AH58<>\"\",VLOOKUP(AH58,'Otras referencias'!$H$19:$I$20,2,FALSE),\"\")","v":""},null,{"$f":"IF(AJ58<>\"\",VLOOKUP(AJ58,'Otras referencias'!$H$19:$I$20,2,FALSE),\"\")","v":""},null,{"$f":"IF(AL58<>\"\",VLOOKUP(AL58,'Otras referencias'!$H$19:$I$20,2,FALSE),\"\")","v":""}]
[null,{"$f":"IF(C59=\"\",\"\",IF(COUNTIF($C$3:C59, C59)>1, \"\", C59))","v":""},{"$f":"IF(J59=\"\",\"\",CONCATENATE(DIGITADOR!$M$1,J59,E59))","v":""},"",{"$f":"IF(H59=\"\",\"\",VLOOKUP(H59,'Otras referencias'!$A$24:$E$48,2,FALSE))","v":""},null,null,null,{"$f":"IF(H59=\"\",\"\",VLOOKUP(H59,'Otras referencias'!$A$24:$E$48,5,FALSE))","v":""},null,null,null,null,null,null,"",{"$f":"IF(AND(P59<>\"\",O59<>\"\"),IF(N59=\"A\",VLOOKUP(P59,'Otras referencias'!$J$24:$K$35,2,FALSE),IF(N59=\"B\",VLOOKUP(P59,'Otras referencias'!$N$24:$O$35,2,),IF(N59=\"C\",VLOOKUP(P59,'Otras referencias'!$R$24:$S$35,2,FALSE)))),\"\")","v":""},{"$f":"IF(S59=\"\",\"\",INDEX(referentes!$G$2:$H$5,MATCH(S59,referentes!$H$2:$H$5,0),1))","v":""},null,null,{"$f":"IF(T59=\"\",\"\",VLOOKUP(T59,referentes!$Q$2:$X$209,2,FALSE))","v":""},null,null,null,null,"",null,null,null,"",null,null,{"$f":"IF(AF59<>\"\",VLOOKUP(AF59,'Otras referencias'!$H$19:$I$20,2,FALSE),\"\")","v":""},null,{"$f":"IF(AH59<>\"\",VLOOKUP(AH59,'Otras referencias'!$H$19:$I$20,2,FALSE),\"\")","v":""},null,{"$f":"IF(AJ59<>\"\",VLOOKUP(AJ59,'Otras referencias'!$H$19:$I$20,2,FALSE),\"\")","v":""},null,{"$f":"IF(AL59<>\"\",VLOOKUP(AL59,'Otras referencias'!$H$19:$I$20,2,FALSE),\"\")","v":""}]
[null,{"$f":"IF(C60=\"\",\"\",IF(COUNTIF($C$3:C60, C60)>1, \"\", C60))","v":""},{"$f":"IF(J60=\"\",\"\",CONCATENATE(DIGITADOR!$M$1,J60,E60))","v":""},"",{"$f":"IF(H60=\"\",\"\",VLOOKUP(H60,'Otras referencias'!$A$24:$E$48,2,FALSE))","v":""},null,null,null,{"$f":"IF(H60=\"\",\"\",VLOOKUP(H60,'Otras referencias'!$A$24:$E$48,5,FALSE))","v":""},null,null,null,null,null,null,"",{"$f":"IF(AND(P60<>\"\",O60<>\"\"),IF(N60=\"A\",VLOOKUP(P60,'Otras referencias'!$J$24:$K$35,2,FALSE),IF(N60=\"B\",VLOOKUP(P60,'Otras referencias'!$N$24:$O$35,2,),IF(N60=\"C\",VLOOKUP(P60,'Otras referencias'!$R$24:$S$35,2,FALSE)))),\"\")","v":""},{"$f":"IF(S60=\"\",\"\",INDEX(referentes!$G$2:$H$5,MATCH(S60,referentes!$H$2:$H$5,0),1))","v":""},null,null,{"$f":"IF(T60=\"\",\"\",VLOOKUP(T60,referentes!$Q$2:$X$209,2,FALSE))","v":""},null,null,null,null,"",null,null,null,"",null,null,{"$f":"IF(AF60<>\"\",VLOOKUP(AF60,'Otras referencias'!$H$19:$I$20,2,FALSE),\"\")","v":""},null,{"$f":"IF(AH60<>\"\",VLOOKUP(AH60,'Otras referencias'!$H$19:$I$20,2,FALSE),\"\")","v":""},null,{"$f":"IF(AJ60<>\"\",VLOOKUP(AJ60,'Otras referencias'!$H$19:$I$20,2,FALSE),\"\")","v":""},null,{"$f":"IF(AL60<>\"\",VLOOKUP(AL60,'Otras referencias'!$H$19:$I$20,2,FALSE),\"\")","v":""}]
[null,{"$f":"IF(C61=\"\",\"\",IF(COUNTIF($C$3:C61, C61)>1, \"\", C61))","v":""},{"$f":"IF(J61=\"\",\"\",CONCATENATE(DIGITADOR!$M$1,J61,E61))","v":""},"",{"$f":"IF(H61=\"\",\"\",VLOOKUP(H61,'Otras referencias'!$A$24:$E$48,2,FALSE))","v":""},null,null,null,{"$f":"IF(H61=\"\",\"\",VLOOKUP(H61,'Otras referencias'!$A$24:$E$48,5,FALSE))","v":""},null,null,null,null,null,null,"",{"$f":"IF(AND(P61<>\"\",O61<>\"\"),IF(N61=\"A\",VLOOKUP(P61,'Otras referencias'!$J$24:$K$35,2,FALSE),IF(N61=\"B\",VLOOKUP(P61,'Otras referencias'!$N$24:$O$35,2,),IF(N61=\"C\",VLOOKUP(P61,'Otras referencias'!$R$24:$S$35,2,FALSE)))),\"\")","v":""},{"$f":"IF(S61=\"\",\"\",INDEX(referentes!$G$2:$H$5,MATCH(S61,referentes!$H$2:$H$5,0),1))","v":""},null,null,{"$f":"IF(T61=\"\",\"\",VLOOKUP(T61,referentes!$Q$2:$X$209,2,FALSE))","v":""},null,null,null,null,"",null,null,null,"",null,null,{"$f":"IF(AF61<>\"\",VLOOKUP(AF61,'Otras referencias'!$H$19:$I$20,2,FALSE),\"\")","v":""},null,{"$f":"IF(AH61<>\"\",VLOOKUP(AH61,'Otras referencias'!$H$19:$I$20,2,FALSE),\"\")","v":""},null,{"$f":"IF(AJ61<>\"\",VLOOKUP(AJ61,'Otras referencias'!$H$19:$I$20,2,FALSE),\"\")","v":""},null,{"$f":"IF(AL61<>\"\",VLOOKUP(AL61,'Otras referencias'!$H$19:$I$20,2,FALSE),\"\")","v":""}]
[null,{"$f":"IF(C62=\"\",\"\",IF(COUNTIF($C$3:C62, C62)>1, \"\", C62))","v":""},{"$f":"IF(J62=\"\",\"\",CONCATENATE(DIGITADOR!$M$1,J62,E62))","v":""},"",{"$f":"IF(H62=\"\",\"\",VLOOKUP(H62,'Otras referencias'!$A$24:$E$48,2,FALSE))","v":""},null,null,null,{"$f":"IF(H62=\"\",\"\",VLOOKUP(H62,'Otras referencias'!$A$24:$E$48,5,FALSE))","v":""},null,null,null,null,null,null,"",{"$f":"IF(AND(P62<>\"\",O62<>\"\"),IF(N62=\"A\",VLOOKUP(P62,'Otras referencias'!$J$24:$K$35,2,FALSE),IF(N62=\"B\",VLOOKUP(P62,'Otras referencias'!$N$24:$O$35,2,),IF(N62=\"C\",VLOOKUP(P62,'Otras referencias'!$R$24:$S$35,2,FALSE)))),\"\")","v":""},{"$f":"IF(S62=\"\",\"\",INDEX(referentes!$G$2:$H$5,MATCH(S62,referentes!$H$2:$H$5,0),1))","v":""},null,null,{"$f":"IF(T62=\"\",\"\",VLOOKUP(T62,referentes!$Q$2:$X$209,2,FALSE))","v":""},null,null,null,null,"",null,null,null,"",null,null,{"$f":"IF(AF62<>\"\",VLOOKUP(AF62,'Otras referencias'!$H$19:$I$20,2,FALSE),\"\")","v":""},null,{"$f":"IF(AH62<>\"\",VLOOKUP(AH62,'Otras referencias'!$H$19:$I$20,2,FALSE),\"\")","v":""},null,{"$f":"IF(AJ62<>\"\",VLOOKUP(AJ62,'Otras referencias'!$H$19:$I$20,2,FALSE),\"\")","v":""},null,{"$f":"IF(AL62<>\"\",VLOOKUP(AL62,'Otras referencias'!$H$19:$I$20,2,FALSE),\"\")","v":""}]
[null,{"$f":"IF(C63=\"\",\"\",IF(COUNTIF($C$3:C63, C63)>1, \"\", C63))","v":""},{"$f":"IF(J63=\"\",\"\",CONCATENATE(DIGITADOR!$M$1,J63,E63))","v":""},"",{"$f":"IF(H63=\"\",\"\",VLOOKUP(H63,'Otras referencias'!$A$24:$E$48,2,FALSE))","v":""},null,null,null,{"$f":"IF(H63=\"\",\"\",VLOOKUP(H63,'Otras referencias'!$A$24:$E$48,5,FALSE))","v":""},null,null,null,null,null,null,"",{"$f":"IF(AND(P63<>\"\",O63<>\"\"),IF(N63=\"A\",VLOOKUP(P63,'Otras referencias'!$J$24:$K$35,2,FALSE),IF(N63=\"B\",VLOOKUP(P63,'Otras referencias'!$N$24:$O$35,2,),IF(N63=\"C\",VLOOKUP(P63,'Otras referencias'!$R$24:$S$35,2,FALSE)))),\"\")","v":""},{"$f":"IF(S63=\"\",\"\",INDEX(referentes!$G$2:$H$5,MATCH(S63,referentes!$H$2:$H$5,0),1))","v":""},null,null,{"$f":"IF(T63=\"\",\"\",VLOOKUP(T63,referentes!$Q$2:$X$209,2,FALSE))","v":""},null,null,null,null,"",null,null,null,"",null,null,{"$f":"IF(AF63<>\"\",VLOOKUP(AF63,'Otras referencias'!$H$19:$I$20,2,FALSE),\"\")","v":""},null,{"$f":"IF(AH63<>\"\",VLOOKUP(AH63,'Otras referencias'!$H$19:$I$20,2,FALSE),\"\")","v":""},null,{"$f":"IF(AJ63<>\"\",VLOOKUP(AJ63,'Otras referencias'!$H$19:$I$20,2,FALSE),\"\")","v":""},null,{"$f":"IF(AL63<>\"\",VLOOKUP(AL63,'Otras referencias'!$H$19:$I$20,2,FALSE),\"\")","v":""}]
[null,{"$f":"IF(C64=\"\",\"\",IF(COUNTIF($C$3:C64, C64)>1, \"\", C64))","v":""},{"$f":"IF(J64=\"\",\"\",CONCATENATE(DIGITADOR!$M$1,J64,E64))","v":""},"",{"$f":"IF(H64=\"\",\"\",VLOOKUP(H64,'Otras referencias'!$A$24:$E$48,2,FALSE))","v":""},null,null,null,{"$f":"IF(H64=\"\",\"\",VLOOKUP(H64,'Otras referencias'!$A$24:$E$48,5,FALSE))","v":""},null,null,null,null,null,null,"",{"$f":"IF(AND(P64<>\"\",O64<>\"\"),IF(N64=\"A\",VLOOKUP(P64,'Otras referencias'!$J$24:$K$35,2,FALSE),IF(N64=\"B\",VLOOKUP(P64,'Otras referencias'!$N$24:$O$35,2,),IF(N64=\"C\",VLOOKUP(P64,'Otras referencias'!$R$24:$S$35,2,FALSE)))),\"\")","v":""},{"$f":"IF(S64=\"\",\"\",INDEX(referentes!$G$2:$H$5,MATCH(S64,referentes!$H$2:$H$5,0),1))","v":""},null,null,{"$f":"IF(T64=\"\",\"\",VLOOKUP(T64,referentes!$Q$2:$X$209,2,FALSE))","v":""},null,null,null,null,"",null,null,null,"",null,null,{"$f":"IF(AF64<>\"\",VLOOKUP(AF64,'Otras referencias'!$H$19:$I$20,2,FALSE),\"\")","v":""},null,{"$f":"IF(AH64<>\"\",VLOOKUP(AH64,'Otras referencias'!$H$19:$I$20,2,FALSE),\"\")","v":""},null,{"$f":"IF(AJ64<>\"\",VLOOKUP(AJ64,'Otras referencias'!$H$19:$I$20,2,FALSE),\"\")","v":""},null,{"$f":"IF(AL64<>\"\",VLOOKUP(AL64,'Otras referencias'!$H$19:$I$20,2,FALSE),\"\")","v":""}]
[null,{"$f":"IF(C65=\"\",\"\",IF(COUNTIF($C$3:C65, C65)>1, \"\", C65))","v":""},{"$f":"IF(J65=\"\",\"\",CONCATENATE(DIGITADOR!$M$1,J65,E65))","v":""},"",{"$f":"IF(H65=\"\",\"\",VLOOKUP(H65,'Otras referencias'!$A$24:$E$48,2,FALSE))","v":""},null,null,null,{"$f":"IF(H65=\"\",\"\",VLOOKUP(H65,'Otras referencias'!$A$24:$E$48,5,FALSE))","v":""},null,null,null,null,null,null,"",{"$f":"IF(AND(P65<>\"\",O65<>\"\"),IF(N65=\"A\",VLOOKUP(P65,'Otras referencias'!$J$24:$K$35,2,FALSE),IF(N65=\"B\",VLOOKUP(P65,'Otras referencias'!$N$24:$O$35,2,),IF(N65=\"C\",VLOOKUP(P65,'Otras referencias'!$R$24:$S$35,2,FALSE)))),\"\")","v":""},{"$f":"IF(S65=\"\",\"\",INDEX(referentes!$G$2:$H$5,MATCH(S65,referentes!$H$2:$H$5,0),1))","v":""},null,null,{"$f":"IF(T65=\"\",\"\",VLOOKUP(T65,referentes!$Q$2:$X$209,2,FALSE))","v":""},null,null,null,null,"",null,null,null,"",null,null,{"$f":"IF(AF65<>\"\",VLOOKUP(AF65,'Otras referencias'!$H$19:$I$20,2,FALSE),\"\")","v":""},null,{"$f":"IF(AH65<>\"\",VLOOKUP(AH65,'Otras referencias'!$H$19:$I$20,2,FALSE),\"\")","v":""},null,{"$f":"IF(AJ65<>\"\",VLOOKUP(AJ65,'Otras referencias'!$H$19:$I$20,2,FALSE),\"\")","v":""},null,{"$f":"IF(AL65<>\"\",VLOOKUP(AL65,'Otras referencias'!$H$19:$I$20,2,FALSE),\"\")","v":""}]
[null,{"$f":"IF(C66=\"\",\"\",IF(COUNTIF($C$3:C66, C66)>1, \"\", C66))","v":""},{"$f":"IF(J66=\"\",\"\",CONCATENATE(DIGITADOR!$M$1,J66,E66))","v":""},"",{"$f":"IF(H66=\"\",\"\",VLOOKUP(H66,'Otras referencias'!$A$24:$E$48,2,FALSE))","v":""},null,null,null,{"$f":"IF(H66=\"\",\"\",VLOOKUP(H66,'Otras referencias'!$A$24:$E$48,5,FALSE))","v":""},null,null,null,null,null,null,"",{"$f":"IF(AND(P66<>\"\",O66<>\"\"),IF(N66=\"A\",VLOOKUP(P66,'Otras referencias'!$J$24:$K$35,2,FALSE),IF(N66=\"B\",VLOOKUP(P66,'Otras referencias'!$N$24:$O$35,2,),IF(N66=\"C\",VLOOKUP(P66,'Otras referencias'!$R$24:$S$35,2,FALSE)))),\"\")","v":""},{"$f":"IF(S66=\"\",\"\",INDEX(referentes!$G$2:$H$5,MATCH(S66,referentes!$H$2:$H$5,0),1))","v":""},null,null,{"$f":"IF(T66=\"\",\"\",VLOOKUP(T66,referentes!$Q$2:$X$209,2,FALSE))","v":""},null,null,null,null,"",null,null,null,"",null,null,{"$f":"IF(AF66<>\"\",VLOOKUP(AF66,'Otras referencias'!$H$19:$I$20,2,FALSE),\"\")","v":""},null,{"$f":"IF(AH66<>\"\",VLOOKUP(AH66,'Otras referencias'!$H$19:$I$20,2,FALSE),\"\")","v":""},null,{"$f":"IF(AJ66<>\"\",VLOOKUP(AJ66,'Otras referencias'!$H$19:$I$20,2,FALSE),\"\")","v":""},null,{"$f":"IF(AL66<>\"\",VLOOKUP(AL66,'Otras referencias'!$H$19:$I$20,2,FALSE),\"\")","v":""}]
[null,{"$f":"IF(C67=\"\",\"\",IF(COUNTIF($C$3:C67, C67)>1, \"\", C67))","v":""},{"$f":"IF(J67=\"\",\"\",CONCATENATE(DIGITADOR!$M$1,J67,E67))","v":""},"",{"$f":"IF(H67=\"\",\"\",VLOOKUP(H67,'Otras referencias'!$A$24:$E$48,2,FALSE))","v":""},null,null,null,{"$f":"IF(H67=\"\",\"\",VLOOKUP(H67,'Otras referencias'!$A$24:$E$48,5,FALSE))","v":""},null,null,null,null,null,null,"",{"$f":"IF(AND(P67<>\"\",O67<>\"\"),IF(N67=\"A\",VLOOKUP(P67,'Otras referencias'!$J$24:$K$35,2,FALSE),IF(N67=\"B\",VLOOKUP(P67,'Otras referencias'!$N$24:$O$35,2,),IF(N67=\"C\",VLOOKUP(P67,'Otras referencias'!$R$24:$S$35,2,FALSE)))),\"\")","v":""},{"$f":"IF(S67=\"\",\"\",INDEX(referentes!$G$2:$H$5,MATCH(S67,referentes!$H$2:$H$5,0),1))","v":""},null,null,{"$f":"IF(T67=\"\",\"\",VLOOKUP(T67,referentes!$Q$2:$X$209,2,FALSE))","v":""},null,null,null,null,"",null,null,null,"",null,null,{"$f":"IF(AF67<>\"\",VLOOKUP(AF67,'Otras referencias'!$H$19:$I$20,2,FALSE),\"\")","v":""},null,{"$f":"IF(AH67<>\"\",VLOOKUP(AH67,'Otras referencias'!$H$19:$I$20,2,FALSE),\"\")","v":""},null,{"$f":"IF(AJ67<>\"\",VLOOKUP(AJ67,'Otras referencias'!$H$19:$I$20,2,FALSE),\"\")","v":""},null,{"$f":"IF(AL67<>\"\",VLOOKUP(AL67,'Otras referencias'!$H$19:$I$20,2,FALSE),\"\")","v":""}]
[null,{"$f":"IF(C68=\"\",\"\",IF(COUNTIF($C$3:C68, C68)>1, \"\", C68))","v":""},{"$f":"IF(J68=\"\",\"\",CONCATENATE(DIGITADOR!$M$1,J68,E68))","v":""},{"$f":"IF(C68=\"\",\"\",CONCATENATE(C68,ROW()-2))","v":""},{"$f":"IF(H68=\"\",\"\",VLOOKUP(H68,'Otras referencias'!$A$24:$E$48,2,FALSE))","v":""},null,null,null,{"$f":"IF(H68=\"\",\"\",VLOOKUP(H68,'Otras referencias'!$A$24:$E$48,5,FALSE))","v":""},null,null,null,null,null,null,{"$f":"CONCATENATE(N68,O68)","v":""},{"$f":"IF(AND(P68<>\"\",O68<>\"\"),IF(N68=\"A\",VLOOKUP(P68,'Otras referencias'!$J$24:$K$35,2,FALSE),IF(N68=\"B\",VLOOKUP(P68,'Otras referencias'!$N$24:$O$35,2,),IF(N68=\"C\",VLOOKUP(P68,'Otras referencias'!$R$24:$S$35,2,FALSE)))),\"\")","v":""},{"$f":"IF(S68=\"\",\"\",INDEX(referentes!$G$2:$H$5,MATCH(S68,referentes!$H$2:$H$5,0),1))","v":""},null,null,{"$f":"IF(T68=\"\",\"\",VLOOKUP(T68,referentes!$Q$2:$X$209,2,FALSE))","v":""},null,null,null,null,{"$f":"IF(OR(W68=\"\",X68=\"\",Y68=\"\"),\"\",AVERAGE(W68,X68,Y68))","v":""},null,null,null,{"$f":"IF(OR(AA68=\"\",AB68=\"\",AC68=\"\"),\"\",AVERAGE(AA68,AB68,AC68))","v":""},null,null,{"$f":"IF(AF68<>\"\",VLOOKUP(AF68,'Otras referencias'!$H$19:$I$20,2,FALSE),\"\")","v":""},null,{"$f":"IF(AH68<>\"\",VLOOKUP(AH68,'Otras referencias'!$H$19:$I$20,2,FALSE),\"\")","v":""},null,{"$f":"IF(AJ68<>\"\",VLOOKUP(AJ68,'Otras referencias'!$H$19:$I$20,2,FALSE),\"\")","v":""},null,{"$f":"IF(AL68<>\"\",VLOOKUP(AL68,'Otras referencias'!$H$19:$I$20,2,FALSE),\"\")","v":""}]
[null,{"$f":"IF(C69=\"\",\"\",IF(COUNTIF($C$3:C69, C69)>1, \"\", C69))","v":""},{"$f":"IF(J69=\"\",\"\",CONCATENATE(DIGITADOR!$M$1,J69,E69))","v":""},"",{"$f":"IF(H69=\"\",\"\",VLOOKUP(H69,'Otras referencias'!$A$24:$E$48,2,FALSE))","v":""},null,null,null,{"$f":"IF(H69=\"\",\"\",VLOOKUP(H69,'Otras referencias'!$A$24:$E$48,5,FALSE))","v":""},null,null,null,null,null,null,"",{"$f":"IF(AND(P69<>\"\",O69<>\"\"),IF(N69=\"A\",VLOOKUP(P69,'Otras referencias'!$J$24:$K$35,2,FALSE),IF(N69=\"B\",VLOOKUP(P69,'Otras referencias'!$N$24:$O$35,2,),IF(N69=\"C\",VLOOKUP(P69,'Otras referencias'!$R$24:$S$35,2,FALSE)))),\"\")","v":""},{"$f":"IF(S69=\"\",\"\",INDEX(referentes!$G$2:$H$5,MATCH(S69,referentes!$H$2:$H$5,0),1))","v":""},null,null,{"$f":"IF(T69=\"\",\"\",VLOOKUP(T69,referentes!$Q$2:$X$209,2,FALSE))","v":""},null,null,null,null,"",null,null,null,"",null,null,{"$f":"IF(AF69<>\"\",VLOOKUP(AF69,'Otras referencias'!$H$19:$I$20,2,FALSE),\"\")","v":""},null,{"$f":"IF(AH69<>\"\",VLOOKUP(AH69,'Otras referencias'!$H$19:$I$20,2,FALSE),\"\")","v":""},null,{"$f":"IF(AJ69<>\"\",VLOOKUP(AJ69,'Otras referencias'!$H$19:$I$20,2,FALSE),\"\")","v":""},null,{"$f":"IF(AL69<>\"\",VLOOKUP(AL69,'Otras referencias'!$H$19:$I$20,2,FALSE),\"\")","v":""}]
[null,{"$f":"IF(C70=\"\",\"\",IF(COUNTIF($C$3:C70, C70)>1, \"\", C70))","v":""},{"$f":"IF(J70=\"\",\"\",CONCATENATE(DIGITADOR!$M$1,J70,E70))","v":""},"",{"$f":"IF(H70=\"\",\"\",VLOOKUP(H70,'Otras referencias'!$A$24:$E$48,2,FALSE))","v":""},null,null,null,{"$f":"IF(H70=\"\",\"\",VLOOKUP(H70,'Otras referencias'!$A$24:$E$48,5,FALSE))","v":""},null,null,null,null,null,null,"",{"$f":"IF(AND(P70<>\"\",O70<>\"\"),IF(N70=\"A\",VLOOKUP(P70,'Otras referencias'!$J$24:$K$35,2,FALSE),IF(N70=\"B\",VLOOKUP(P70,'Otras referencias'!$N$24:$O$35,2,),IF(N70=\"C\",VLOOKUP(P70,'Otras referencias'!$R$24:$S$35,2,FALSE)))),\"\")","v":""},{"$f":"IF(S70=\"\",\"\",INDEX(referentes!$G$2:$H$5,MATCH(S70,referentes!$H$2:$H$5,0),1))","v":""},null,null,{"$f":"IF(T70=\"\",\"\",VLOOKUP(T70,referentes!$Q$2:$X$209,2,FALSE))","v":""},null,null,null,null,"",null,null,null,"",null,null,{"$f":"IF(AF70<>\"\",VLOOKUP(AF70,'Otras referencias'!$H$19:$I$20,2,FALSE),\"\")","v":""},null,{"$f":"IF(AH70<>\"\",VLOOKUP(AH70,'Otras referencias'!$H$19:$I$20,2,FALSE),\"\")","v":""},null,{"$f":"IF(AJ70<>\"\",VLOOKUP(AJ70,'Otras referencias'!$H$19:$I$20,2,FALSE),\"\")","v":""},null,{"$f":"IF(AL70<>\"\",VLOOKUP(AL70,'Otras referencias'!$H$19:$I$20,2,FALSE),\"\")","v":""}]
[null,{"$f":"IF(C71=\"\",\"\",IF(COUNTIF($C$3:C71, C71)>1, \"\", C71))","v":""},{"$f":"IF(J71=\"\",\"\",CONCATENATE(DIGITADOR!$M$1,J71,E71))","v":""},"",{"$f":"IF(H71=\"\",\"\",VLOOKUP(H71,'Otras referencias'!$A$24:$E$48,2,FALSE))","v":""},null,null,null,{"$f":"IF(H71=\"\",\"\",VLOOKUP(H71,'Otras referencias'!$A$24:$E$48,5,FALSE))","v":""},null,null,null,null,null,null,"",{"$f":"IF(AND(P71<>\"\",O71<>\"\"),IF(N71=\"A\",VLOOKUP(P71,'Otras referencias'!$J$24:$K$35,2,FALSE),IF(N71=\"B\",VLOOKUP(P71,'Otras referencias'!$N$24:$O$35,2,),IF(N71=\"C\",VLOOKUP(P71,'Otras referencias'!$R$24:$S$35,2,FALSE)))),\"\")","v":""},{"$f":"IF(S71=\"\",\"\",INDEX(referentes!$G$2:$H$5,MATCH(S71,referentes!$H$2:$H$5,0),1))","v":""},null,null,{"$f":"IF(T71=\"\",\"\",VLOOKUP(T71,referentes!$Q$2:$X$209,2,FALSE))","v":""},null,null,null,null,"",null,null,null,"",null,null,{"$f":"IF(AF71<>\"\",VLOOKUP(AF71,'Otras referencias'!$H$19:$I$20,2,FALSE),\"\")","v":""},null,{"$f":"IF(AH71<>\"\",VLOOKUP(AH71,'Otras referencias'!$H$19:$I$20,2,FALSE),\"\")","v":""},null,{"$f":"IF(AJ71<>\"\",VLOOKUP(AJ71,'Otras referencias'!$H$19:$I$20,2,FALSE),\"\")","v":""},null,{"$f":"IF(AL71<>\"\",VLOOKUP(AL71,'Otras referencias'!$H$19:$I$20,2,FALSE),\"\")","v":""}]
[null,{"$f":"IF(C72=\"\",\"\",IF(COUNTIF($C$3:C72, C72)>1, \"\", C72))","v":""},{"$f":"IF(J72=\"\",\"\",CONCATENATE(DIGITADOR!$M$1,J72,E72))","v":""},"",{"$f":"IF(H72=\"\",\"\",VLOOKUP(H72,'Otras referencias'!$A$24:$E$48,2,FALSE))","v":""},null,null,null,{"$f":"IF(H72=\"\",\"\",VLOOKUP(H72,'Otras referencias'!$A$24:$E$48,5,FALSE))","v":""},null,null,null,null,null,null,"",{"$f":"IF(AND(P72<>\"\",O72<>\"\"),IF(N72=\"A\",VLOOKUP(P72,'Otras referencias'!$J$24:$K$35,2,FALSE),IF(N72=\"B\",VLOOKUP(P72,'Otras referencias'!$N$24:$O$35,2,),IF(N72=\"C\",VLOOKUP(P72,'Otras referencias'!$R$24:$S$35,2,FALSE)))),\"\")","v":""},{"$f":"IF(S72=\"\",\"\",INDEX(referentes!$G$2:$H$5,MATCH(S72,referentes!$H$2:$H$5,0),1))","v":""},null,null,{"$f":"IF(T72=\"\",\"\",VLOOKUP(T72,referentes!$Q$2:$X$209,2,FALSE))","v":""},null,null,null,null,"",null,null,null,"",null,null,{"$f":"IF(AF72<>\"\",VLOOKUP(AF72,'Otras referencias'!$H$19:$I$20,2,FALSE),\"\")","v":""},null,{"$f":"IF(AH72<>\"\",VLOOKUP(AH72,'Otras referencias'!$H$19:$I$20,2,FALSE),\"\")","v":""},null,{"$f":"IF(AJ72<>\"\",VLOOKUP(AJ72,'Otras referencias'!$H$19:$I$20,2,FALSE),\"\")","v":""},null,{"$f":"IF(AL72<>\"\",VLOOKUP(AL72,'Otras referencias'!$H$19:$I$20,2,FALSE),\"\")","v":""}]
[null,{"$f":"IF(C73=\"\",\"\",IF(COUNTIF($C$3:C73, C73)>1, \"\", C73))","v":""},{"$f":"IF(J73=\"\",\"\",CONCATENATE(DIGITADOR!$M$1,J73,E73))","v":""},"",{"$f":"IF(H73=\"\",\"\",VLOOKUP(H73,'Otras referencias'!$A$24:$E$48,2,FALSE))","v":""},null,null,null,{"$f":"IF(H73=\"\",\"\",VLOOKUP(H73,'Otras referencias'!$A$24:$E$48,5,FALSE))","v":""},null,null,null,null,null,null,"",{"$f":"IF(AND(P73<>\"\",O73<>\"\"),IF(N73=\"A\",VLOOKUP(P73,'Otras referencias'!$J$24:$K$35,2,FALSE),IF(N73=\"B\",VLOOKUP(P73,'Otras referencias'!$N$24:$O$35,2,),IF(N73=\"C\",VLOOKUP(P73,'Otras referencias'!$R$24:$S$35,2,FALSE)))),\"\")","v":""},{"$f":"IF(S73=\"\",\"\",INDEX(referentes!$G$2:$H$5,MATCH(S73,referentes!$H$2:$H$5,0),1))","v":""},null,null,{"$f":"IF(T73=\"\",\"\",VLOOKUP(T73,referentes!$Q$2:$X$209,2,FALSE))","v":""},null,null,null,null,"",null,null,null,"",null,null,{"$f":"IF(AF73<>\"\",VLOOKUP(AF73,'Otras referencias'!$H$19:$I$20,2,FALSE),\"\")","v":""},null,{"$f":"IF(AH73<>\"\",VLOOKUP(AH73,'Otras referencias'!$H$19:$I$20,2,FALSE),\"\")","v":""},null,{"$f":"IF(AJ73<>\"\",VLOOKUP(AJ73,'Otras referencias'!$H$19:$I$20,2,FALSE),\"\")","v":""},null,{"$f":"IF(AL73<>\"\",VLOOKUP(AL73,'Otras referencias'!$H$19:$I$20,2,FALSE),\"\")","v":""}]
[null,{"$f":"IF(C74=\"\",\"\",IF(COUNTIF($C$3:C74, C74)>1, \"\", C74))","v":""},{"$f":"IF(J74=\"\",\"\",CONCATENATE(DIGITADOR!$M$1,J74,E74))","v":""},"",{"$f":"IF(H74=\"\",\"\",VLOOKUP(H74,'Otras referencias'!$A$24:$E$48,2,FALSE))","v":""},null,null,null,{"$f":"IF(H74=\"\",\"\",VLOOKUP(H74,'Otras referencias'!$A$24:$E$48,5,FALSE))","v":""},null,null,null,null,null,null,"",{"$f":"IF(AND(P74<>\"\",O74<>\"\"),IF(N74=\"A\",VLOOKUP(P74,'Otras referencias'!$J$24:$K$35,2,FALSE),IF(N74=\"B\",VLOOKUP(P74,'Otras referencias'!$N$24:$O$35,2,),IF(N74=\"C\",VLOOKUP(P74,'Otras referencias'!$R$24:$S$35,2,FALSE)))),\"\")","v":""},{"$f":"IF(S74=\"\",\"\",INDEX(referentes!$G$2:$H$5,MATCH(S74,referentes!$H$2:$H$5,0),1))","v":""},null,null,{"$f":"IF(T74=\"\",\"\",VLOOKUP(T74,referentes!$Q$2:$X$209,2,FALSE))","v":""},null,null,null,null,"",null,null,null,"",null,null,{"$f":"IF(AF74<>\"\",VLOOKUP(AF74,'Otras referencias'!$H$19:$I$20,2,FALSE),\"\")","v":""},null,{"$f":"IF(AH74<>\"\",VLOOKUP(AH74,'Otras referencias'!$H$19:$I$20,2,FALSE),\"\")","v":""},null,{"$f":"IF(AJ74<>\"\",VLOOKUP(AJ74,'Otras referencias'!$H$19:$I$20,2,FALSE),\"\")","v":""},null,{"$f":"IF(AL74<>\"\",VLOOKUP(AL74,'Otras referencias'!$H$19:$I$20,2,FALSE),\"\")","v":""}]
[null,{"$f":"IF(C75=\"\",\"\",IF(COUNTIF($C$3:C75, C75)>1, \"\", C75))","v":""},{"$f":"IF(J75=\"\",\"\",CONCATENATE(DIGITADOR!$M$1,J75,E75))","v":""},"",{"$f":"IF(H75=\"\",\"\",VLOOKUP(H75,'Otras referencias'!$A$24:$E$48,2,FALSE))","v":""},null,null,null,{"$f":"IF(H75=\"\",\"\",VLOOKUP(H75,'Otras referencias'!$A$24:$E$48,5,FALSE))","v":""},null,null,null,null,null,null,"",{"$f":"IF(AND(P75<>\"\",O75<>\"\"),IF(N75=\"A\",VLOOKUP(P75,'Otras referencias'!$J$24:$K$35,2,FALSE),IF(N75=\"B\",VLOOKUP(P75,'Otras referencias'!$N$24:$O$35,2,),IF(N75=\"C\",VLOOKUP(P75,'Otras referencias'!$R$24:$S$35,2,FALSE)))),\"\")","v":""},{"$f":"IF(S75=\"\",\"\",INDEX(referentes!$G$2:$H$5,MATCH(S75,referentes!$H$2:$H$5,0),1))","v":""},null,null,{"$f":"IF(T75=\"\",\"\",VLOOKUP(T75,referentes!$Q$2:$X$209,2,FALSE))","v":""},null,null,null,null,"",null,null,null,"",null,null,{"$f":"IF(AF75<>\"\",VLOOKUP(AF75,'Otras referencias'!$H$19:$I$20,2,FALSE),\"\")","v":""},null,{"$f":"IF(AH75<>\"\",VLOOKUP(AH75,'Otras referencias'!$H$19:$I$20,2,FALSE),\"\")","v":""},null,{"$f":"IF(AJ75<>\"\",VLOOKUP(AJ75,'Otras referencias'!$H$19:$I$20,2,FALSE),\"\")","v":""},null,{"$f":"IF(AL75<>\"\",VLOOKUP(AL75,'Otras referencias'!$H$19:$I$20,2,FALSE),\"\")","v":""}]
[null,{"$f":"IF(C76=\"\",\"\",IF(COUNTIF($C$3:C76, C76)>1, \"\", C76))","v":""},{"$f":"IF(J76=\"\",\"\",CONCATENATE(DIGITADOR!$M$1,J76,E76))","v":""},"",{"$f":"IF(H76=\"\",\"\",VLOOKUP(H76,'Otras referencias'!$A$24:$E$48,2,FALSE))","v":""},null,null,null,{"$f":"IF(H76=\"\",\"\",VLOOKUP(H76,'Otras referencias'!$A$24:$E$48,5,FALSE))","v":""},null,null,null,null,null,null,"",{"$f":"IF(AND(P76<>\"\",O76<>\"\"),IF(N76=\"A\",VLOOKUP(P76,'Otras referencias'!$J$24:$K$35,2,FALSE),IF(N76=\"B\",VLOOKUP(P76,'Otras referencias'!$N$24:$O$35,2,),IF(N76=\"C\",VLOOKUP(P76,'Otras referencias'!$R$24:$S$35,2,FALSE)))),\"\")","v":""},{"$f":"IF(S76=\"\",\"\",INDEX(referentes!$G$2:$H$5,MATCH(S76,referentes!$H$2:$H$5,0),1))","v":""},null,null,{"$f":"IF(T76=\"\",\"\",VLOOKUP(T76,referentes!$Q$2:$X$209,2,FALSE))","v":""},null,null,null,null,"",null,null,null,"",null,null,{"$f":"IF(AF76<>\"\",VLOOKUP(AF76,'Otras referencias'!$H$19:$I$20,2,FALSE),\"\")","v":""},null,{"$f":"IF(AH76<>\"\",VLOOKUP(AH76,'Otras referencias'!$H$19:$I$20,2,FALSE),\"\")","v":""},null,{"$f":"IF(AJ76<>\"\",VLOOKUP(AJ76,'Otras referencias'!$H$19:$I$20,2,FALSE),\"\")","v":""},null,{"$f":"IF(AL76<>\"\",VLOOKUP(AL76,'Otras referencias'!$H$19:$I$20,2,FALSE),\"\")","v":""}]
[null,{"$f":"IF(C77=\"\",\"\",IF(COUNTIF($C$3:C77, C77)>1, \"\", C77))","v":""},{"$f":"IF(J77=\"\",\"\",CONCATENATE(DIGITADOR!$M$1,J77,E77))","v":""},"",{"$f":"IF(H77=\"\",\"\",VLOOKUP(H77,'Otras referencias'!$A$24:$E$48,2,FALSE))","v":""},null,null,null,{"$f":"IF(H77=\"\",\"\",VLOOKUP(H77,'Otras referencias'!$A$24:$E$48,5,FALSE))","v":""},null,null,null,null,null,null,"",{"$f":"IF(AND(P77<>\"\",O77<>\"\"),IF(N77=\"A\",VLOOKUP(P77,'Otras referencias'!$J$24:$K$35,2,FALSE),IF(N77=\"B\",VLOOKUP(P77,'Otras referencias'!$N$24:$O$35,2,),IF(N77=\"C\",VLOOKUP(P77,'Otras referencias'!$R$24:$S$35,2,FALSE)))),\"\")","v":""},{"$f":"IF(S77=\"\",\"\",INDEX(referentes!$G$2:$H$5,MATCH(S77,referentes!$H$2:$H$5,0),1))","v":""},null,null,{"$f":"IF(T77=\"\",\"\",VLOOKUP(T77,referentes!$Q$2:$X$209,2,FALSE))","v":""},null,null,null,null,"",null,null,null,"",null,null,{"$f":"IF(AF77<>\"\",VLOOKUP(AF77,'Otras referencias'!$H$19:$I$20,2,FALSE),\"\")","v":""},null,{"$f":"IF(AH77<>\"\",VLOOKUP(AH77,'Otras referencias'!$H$19:$I$20,2,FALSE),\"\")","v":""},null,{"$f":"IF(AJ77<>\"\",VLOOKUP(AJ77,'Otras referencias'!$H$19:$I$20,2,FALSE),\"\")","v":""},null,{"$f":"IF(AL77<>\"\",VLOOKUP(AL77,'Otras referencias'!$H$19:$I$20,2,FALSE),\"\")","v":""}]
[null,{"$f":"IF(C78=\"\",\"\",IF(COUNTIF($C$3:C78, C78)>1, \"\", C78))","v":""},{"$f":"IF(J78=\"\",\"\",CONCATENATE(DIGITADOR!$M$1,J78,E78))","v":""},"",{"$f":"IF(H78=\"\",\"\",VLOOKUP(H78,'Otras referencias'!$A$24:$E$48,2,FALSE))","v":""},null,null,null,{"$f":"IF(H78=\"\",\"\",VLOOKUP(H78,'Otras referencias'!$A$24:$E$48,5,FALSE))","v":""},null,null,null,null,null,null,"",{"$f":"IF(AND(P78<>\"\",O78<>\"\"),IF(N78=\"A\",VLOOKUP(P78,'Otras referencias'!$J$24:$K$35,2,FALSE),IF(N78=\"B\",VLOOKUP(P78,'Otras referencias'!$N$24:$O$35,2,),IF(N78=\"C\",VLOOKUP(P78,'Otras referencias'!$R$24:$S$35,2,FALSE)))),\"\")","v":""},{"$f":"IF(S78=\"\",\"\",INDEX(referentes!$G$2:$H$5,MATCH(S78,referentes!$H$2:$H$5,0),1))","v":""},null,null,{"$f":"IF(T78=\"\",\"\",VLOOKUP(T78,referentes!$Q$2:$X$209,2,FALSE))","v":""},null,null,null,null,"",null,null,null,"",null,null,{"$f":"IF(AF78<>\"\",VLOOKUP(AF78,'Otras referencias'!$H$19:$I$20,2,FALSE),\"\")","v":""},null,{"$f":"IF(AH78<>\"\",VLOOKUP(AH78,'Otras referencias'!$H$19:$I$20,2,FALSE),\"\")","v":""},null,{"$f":"IF(AJ78<>\"\",VLOOKUP(AJ78,'Otras referencias'!$H$19:$I$20,2,FALSE),\"\")","v":""},null,{"$f":"IF(AL78<>\"\",VLOOKUP(AL78,'Otras referencias'!$H$19:$I$20,2,FALSE),\"\")","v":""}]
[null,{"$f":"IF(C79=\"\",\"\",IF(COUNTIF($C$3:C79, C79)>1, \"\", C79))","v":""},{"$f":"IF(J79=\"\",\"\",CONCATENATE(DIGITADOR!$M$1,J79,E79))","v":""},"",{"$f":"IF(H79=\"\",\"\",VLOOKUP(H79,'Otras referencias'!$A$24:$E$48,2,FALSE))","v":""},null,null,null,{"$f":"IF(H79=\"\",\"\",VLOOKUP(H79,'Otras referencias'!$A$24:$E$48,5,FALSE))","v":""},null,null,null,null,null,null,"",{"$f":"IF(AND(P79<>\"\",O79<>\"\"),IF(N79=\"A\",VLOOKUP(P79,'Otras referencias'!$J$24:$K$35,2,FALSE),IF(N79=\"B\",VLOOKUP(P79,'Otras referencias'!$N$24:$O$35,2,),IF(N79=\"C\",VLOOKUP(P79,'Otras referencias'!$R$24:$S$35,2,FALSE)))),\"\")","v":""},{"$f":"IF(S79=\"\",\"\",INDEX(referentes!$G$2:$H$5,MATCH(S79,referentes!$H$2:$H$5,0),1))","v":""},null,null,{"$f":"IF(T79=\"\",\"\",VLOOKUP(T79,referentes!$Q$2:$X$209,2,FALSE))","v":""},null,null,null,null,"",null,null,null,"",null,null,{"$f":"IF(AF79<>\"\",VLOOKUP(AF79,'Otras referencias'!$H$19:$I$20,2,FALSE),\"\")","v":""},null,{"$f":"IF(AH79<>\"\",VLOOKUP(AH79,'Otras referencias'!$H$19:$I$20,2,FALSE),\"\")","v":""},null,{"$f":"IF(AJ79<>\"\",VLOOKUP(AJ79,'Otras referencias'!$H$19:$I$20,2,FALSE),\"\")","v":""},null,{"$f":"IF(AL79<>\"\",VLOOKUP(AL79,'Otras referencias'!$H$19:$I$20,2,FALSE),\"\")","v":""}]
[null,{"$f":"IF(C80=\"\",\"\",IF(COUNTIF($C$3:C80, C80)>1, \"\", C80))","v":""},{"$f":"IF(J80=\"\",\"\",CONCATENATE(DIGITADOR!$M$1,J80,E80))","v":""},"",{"$f":"IF(H80=\"\",\"\",VLOOKUP(H80,'Otras referencias'!$A$24:$E$48,2,FALSE))","v":""},null,null,null,{"$f":"IF(H80=\"\",\"\",VLOOKUP(H80,'Otras referencias'!$A$24:$E$48,5,FALSE))","v":""},null,null,null,null,null,null,"",{"$f":"IF(AND(P80<>\"\",O80<>\"\"),IF(N80=\"A\",VLOOKUP(P80,'Otras referencias'!$J$24:$K$35,2,FALSE),IF(N80=\"B\",VLOOKUP(P80,'Otras referencias'!$N$24:$O$35,2,),IF(N80=\"C\",VLOOKUP(P80,'Otras referencias'!$R$24:$S$35,2,FALSE)))),\"\")","v":""},{"$f":"IF(S80=\"\",\"\",INDEX(referentes!$G$2:$H$5,MATCH(S80,referentes!$H$2:$H$5,0),1))","v":""},null,null,{"$f":"IF(T80=\"\",\"\",VLOOKUP(T80,referentes!$Q$2:$X$209,2,FALSE))","v":""},null,null,null,null,"",null,null,null,"",null,null,{"$f":"IF(AF80<>\"\",VLOOKUP(AF80,'Otras referencias'!$H$19:$I$20,2,FALSE),\"\")","v":""},null,{"$f":"IF(AH80<>\"\",VLOOKUP(AH80,'Otras referencias'!$H$19:$I$20,2,FALSE),\"\")","v":""},null,{"$f":"IF(AJ80<>\"\",VLOOKUP(AJ80,'Otras referencias'!$H$19:$I$20,2,FALSE),\"\")","v":""},null,{"$f":"IF(AL80<>\"\",VLOOKUP(AL80,'Otras referencias'!$H$19:$I$20,2,FALSE),\"\")","v":""}]
[null,{"$f":"IF(C81=\"\",\"\",IF(COUNTIF($C$3:C81, C81)>1, \"\", C81))","v":""},{"$f":"IF(J81=\"\",\"\",CONCATENATE(DIGITADOR!$M$1,J81,E81))","v":""},"",{"$f":"IF(H81=\"\",\"\",VLOOKUP(H81,'Otras referencias'!$A$24:$E$48,2,FALSE))","v":""},null,null,null,{"$f":"IF(H81=\"\",\"\",VLOOKUP(H81,'Otras referencias'!$A$24:$E$48,5,FALSE))","v":""},null,null,null,null,null,null,"",{"$f":"IF(AND(P81<>\"\",O81<>\"\"),IF(N81=\"A\",VLOOKUP(P81,'Otras referencias'!$J$24:$K$35,2,FALSE),IF(N81=\"B\",VLOOKUP(P81,'Otras referencias'!$N$24:$O$35,2,),IF(N81=\"C\",VLOOKUP(P81,'Otras referencias'!$R$24:$S$35,2,FALSE)))),\"\")","v":""},{"$f":"IF(S81=\"\",\"\",INDEX(referentes!$G$2:$H$5,MATCH(S81,referentes!$H$2:$H$5,0),1))","v":""},null,null,{"$f":"IF(T81=\"\",\"\",VLOOKUP(T81,referentes!$Q$2:$X$209,2,FALSE))","v":""},null,null,null,null,"",null,null,null,"",null,null,{"$f":"IF(AF81<>\"\",VLOOKUP(AF81,'Otras referencias'!$H$19:$I$20,2,FALSE),\"\")","v":""},null,{"$f":"IF(AH81<>\"\",VLOOKUP(AH81,'Otras referencias'!$H$19:$I$20,2,FALSE),\"\")","v":""},null,{"$f":"IF(AJ81<>\"\",VLOOKUP(AJ81,'Otras referencias'!$H$19:$I$20,2,FALSE),\"\")","v":""},null,{"$f":"IF(AL81<>\"\",VLOOKUP(AL81,'Otras referencias'!$H$19:$I$20,2,FALSE),\"\")","v":""}]
[null,{"$f":"IF(C82=\"\",\"\",IF(COUNTIF($C$3:C82, C82)>1, \"\", C82))","v":""},{"$f":"IF(J82=\"\",\"\",CONCATENATE(DIGITADOR!$M$1,J82,E82))","v":""},"",{"$f":"IF(H82=\"\",\"\",VLOOKUP(H82,'Otras referencias'!$A$24:$E$48,2,FALSE))","v":""},null,null,null,{"$f":"IF(H82=\"\",\"\",VLOOKUP(H82,'Otras referencias'!$A$24:$E$48,5,FALSE))","v":""},null,null,null,null,null,null,"",{"$f":"IF(AND(P82<>\"\",O82<>\"\"),IF(N82=\"A\",VLOOKUP(P82,'Otras referencias'!$J$24:$K$35,2,FALSE),IF(N82=\"B\",VLOOKUP(P82,'Otras referencias'!$N$24:$O$35,2,),IF(N82=\"C\",VLOOKUP(P82,'Otras referencias'!$R$24:$S$35,2,FALSE)))),\"\")","v":""},{"$f":"IF(S82=\"\",\"\",INDEX(referentes!$G$2:$H$5,MATCH(S82,referentes!$H$2:$H$5,0),1))","v":""},null,null,{"$f":"IF(T82=\"\",\"\",VLOOKUP(T82,referentes!$Q$2:$X$209,2,FALSE))","v":""},null,null,null,null,"",null,null,null,"",null,null,{"$f":"IF(AF82<>\"\",VLOOKUP(AF82,'Otras referencias'!$H$19:$I$20,2,FALSE),\"\")","v":""},null,{"$f":"IF(AH82<>\"\",VLOOKUP(AH82,'Otras referencias'!$H$19:$I$20,2,FALSE),\"\")","v":""},null,{"$f":"IF(AJ82<>\"\",VLOOKUP(AJ82,'Otras referencias'!$H$19:$I$20,2,FALSE),\"\")","v":""},null,{"$f":"IF(AL82<>\"\",VLOOKUP(AL82,'Otras referencias'!$H$19:$I$20,2,FALSE),\"\")","v":""}]
[null,{"$f":"IF(C83=\"\",\"\",IF(COUNTIF($C$3:C83, C83)>1, \"\", C83))","v":""},{"$f":"IF(J83=\"\",\"\",CONCATENATE(DIGITADOR!$M$1,J83,E83))","v":""},"",{"$f":"IF(H83=\"\",\"\",VLOOKUP(H83,'Otras referencias'!$A$24:$E$48,2,FALSE))","v":""},null,null,null,{"$f":"IF(H83=\"\",\"\",VLOOKUP(H83,'Otras referencias'!$A$24:$E$48,5,FALSE))","v":""},null,null,null,null,null,null,"",{"$f":"IF(AND(P83<>\"\",O83<>\"\"),IF(N83=\"A\",VLOOKUP(P83,'Otras referencias'!$J$24:$K$35,2,FALSE),IF(N83=\"B\",VLOOKUP(P83,'Otras referencias'!$N$24:$O$35,2,),IF(N83=\"C\",VLOOKUP(P83,'Otras referencias'!$R$24:$S$35,2,FALSE)))),\"\")","v":""},{"$f":"IF(S83=\"\",\"\",INDEX(referentes!$G$2:$H$5,MATCH(S83,referentes!$H$2:$H$5,0),1))","v":""},null,null,{"$f":"IF(T83=\"\",\"\",VLOOKUP(T83,referentes!$Q$2:$X$209,2,FALSE))","v":""},null,null,null,null,"",null,null,null,"",null,null,{"$f":"IF(AF83<>\"\",VLOOKUP(AF83,'Otras referencias'!$H$19:$I$20,2,FALSE),\"\")","v":""},null,{"$f":"IF(AH83<>\"\",VLOOKUP(AH83,'Otras referencias'!$H$19:$I$20,2,FALSE),\"\")","v":""},null,{"$f":"IF(AJ83<>\"\",VLOOKUP(AJ83,'Otras referencias'!$H$19:$I$20,2,FALSE),\"\")","v":""},null,{"$f":"IF(AL83<>\"\",VLOOKUP(AL83,'Otras referencias'!$H$19:$I$20,2,FALSE),\"\")","v":""}]
[null,{"$f":"IF(C84=\"\",\"\",IF(COUNTIF($C$3:C84, C84)>1, \"\", C84))","v":""},{"$f":"IF(J84=\"\",\"\",CONCATENATE(DIGITADOR!$M$1,J84,E84))","v":""},"",{"$f":"IF(H84=\"\",\"\",VLOOKUP(H84,'Otras referencias'!$A$24:$E$48,2,FALSE))","v":""},null,null,null,{"$f":"IF(H84=\"\",\"\",VLOOKUP(H84,'Otras referencias'!$A$24:$E$48,5,FALSE))","v":""},null,null,null,null,null,null,"",{"$f":"IF(AND(P84<>\"\",O84<>\"\"),IF(N84=\"A\",VLOOKUP(P84,'Otras referencias'!$J$24:$K$35,2,FALSE),IF(N84=\"B\",VLOOKUP(P84,'Otras referencias'!$N$24:$O$35,2,),IF(N84=\"C\",VLOOKUP(P84,'Otras referencias'!$R$24:$S$35,2,FALSE)))),\"\")","v":""},{"$f":"IF(S84=\"\",\"\",INDEX(referentes!$G$2:$H$5,MATCH(S84,referentes!$H$2:$H$5,0),1))","v":""},null,null,{"$f":"IF(T84=\"\",\"\",VLOOKUP(T84,referentes!$Q$2:$X$209,2,FALSE))","v":""},null,null,null,null,"",null,null,null,"",null,null,{"$f":"IF(AF84<>\"\",VLOOKUP(AF84,'Otras referencias'!$H$19:$I$20,2,FALSE),\"\")","v":""},null,{"$f":"IF(AH84<>\"\",VLOOKUP(AH84,'Otras referencias'!$H$19:$I$20,2,FALSE),\"\")","v":""},null,{"$f":"IF(AJ84<>\"\",VLOOKUP(AJ84,'Otras referencias'!$H$19:$I$20,2,FALSE),\"\")","v":""},null,{"$f":"IF(AL84<>\"\",VLOOKUP(AL84,'Otras referencias'!$H$19:$I$20,2,FALSE),\"\")","v":""}]
[null,{"$f":"IF(C85=\"\",\"\",IF(COUNTIF($C$3:C85, C85)>1, \"\", C85))","v":""},{"$f":"IF(J85=\"\",\"\",CONCATENATE(DIGITADOR!$M$1,J85,E85))","v":""},"",{"$f":"IF(H85=\"\",\"\",VLOOKUP(H85,'Otras referencias'!$A$24:$E$48,2,FALSE))","v":""},null,null,null,{"$f":"IF(H85=\"\",\"\",VLOOKUP(H85,'Otras referencias'!$A$24:$E$48,5,FALSE))","v":""},null,null,null,null,null,null,"",{"$f":"IF(AND(P85<>\"\",O85<>\"\"),IF(N85=\"A\",VLOOKUP(P85,'Otras referencias'!$J$24:$K$35,2,FALSE),IF(N85=\"B\",VLOOKUP(P85,'Otras referencias'!$N$24:$O$35,2,),IF(N85=\"C\",VLOOKUP(P85,'Otras referencias'!$R$24:$S$35,2,FALSE)))),\"\")","v":""},{"$f":"IF(S85=\"\",\"\",INDEX(referentes!$G$2:$H$5,MATCH(S85,referentes!$H$2:$H$5,0),1))","v":""},null,null,{"$f":"IF(T85=\"\",\"\",VLOOKUP(T85,referentes!$Q$2:$X$209,2,FALSE))","v":""},null,null,null,null,"",null,null,null,"",null,null,{"$f":"IF(AF85<>\"\",VLOOKUP(AF85,'Otras referencias'!$H$19:$I$20,2,FALSE),\"\")","v":""},null,{"$f":"IF(AH85<>\"\",VLOOKUP(AH85,'Otras referencias'!$H$19:$I$20,2,FALSE),\"\")","v":""},null,{"$f":"IF(AJ85<>\"\",VLOOKUP(AJ85,'Otras referencias'!$H$19:$I$20,2,FALSE),\"\")","v":""},null,{"$f":"IF(AL85<>\"\",VLOOKUP(AL85,'Otras referencias'!$H$19:$I$20,2,FALSE),\"\")","v":""}]
[null,{"$f":"IF(C86=\"\",\"\",IF(COUNTIF($C$3:C86, C86)>1, \"\", C86))","v":""},{"$f":"IF(J86=\"\",\"\",CONCATENATE(DIGITADOR!$M$1,J86,E86))","v":""},"",{"$f":"IF(H86=\"\",\"\",VLOOKUP(H86,'Otras referencias'!$A$24:$E$48,2,FALSE))","v":""},null,null,null,{"$f":"IF(H86=\"\",\"\",VLOOKUP(H86,'Otras referencias'!$A$24:$E$48,5,FALSE))","v":""},null,null,null,null,null,null,"",{"$f":"IF(AND(P86<>\"\",O86<>\"\"),IF(N86=\"A\",VLOOKUP(P86,'Otras referencias'!$J$24:$K$35,2,FALSE),IF(N86=\"B\",VLOOKUP(P86,'Otras referencias'!$N$24:$O$35,2,),IF(N86=\"C\",VLOOKUP(P86,'Otras referencias'!$R$24:$S$35,2,FALSE)))),\"\")","v":""},{"$f":"IF(S86=\"\",\"\",INDEX(referentes!$G$2:$H$5,MATCH(S86,referentes!$H$2:$H$5,0),1))","v":""},null,null,{"$f":"IF(T86=\"\",\"\",VLOOKUP(T86,referentes!$Q$2:$X$209,2,FALSE))","v":""},null,null,null,null,"",null,null,null,"",null,null,{"$f":"IF(AF86<>\"\",VLOOKUP(AF86,'Otras referencias'!$H$19:$I$20,2,FALSE),\"\")","v":""},null,{"$f":"IF(AH86<>\"\",VLOOKUP(AH86,'Otras referencias'!$H$19:$I$20,2,FALSE),\"\")","v":""},null,{"$f":"IF(AJ86<>\"\",VLOOKUP(AJ86,'Otras referencias'!$H$19:$I$20,2,FALSE),\"\")","v":""},null,{"$f":"IF(AL86<>\"\",VLOOKUP(AL86,'Otras referencias'!$H$19:$I$20,2,FALSE),\"\")","v":""}]
[null,{"$f":"IF(C87=\"\",\"\",IF(COUNTIF($C$3:C87, C87)>1, \"\", C87))","v":""},{"$f":"IF(J87=\"\",\"\",CONCATENATE(DIGITADOR!$M$1,J87,E87))","v":""},"",{"$f":"IF(H87=\"\",\"\",VLOOKUP(H87,'Otras referencias'!$A$24:$E$48,2,FALSE))","v":""},null,null,null,{"$f":"IF(H87=\"\",\"\",VLOOKUP(H87,'Otras referencias'!$A$24:$E$48,5,FALSE))","v":""},null,null,null,null,null,null,"",{"$f":"IF(AND(P87<>\"\",O87<>\"\"),IF(N87=\"A\",VLOOKUP(P87,'Otras referencias'!$J$24:$K$35,2,FALSE),IF(N87=\"B\",VLOOKUP(P87,'Otras referencias'!$N$24:$O$35,2,),IF(N87=\"C\",VLOOKUP(P87,'Otras referencias'!$R$24:$S$35,2,FALSE)))),\"\")","v":""},{"$f":"IF(S87=\"\",\"\",INDEX(referentes!$G$2:$H$5,MATCH(S87,referentes!$H$2:$H$5,0),1))","v":""},null,null,{"$f":"IF(T87=\"\",\"\",VLOOKUP(T87,referentes!$Q$2:$X$209,2,FALSE))","v":""},null,null,null,null,"",null,null,null,"",null,null,{"$f":"IF(AF87<>\"\",VLOOKUP(AF87,'Otras referencias'!$H$19:$I$20,2,FALSE),\"\")","v":""},null,{"$f":"IF(AH87<>\"\",VLOOKUP(AH87,'Otras referencias'!$H$19:$I$20,2,FALSE),\"\")","v":""},null,{"$f":"IF(AJ87<>\"\",VLOOKUP(AJ87,'Otras referencias'!$H$19:$I$20,2,FALSE),\"\")","v":""},null,{"$f":"IF(AL87<>\"\",VLOOKUP(AL87,'Otras referencias'!$H$19:$I$20,2,FALSE),\"\")","v":""}]
[null,{"$f":"IF(C88=\"\",\"\",IF(COUNTIF($C$3:C88, C88)>1, \"\", C88))","v":""},{"$f":"IF(J88=\"\",\"\",CONCATENATE(DIGITADOR!$M$1,J88,E88))","v":""},"",{"$f":"IF(H88=\"\",\"\",VLOOKUP(H88,'Otras referencias'!$A$24:$E$48,2,FALSE))","v":""},null,null,null,{"$f":"IF(H88=\"\",\"\",VLOOKUP(H88,'Otras referencias'!$A$24:$E$48,5,FALSE))","v":""},null,null,null,null,null,null,"",{"$f":"IF(AND(P88<>\"\",O88<>\"\"),IF(N88=\"A\",VLOOKUP(P88,'Otras referencias'!$J$24:$K$35,2,FALSE),IF(N88=\"B\",VLOOKUP(P88,'Otras referencias'!$N$24:$O$35,2,),IF(N88=\"C\",VLOOKUP(P88,'Otras referencias'!$R$24:$S$35,2,FALSE)))),\"\")","v":""},{"$f":"IF(S88=\"\",\"\",INDEX(referentes!$G$2:$H$5,MATCH(S88,referentes!$H$2:$H$5,0),1))","v":""},null,null,{"$f":"IF(T88=\"\",\"\",VLOOKUP(T88,referentes!$Q$2:$X$209,2,FALSE))","v":""},null,null,null,null,"",null,null,null,"",null,null,{"$f":"IF(AF88<>\"\",VLOOKUP(AF88,'Otras referencias'!$H$19:$I$20,2,FALSE),\"\")","v":""},null,{"$f":"IF(AH88<>\"\",VLOOKUP(AH88,'Otras referencias'!$H$19:$I$20,2,FALSE),\"\")","v":""},null,{"$f":"IF(AJ88<>\"\",VLOOKUP(AJ88,'Otras referencias'!$H$19:$I$20,2,FALSE),\"\")","v":""},null,{"$f":"IF(AL88<>\"\",VLOOKUP(AL88,'Otras referencias'!$H$19:$I$20,2,FALSE),\"\")","v":""}]
[null,{"$f":"IF(C89=\"\",\"\",IF(COUNTIF($C$3:C89, C89)>1, \"\", C89))","v":""},{"$f":"IF(J89=\"\",\"\",CONCATENATE(DIGITADOR!$M$1,J89,E89))","v":""},"",{"$f":"IF(H89=\"\",\"\",VLOOKUP(H89,'Otras referencias'!$A$24:$E$48,2,FALSE))","v":""},null,null,null,{"$f":"IF(H89=\"\",\"\",VLOOKUP(H89,'Otras referencias'!$A$24:$E$48,5,FALSE))","v":""},null,null,null,null,null,null,"",{"$f":"IF(AND(P89<>\"\",O89<>\"\"),IF(N89=\"A\",VLOOKUP(P89,'Otras referencias'!$J$24:$K$35,2,FALSE),IF(N89=\"B\",VLOOKUP(P89,'Otras referencias'!$N$24:$O$35,2,),IF(N89=\"C\",VLOOKUP(P89,'Otras referencias'!$R$24:$S$35,2,FALSE)))),\"\")","v":""},{"$f":"IF(S89=\"\",\"\",INDEX(referentes!$G$2:$H$5,MATCH(S89,referentes!$H$2:$H$5,0),1))","v":""},null,null,{"$f":"IF(T89=\"\",\"\",VLOOKUP(T89,referentes!$Q$2:$X$209,2,FALSE))","v":""},null,null,null,null,"",null,null,null,"",null,null,{"$f":"IF(AF89<>\"\",VLOOKUP(AF89,'Otras referencias'!$H$19:$I$20,2,FALSE),\"\")","v":""},null,{"$f":"IF(AH89<>\"\",VLOOKUP(AH89,'Otras referencias'!$H$19:$I$20,2,FALSE),\"\")","v":""},null,{"$f":"IF(AJ89<>\"\",VLOOKUP(AJ89,'Otras referencias'!$H$19:$I$20,2,FALSE),\"\")","v":""},null,{"$f":"IF(AL89<>\"\",VLOOKUP(AL89,'Otras referencias'!$H$19:$I$20,2,FALSE),\"\")","v":""}]
[null,{"$f":"IF(C90=\"\",\"\",IF(COUNTIF($C$3:C90, C90)>1, \"\", C90))","v":""},{"$f":"IF(J90=\"\",\"\",CONCATENATE(DIGITADOR!$M$1,J90,E90))","v":""},"",{"$f":"IF(H90=\"\",\"\",VLOOKUP(H90,'Otras referencias'!$A$24:$E$48,2,FALSE))","v":""},null,null,null,{"$f":"IF(H90=\"\",\"\",VLOOKUP(H90,'Otras referencias'!$A$24:$E$48,5,FALSE))","v":""},null,null,null,null,null,null,"",{"$f":"IF(AND(P90<>\"\",O90<>\"\"),IF(N90=\"A\",VLOOKUP(P90,'Otras referencias'!$J$24:$K$35,2,FALSE),IF(N90=\"B\",VLOOKUP(P90,'Otras referencias'!$N$24:$O$35,2,),IF(N90=\"C\",VLOOKUP(P90,'Otras referencias'!$R$24:$S$35,2,FALSE)))),\"\")","v":""},{"$f":"IF(S90=\"\",\"\",INDEX(referentes!$G$2:$H$5,MATCH(S90,referentes!$H$2:$H$5,0),1))","v":""},null,null,{"$f":"IF(T90=\"\",\"\",VLOOKUP(T90,referentes!$Q$2:$X$209,2,FALSE))","v":""},null,null,null,null,"",null,null,null,"",null,null,{"$f":"IF(AF90<>\"\",VLOOKUP(AF90,'Otras referencias'!$H$19:$I$20,2,FALSE),\"\")","v":""},null,{"$f":"IF(AH90<>\"\",VLOOKUP(AH90,'Otras referencias'!$H$19:$I$20,2,FALSE),\"\")","v":""},null,{"$f":"IF(AJ90<>\"\",VLOOKUP(AJ90,'Otras referencias'!$H$19:$I$20,2,FALSE),\"\")","v":""},null,{"$f":"IF(AL90<>\"\",VLOOKUP(AL90,'Otras referencias'!$H$19:$I$20,2,FALSE),\"\")","v":""}]
[null,{"$f":"IF(C91=\"\",\"\",IF(COUNTIF($C$3:C91, C91)>1, \"\", C91))","v":""},{"$f":"IF(J91=\"\",\"\",CONCATENATE(DIGITADOR!$M$1,J91,E91))","v":""},"",{"$f":"IF(H91=\"\",\"\",VLOOKUP(H91,'Otras referencias'!$A$24:$E$48,2,FALSE))","v":""},null,null,null,{"$f":"IF(H91=\"\",\"\",VLOOKUP(H91,'Otras referencias'!$A$24:$E$48,5,FALSE))","v":""},null,null,null,null,null,null,"",{"$f":"IF(AND(P91<>\"\",O91<>\"\"),IF(N91=\"A\",VLOOKUP(P91,'Otras referencias'!$J$24:$K$35,2,FALSE),IF(N91=\"B\",VLOOKUP(P91,'Otras referencias'!$N$24:$O$35,2,),IF(N91=\"C\",VLOOKUP(P91,'Otras referencias'!$R$24:$S$35,2,FALSE)))),\"\")","v":""},{"$f":"IF(S91=\"\",\"\",INDEX(referentes!$G$2:$H$5,MATCH(S91,referentes!$H$2:$H$5,0),1))","v":""},null,null,{"$f":"IF(T91=\"\",\"\",VLOOKUP(T91,referentes!$Q$2:$X$209,2,FALSE))","v":""},null,null,null,null,"",null,null,null,"",null,null,{"$f":"IF(AF91<>\"\",VLOOKUP(AF91,'Otras referencias'!$H$19:$I$20,2,FALSE),\"\")","v":""},null,{"$f":"IF(AH91<>\"\",VLOOKUP(AH91,'Otras referencias'!$H$19:$I$20,2,FALSE),\"\")","v":""},null,{"$f":"IF(AJ91<>\"\",VLOOKUP(AJ91,'Otras referencias'!$H$19:$I$20,2,FALSE),\"\")","v":""},null,{"$f":"IF(AL91<>\"\",VLOOKUP(AL91,'Otras referencias'!$H$19:$I$20,2,FALSE),\"\")","v":""}]
[null,{"$f":"IF(C92=\"\",\"\",IF(COUNTIF($C$3:C92, C92)>1, \"\", C92))","v":""},{"$f":"IF(J92=\"\",\"\",CONCATENATE(DIGITADOR!$M$1,J92,E92))","v":""},"",{"$f":"IF(H92=\"\",\"\",VLOOKUP(H92,'Otras referencias'!$A$24:$E$48,2,FALSE))","v":""},null,null,null,{"$f":"IF(H92=\"\",\"\",VLOOKUP(H92,'Otras referencias'!$A$24:$E$48,5,FALSE))","v":""},null,null,null,null,null,null,"",{"$f":"IF(AND(P92<>\"\",O92<>\"\"),IF(N92=\"A\",VLOOKUP(P92,'Otras referencias'!$J$24:$K$35,2,FALSE),IF(N92=\"B\",VLOOKUP(P92,'Otras referencias'!$N$24:$O$35,2,),IF(N92=\"C\",VLOOKUP(P92,'Otras referencias'!$R$24:$S$35,2,FALSE)))),\"\")","v":""},{"$f":"IF(S92=\"\",\"\",INDEX(referentes!$G$2:$H$5,MATCH(S92,referentes!$H$2:$H$5,0),1))","v":""},null,null,{"$f":"IF(T92=\"\",\"\",VLOOKUP(T92,referentes!$Q$2:$X$209,2,FALSE))","v":""},null,null,null,null,"",null,null,null,"",null,null,{"$f":"IF(AF92<>\"\",VLOOKUP(AF92,'Otras referencias'!$H$19:$I$20,2,FALSE),\"\")","v":""},null,{"$f":"IF(AH92<>\"\",VLOOKUP(AH92,'Otras referencias'!$H$19:$I$20,2,FALSE),\"\")","v":""},null,{"$f":"IF(AJ92<>\"\",VLOOKUP(AJ92,'Otras referencias'!$H$19:$I$20,2,FALSE),\"\")","v":""},null,{"$f":"IF(AL92<>\"\",VLOOKUP(AL92,'Otras referencias'!$H$19:$I$20,2,FALSE),\"\")","v":""}]
[null,{"$f":"IF(C93=\"\",\"\",IF(COUNTIF($C$3:C93, C93)>1, \"\", C93))","v":""},{"$f":"IF(J93=\"\",\"\",CONCATENATE(DIGITADOR!$M$1,J93,E93))","v":""},"",{"$f":"IF(H93=\"\",\"\",VLOOKUP(H93,'Otras referencias'!$A$24:$E$48,2,FALSE))","v":""},null,null,null,{"$f":"IF(H93=\"\",\"\",VLOOKUP(H93,'Otras referencias'!$A$24:$E$48,5,FALSE))","v":""},null,null,null,null,null,null,"",{"$f":"IF(AND(P93<>\"\",O93<>\"\"),IF(N93=\"A\",VLOOKUP(P93,'Otras referencias'!$J$24:$K$35,2,FALSE),IF(N93=\"B\",VLOOKUP(P93,'Otras referencias'!$N$24:$O$35,2,),IF(N93=\"C\",VLOOKUP(P93,'Otras referencias'!$R$24:$S$35,2,FALSE)))),\"\")","v":""},{"$f":"IF(S93=\"\",\"\",INDEX(referentes!$G$2:$H$5,MATCH(S93,referentes!$H$2:$H$5,0),1))","v":""},null,null,{"$f":"IF(T93=\"\",\"\",VLOOKUP(T93,referentes!$Q$2:$X$209,2,FALSE))","v":""},null,null,null,null,"",null,null,null,"",null,null,{"$f":"IF(AF93<>\"\",VLOOKUP(AF93,'Otras referencias'!$H$19:$I$20,2,FALSE),\"\")","v":""},null,{"$f":"IF(AH93<>\"\",VLOOKUP(AH93,'Otras referencias'!$H$19:$I$20,2,FALSE),\"\")","v":""},null,{"$f":"IF(AJ93<>\"\",VLOOKUP(AJ93,'Otras referencias'!$H$19:$I$20,2,FALSE),\"\")","v":""},null,{"$f":"IF(AL93<>\"\",VLOOKUP(AL93,'Otras referencias'!$H$19:$I$20,2,FALSE),\"\")","v":""}]
[null,{"$f":"IF(C94=\"\",\"\",IF(COUNTIF($C$3:C94, C94)>1, \"\", C94))","v":""},{"$f":"IF(J94=\"\",\"\",CONCATENATE(DIGITADOR!$M$1,J94,E94))","v":""},"",{"$f":"IF(H94=\"\",\"\",VLOOKUP(H94,'Otras referencias'!$A$24:$E$48,2,FALSE))","v":""},null,null,null,{"$f":"IF(H94=\"\",\"\",VLOOKUP(H94,'Otras referencias'!$A$24:$E$48,5,FALSE))","v":""},null,null,null,null,null,null,"",{"$f":"IF(AND(P94<>\"\",O94<>\"\"),IF(N94=\"A\",VLOOKUP(P94,'Otras referencias'!$J$24:$K$35,2,FALSE),IF(N94=\"B\",VLOOKUP(P94,'Otras referencias'!$N$24:$O$35,2,),IF(N94=\"C\",VLOOKUP(P94,'Otras referencias'!$R$24:$S$35,2,FALSE)))),\"\")","v":""},{"$f":"IF(S94=\"\",\"\",INDEX(referentes!$G$2:$H$5,MATCH(S94,referentes!$H$2:$H$5,0),1))","v":""},null,null,{"$f":"IF(T94=\"\",\"\",VLOOKUP(T94,referentes!$Q$2:$X$209,2,FALSE))","v":""},null,null,null,null,"",null,null,null,"",null,null,{"$f":"IF(AF94<>\"\",VLOOKUP(AF94,'Otras referencias'!$H$19:$I$20,2,FALSE),\"\")","v":""},null,{"$f":"IF(AH94<>\"\",VLOOKUP(AH94,'Otras referencias'!$H$19:$I$20,2,FALSE),\"\")","v":""},null,{"$f":"IF(AJ94<>\"\",VLOOKUP(AJ94,'Otras referencias'!$H$19:$I$20,2,FALSE),\"\")","v":""},null,{"$f":"IF(AL94<>\"\",VLOOKUP(AL94,'Otras referencias'!$H$19:$I$20,2,FALSE),\"\")","v":""}]
[null,{"$f":"IF(C95=\"\",\"\",IF(COUNTIF($C$3:C95, C95)>1, \"\", C95))","v":""},{"$f":"IF(J95=\"\",\"\",CONCATENATE(DIGITADOR!$M$1,J95,E95))","v":""},"",{"$f":"IF(H95=\"\",\"\",VLOOKUP(H95,'Otras referencias'!$A$24:$E$48,2,FALSE))","v":""},null,null,null,{"$f":"IF(H95=\"\",\"\",VLOOKUP(H95,'Otras referencias'!$A$24:$E$48,5,FALSE))","v":""},null,null,null,null,null,null,"",{"$f":"IF(AND(P95<>\"\",O95<>\"\"),IF(N95=\"A\",VLOOKUP(P95,'Otras referencias'!$J$24:$K$35,2,FALSE),IF(N95=\"B\",VLOOKUP(P95,'Otras referencias'!$N$24:$O$35,2,),IF(N95=\"C\",VLOOKUP(P95,'Otras referencias'!$R$24:$S$35,2,FALSE)))),\"\")","v":""},{"$f":"IF(S95=\"\",\"\",INDEX(referentes!$G$2:$H$5,MATCH(S95,referentes!$H$2:$H$5,0),1))","v":""},null,null,{"$f":"IF(T95=\"\",\"\",VLOOKUP(T95,referentes!$Q$2:$X$209,2,FALSE))","v":""},null,null,null,null,"",null,null,null,"",null,null,{"$f":"IF(AF95<>\"\",VLOOKUP(AF95,'Otras referencias'!$H$19:$I$20,2,FALSE),\"\")","v":""},null,{"$f":"IF(AH95<>\"\",VLOOKUP(AH95,'Otras referencias'!$H$19:$I$20,2,FALSE),\"\")","v":""},null,{"$f":"IF(AJ95<>\"\",VLOOKUP(AJ95,'Otras referencias'!$H$19:$I$20,2,FALSE),\"\")","v":""},null,{"$f":"IF(AL95<>\"\",VLOOKUP(AL95,'Otras referencias'!$H$19:$I$20,2,FALSE),\"\")","v":""}]
[null,{"$f":"IF(C96=\"\",\"\",IF(COUNTIF($C$3:C96, C96)>1, \"\", C96))","v":""},{"$f":"IF(J96=\"\",\"\",CONCATENATE(DIGITADOR!$M$1,J96,E96))","v":""},"",{"$f":"IF(H96=\"\",\"\",VLOOKUP(H96,'Otras referencias'!$A$24:$E$48,2,FALSE))","v":""},null,null,null,{"$f":"IF(H96=\"\",\"\",VLOOKUP(H96,'Otras referencias'!$A$24:$E$48,5,FALSE))","v":""},null,null,null,null,null,null,"",{"$f":"IF(AND(P96<>\"\",O96<>\"\"),IF(N96=\"A\",VLOOKUP(P96,'Otras referencias'!$J$24:$K$35,2,FALSE),IF(N96=\"B\",VLOOKUP(P96,'Otras referencias'!$N$24:$O$35,2,),IF(N96=\"C\",VLOOKUP(P96,'Otras referencias'!$R$24:$S$35,2,FALSE)))),\"\")","v":""},{"$f":"IF(S96=\"\",\"\",INDEX(referentes!$G$2:$H$5,MATCH(S96,referentes!$H$2:$H$5,0),1))","v":""},null,null,{"$f":"IF(T96=\"\",\"\",VLOOKUP(T96,referentes!$Q$2:$X$209,2,FALSE))","v":""},null,null,null,null,"",null,null,null,"",null,null,{"$f":"IF(AF96<>\"\",VLOOKUP(AF96,'Otras referencias'!$H$19:$I$20,2,FALSE),\"\")","v":""},null,{"$f":"IF(AH96<>\"\",VLOOKUP(AH96,'Otras referencias'!$H$19:$I$20,2,FALSE),\"\")","v":""},null,{"$f":"IF(AJ96<>\"\",VLOOKUP(AJ96,'Otras referencias'!$H$19:$I$20,2,FALSE),\"\")","v":""},null,{"$f":"IF(AL96<>\"\",VLOOKUP(AL96,'Otras referencias'!$H$19:$I$20,2,FALSE),\"\")","v":""}]
[null,{"$f":"IF(C97=\"\",\"\",IF(COUNTIF($C$3:C97, C97)>1, \"\", C97))","v":""},{"$f":"IF(J97=\"\",\"\",CONCATENATE(DIGITADOR!$M$1,J97,E97))","v":""},"",{"$f":"IF(H97=\"\",\"\",VLOOKUP(H97,'Otras referencias'!$A$24:$E$48,2,FALSE))","v":""},null,null,null,{"$f":"IF(H97=\"\",\"\",VLOOKUP(H97,'Otras referencias'!$A$24:$E$48,5,FALSE))","v":""},null,null,null,null,null,null,"",{"$f":"IF(AND(P97<>\"\",O97<>\"\"),IF(N97=\"A\",VLOOKUP(P97,'Otras referencias'!$J$24:$K$35,2,FALSE),IF(N97=\"B\",VLOOKUP(P97,'Otras referencias'!$N$24:$O$35,2,),IF(N97=\"C\",VLOOKUP(P97,'Otras referencias'!$R$24:$S$35,2,FALSE)))),\"\")","v":""},{"$f":"IF(S97=\"\",\"\",INDEX(referentes!$G$2:$H$5,MATCH(S97,referentes!$H$2:$H$5,0),1))","v":""},null,null,{"$f":"IF(T97=\"\",\"\",VLOOKUP(T97,referentes!$Q$2:$X$209,2,FALSE))","v":""},null,null,null,null,"",null,null,null,"",null,null,{"$f":"IF(AF97<>\"\",VLOOKUP(AF97,'Otras referencias'!$H$19:$I$20,2,FALSE),\"\")","v":""},null,{"$f":"IF(AH97<>\"\",VLOOKUP(AH97,'Otras referencias'!$H$19:$I$20,2,FALSE),\"\")","v":""},null,{"$f":"IF(AJ97<>\"\",VLOOKUP(AJ97,'Otras referencias'!$H$19:$I$20,2,FALSE),\"\")","v":""},null,{"$f":"IF(AL97<>\"\",VLOOKUP(AL97,'Otras referencias'!$H$19:$I$20,2,FALSE),\"\")","v":""}]
[null,{"$f":"IF(C98=\"\",\"\",IF(COUNTIF($C$3:C98, C98)>1, \"\", C98))","v":""},{"$f":"IF(J98=\"\",\"\",CONCATENATE(DIGITADOR!$M$1,J98,E98))","v":""},"",{"$f":"IF(H98=\"\",\"\",VLOOKUP(H98,'Otras referencias'!$A$24:$E$48,2,FALSE))","v":""},null,null,null,{"$f":"IF(H98=\"\",\"\",VLOOKUP(H98,'Otras referencias'!$A$24:$E$48,5,FALSE))","v":""},null,null,null,null,null,null,"",{"$f":"IF(AND(P98<>\"\",O98<>\"\"),IF(N98=\"A\",VLOOKUP(P98,'Otras referencias'!$J$24:$K$35,2,FALSE),IF(N98=\"B\",VLOOKUP(P98,'Otras referencias'!$N$24:$O$35,2,),IF(N98=\"C\",VLOOKUP(P98,'Otras referencias'!$R$24:$S$35,2,FALSE)))),\"\")","v":""},{"$f":"IF(S98=\"\",\"\",INDEX(referentes!$G$2:$H$5,MATCH(S98,referentes!$H$2:$H$5,0),1))","v":""},null,null,{"$f":"IF(T98=\"\",\"\",VLOOKUP(T98,referentes!$Q$2:$X$209,2,FALSE))","v":""},null,null,null,null,"",null,null,null,"",null,null,{"$f":"IF(AF98<>\"\",VLOOKUP(AF98,'Otras referencias'!$H$19:$I$20,2,FALSE),\"\")","v":""},null,{"$f":"IF(AH98<>\"\",VLOOKUP(AH98,'Otras referencias'!$H$19:$I$20,2,FALSE),\"\")","v":""},null,{"$f":"IF(AJ98<>\"\",VLOOKUP(AJ98,'Otras referencias'!$H$19:$I$20,2,FALSE),\"\")","v":""},null,{"$f":"IF(AL98<>\"\",VLOOKUP(AL98,'Otras referencias'!$H$19:$I$20,2,FALSE),\"\")","v":""}]
[null,{"$f":"IF(C99=\"\",\"\",IF(COUNTIF($C$3:C99, C99)>1, \"\", C99))","v":""},{"$f":"IF(J99=\"\",\"\",CONCATENATE(DIGITADOR!$M$1,J99,E99))","v":""},"",{"$f":"IF(H99=\"\",\"\",VLOOKUP(H99,'Otras referencias'!$A$24:$E$48,2,FALSE))","v":""},null,null,null,{"$f":"IF(H99=\"\",\"\",VLOOKUP(H99,'Otras referencias'!$A$24:$E$48,5,FALSE))","v":""},null,null,null,null,null,null,"",{"$f":"IF(AND(P99<>\"\",O99<>\"\"),IF(N99=\"A\",VLOOKUP(P99,'Otras referencias'!$J$24:$K$35,2,FALSE),IF(N99=\"B\",VLOOKUP(P99,'Otras referencias'!$N$24:$O$35,2,),IF(N99=\"C\",VLOOKUP(P99,'Otras referencias'!$R$24:$S$35,2,FALSE)))),\"\")","v":""},{"$f":"IF(S99=\"\",\"\",INDEX(referentes!$G$2:$H$5,MATCH(S99,referentes!$H$2:$H$5,0),1))","v":""},null,null,{"$f":"IF(T99=\"\",\"\",VLOOKUP(T99,referentes!$Q$2:$X$209,2,FALSE))","v":""},null,null,null,null,"",null,null,null,"",null,null,{"$f":"IF(AF99<>\"\",VLOOKUP(AF99,'Otras referencias'!$H$19:$I$20,2,FALSE),\"\")","v":""},null,{"$f":"IF(AH99<>\"\",VLOOKUP(AH99,'Otras referencias'!$H$19:$I$20,2,FALSE),\"\")","v":""},null,{"$f":"IF(AJ99<>\"\",VLOOKUP(AJ99,'Otras referencias'!$H$19:$I$20,2,FALSE),\"\")","v":""},null,{"$f":"IF(AL99<>\"\",VLOOKUP(AL99,'Otras referencias'!$H$19:$I$20,2,FALSE),\"\")","v":""}]
[null,{"$f":"IF(C100=\"\",\"\",IF(COUNTIF($C$3:C100, C100)>1, \"\", C100))","v":""},{"$f":"IF(J100=\"\",\"\",CONCATENATE(DIGITADOR!$M$1,J100,E100))","v":""},"",{"$f":"IF(H100=\"\",\"\",VLOOKUP(H100,'Otras referencias'!$A$24:$E$48,2,FALSE))","v":""},null,null,null,{"$f":"IF(H100=\"\",\"\",VLOOKUP(H100,'Otras referencias'!$A$24:$E$48,5,FALSE))","v":""},null,null,null,null,null,null,"",{"$f":"IF(AND(P100<>\"\",O100<>\"\"),IF(N100=\"A\",VLOOKUP(P100,'Otras referencias'!$J$24:$K$35,2,FALSE),IF(N100=\"B\",VLOOKUP(P100,'Otras referencias'!$N$24:$O$35,2,),IF(N100=\"C\",VLOOKUP(P100,'Otras referencias'!$R$24:$S$35,2,FALSE)))),\"\")","v":""},{"$f":"IF(S100=\"\",\"\",INDEX(referentes!$G$2:$H$5,MATCH(S100,referentes!$H$2:$H$5,0),1))","v":""},null,null,{"$f":"IF(T100=\"\",\"\",VLOOKUP(T100,referentes!$Q$2:$X$209,2,FALSE))","v":""},null,null,null,null,"",null,null,null,"",null,null,{"$f":"IF(AF100<>\"\",VLOOKUP(AF100,'Otras referencias'!$H$19:$I$20,2,FALSE),\"\")","v":""},null,{"$f":"IF(AH100<>\"\",VLOOKUP(AH100,'Otras referencias'!$H$19:$I$20,2,FALSE),\"\")","v":""},null,{"$f":"IF(AJ100<>\"\",VLOOKUP(AJ100,'Otras referencias'!$H$19:$I$20,2,FALSE),\"\")","v":""},null,{"$f":"IF(AL100<>\"\",VLOOKUP(AL100,'Otras referencias'!$H$19:$I$20,2,FALSE),\"\")","v":""}]
[null,{"$f":"IF(C101=\"\",\"\",IF(COUNTIF($C$3:C101, C101)>1, \"\", C101))","v":""},{"$f":"IF(J101=\"\",\"\",CONCATENATE(DIGITADOR!$M$1,J101,E101))","v":""},"",{"$f":"IF(H101=\"\",\"\",VLOOKUP(H101,'Otras referencias'!$A$24:$E$48,2,FALSE))","v":""},null,null,null,{"$f":"IF(H101=\"\",\"\",VLOOKUP(H101,'Otras referencias'!$A$24:$E$48,5,FALSE))","v":""},null,null,null,null,null,null,"",{"$f":"IF(AND(P101<>\"\",O101<>\"\"),IF(N101=\"A\",VLOOKUP(P101,'Otras referencias'!$J$24:$K$35,2,FALSE),IF(N101=\"B\",VLOOKUP(P101,'Otras referencias'!$N$24:$O$35,2,),IF(N101=\"C\",VLOOKUP(P101,'Otras referencias'!$R$24:$S$35,2,FALSE)))),\"\")","v":""},{"$f":"IF(S101=\"\",\"\",INDEX(referentes!$G$2:$H$5,MATCH(S101,referentes!$H$2:$H$5,0),1))","v":""},null,null,{"$f":"IF(T101=\"\",\"\",VLOOKUP(T101,referentes!$Q$2:$X$209,2,FALSE))","v":""},null,null,null,null,"",null,null,null,"",null,null,{"$f":"IF(AF101<>\"\",VLOOKUP(AF101,'Otras referencias'!$H$19:$I$20,2,FALSE),\"\")","v":""},null,{"$f":"IF(AH101<>\"\",VLOOKUP(AH101,'Otras referencias'!$H$19:$I$20,2,FALSE),\"\")","v":""},null,{"$f":"IF(AJ101<>\"\",VLOOKUP(AJ101,'Otras referencias'!$H$19:$I$20,2,FALSE),\"\")","v":""},null,{"$f":"IF(AL101<>\"\",VLOOKUP(AL101,'Otras referencias'!$H$19:$I$20,2,FALSE),\"\")","v":""}]
[null,{"$f":"IF(C102=\"\",\"\",IF(COUNTIF($C$3:C102, C102)>1, \"\", C102))","v":""},{"$f":"IF(J102=\"\",\"\",CONCATENATE(DIGITADOR!$M$1,J102,E102))","v":""},"",{"$f":"IF(H102=\"\",\"\",VLOOKUP(H102,'Otras referencias'!$A$24:$E$48,2,FALSE))","v":""},null,null,null,{"$f":"IF(H102=\"\",\"\",VLOOKUP(H102,'Otras referencias'!$A$24:$E$48,5,FALSE))","v":""},null,null,null,null,null,null,"",{"$f":"IF(AND(P102<>\"\",O102<>\"\"),IF(N102=\"A\",VLOOKUP(P102,'Otras referencias'!$J$24:$K$35,2,FALSE),IF(N102=\"B\",VLOOKUP(P102,'Otras referencias'!$N$24:$O$35,2,),IF(N102=\"C\",VLOOKUP(P102,'Otras referencias'!$R$24:$S$35,2,FALSE)))),\"\")","v":""},{"$f":"IF(S102=\"\",\"\",INDEX(referentes!$G$2:$H$5,MATCH(S102,referentes!$H$2:$H$5,0),1))","v":""},null,null,{"$f":"IF(T102=\"\",\"\",VLOOKUP(T102,referentes!$Q$2:$X$209,2,FALSE))","v":""},null,null,null,null,"",null,null,null,"",null,null,{"$f":"IF(AF102<>\"\",VLOOKUP(AF102,'Otras referencias'!$H$19:$I$20,2,FALSE),\"\")","v":""},null,{"$f":"IF(AH102<>\"\",VLOOKUP(AH102,'Otras referencias'!$H$19:$I$20,2,FALSE),\"\")","v":""},null,{"$f":"IF(AJ102<>\"\",VLOOKUP(AJ102,'Otras referencias'!$H$19:$I$20,2,FALSE),\"\")","v":""},null,{"$f":"IF(AL102<>\"\",VLOOKUP(AL102,'Otras referencias'!$H$19:$I$20,2,FALSE),\"\")","v":""}]
[null,{"$f":"IF(C103=\"\",\"\",IF(COUNTIF($C$3:C103, C103)>1, \"\", C103))","v":""},{"$f":"IF(J103=\"\",\"\",CONCATENATE(DIGITADOR!$M$1,J103,E103))","v":""},"",{"$f":"IF(H103=\"\",\"\",VLOOKUP(H103,'Otras referencias'!$A$24:$E$48,2,FALSE))","v":""},null,null,null,{"$f":"IF(H103=\"\",\"\",VLOOKUP(H103,'Otras referencias'!$A$24:$E$48,5,FALSE))","v":""},null,null,null,null,null,null,"",{"$f":"IF(AND(P103<>\"\",O103<>\"\"),IF(N103=\"A\",VLOOKUP(P103,'Otras referencias'!$J$24:$K$35,2,FALSE),IF(N103=\"B\",VLOOKUP(P103,'Otras referencias'!$N$24:$O$35,2,),IF(N103=\"C\",VLOOKUP(P103,'Otras referencias'!$R$24:$S$35,2,FALSE)))),\"\")","v":""},{"$f":"IF(S103=\"\",\"\",INDEX(referentes!$G$2:$H$5,MATCH(S103,referentes!$H$2:$H$5,0),1))","v":""},null,null,{"$f":"IF(T103=\"\",\"\",VLOOKUP(T103,referentes!$Q$2:$X$209,2,FALSE))","v":""},null,null,null,null,"",null,null,null,"",null,null,{"$f":"IF(AF103<>\"\",VLOOKUP(AF103,'Otras referencias'!$H$19:$I$20,2,FALSE),\"\")","v":""},null,{"$f":"IF(AH103<>\"\",VLOOKUP(AH103,'Otras referencias'!$H$19:$I$20,2,FALSE),\"\")","v":""},null,{"$f":"IF(AJ103<>\"\",VLOOKUP(AJ103,'Otras referencias'!$H$19:$I$20,2,FALSE),\"\")","v":""},null,{"$f":"IF(AL103<>\"\",VLOOKUP(AL103,'Otras referencias'!$H$19:$I$20,2,FALSE),\"\")","v":""}]
[null,{"$f":"IF(C104=\"\",\"\",IF(COUNTIF($C$3:C104, C104)>1, \"\", C104))","v":""},{"$f":"IF(J104=\"\",\"\",CONCATENATE(DIGITADOR!$M$1,J104,E104))","v":""},"",{"$f":"IF(H104=\"\",\"\",VLOOKUP(H104,'Otras referencias'!$A$24:$E$48,2,FALSE))","v":""},null,null,null,{"$f":"IF(H104=\"\",\"\",VLOOKUP(H104,'Otras referencias'!$A$24:$E$48,5,FALSE))","v":""},null,null,null,null,null,null,"",{"$f":"IF(AND(P104<>\"\",O104<>\"\"),IF(N104=\"A\",VLOOKUP(P104,'Otras referencias'!$J$24:$K$35,2,FALSE),IF(N104=\"B\",VLOOKUP(P104,'Otras referencias'!$N$24:$O$35,2,),IF(N104=\"C\",VLOOKUP(P104,'Otras referencias'!$R$24:$S$35,2,FALSE)))),\"\")","v":""},{"$f":"IF(S104=\"\",\"\",INDEX(referentes!$G$2:$H$5,MATCH(S104,referentes!$H$2:$H$5,0),1))","v":""},null,null,{"$f":"IF(T104=\"\",\"\",VLOOKUP(T104,referentes!$Q$2:$X$209,2,FALSE))","v":""},null,null,null,null,"",null,null,null,"",null,null,{"$f":"IF(AF104<>\"\",VLOOKUP(AF104,'Otras referencias'!$H$19:$I$20,2,FALSE),\"\")","v":""},null,{"$f":"IF(AH104<>\"\",VLOOKUP(AH104,'Otras referencias'!$H$19:$I$20,2,FALSE),\"\")","v":""},null,{"$f":"IF(AJ104<>\"\",VLOOKUP(AJ104,'Otras referencias'!$H$19:$I$20,2,FALSE),\"\")","v":""},null,{"$f":"IF(AL104<>\"\",VLOOKUP(AL104,'Otras referencias'!$H$19:$I$20,2,FALSE),\"\")","v":""}]
[null,{"$f":"IF(C105=\"\",\"\",IF(COUNTIF($C$3:C105, C105)>1, \"\", C105))","v":""},{"$f":"IF(J105=\"\",\"\",CONCATENATE(DIGITADOR!$M$1,J105,E105))","v":""},"",{"$f":"IF(H105=\"\",\"\",VLOOKUP(H105,'Otras referencias'!$A$24:$E$48,2,FALSE))","v":""},null,null,null,{"$f":"IF(H105=\"\",\"\",VLOOKUP(H105,'Otras referencias'!$A$24:$E$48,5,FALSE))","v":""},null,null,null,null,null,null,"",{"$f":"IF(AND(P105<>\"\",O105<>\"\"),IF(N105=\"A\",VLOOKUP(P105,'Otras referencias'!$J$24:$K$35,2,FALSE),IF(N105=\"B\",VLOOKUP(P105,'Otras referencias'!$N$24:$O$35,2,),IF(N105=\"C\",VLOOKUP(P105,'Otras referencias'!$R$24:$S$35,2,FALSE)))),\"\")","v":""},{"$f":"IF(S105=\"\",\"\",INDEX(referentes!$G$2:$H$5,MATCH(S105,referentes!$H$2:$H$5,0),1))","v":""},null,null,{"$f":"IF(T105=\"\",\"\",VLOOKUP(T105,referentes!$Q$2:$X$209,2,FALSE))","v":""},null,null,null,null,"",null,null,null,"",null,null,{"$f":"IF(AF105<>\"\",VLOOKUP(AF105,'Otras referencias'!$H$19:$I$20,2,FALSE),\"\")","v":""},null,{"$f":"IF(AH105<>\"\",VLOOKUP(AH105,'Otras referencias'!$H$19:$I$20,2,FALSE),\"\")","v":""},null,{"$f":"IF(AJ105<>\"\",VLOOKUP(AJ105,'Otras referencias'!$H$19:$I$20,2,FALSE),\"\")","v":""},null,{"$f":"IF(AL105<>\"\",VLOOKUP(AL105,'Otras referencias'!$H$19:$I$20,2,FALSE),\"\")","v":""}]
[null,{"$f":"IF(C106=\"\",\"\",IF(COUNTIF($C$3:C106, C106)>1, \"\", C106))","v":""},{"$f":"IF(J106=\"\",\"\",CONCATENATE(DIGITADOR!$M$1,J106,E106))","v":""},"",{"$f":"IF(H106=\"\",\"\",VLOOKUP(H106,'Otras referencias'!$A$24:$E$48,2,FALSE))","v":""},null,null,null,{"$f":"IF(H106=\"\",\"\",VLOOKUP(H106,'Otras referencias'!$A$24:$E$48,5,FALSE))","v":""},null,null,null,null,null,null,"",{"$f":"IF(AND(P106<>\"\",O106<>\"\"),IF(N106=\"A\",VLOOKUP(P106,'Otras referencias'!$J$24:$K$35,2,FALSE),IF(N106=\"B\",VLOOKUP(P106,'Otras referencias'!$N$24:$O$35,2,),IF(N106=\"C\",VLOOKUP(P106,'Otras referencias'!$R$24:$S$35,2,FALSE)))),\"\")","v":""},{"$f":"IF(S106=\"\",\"\",INDEX(referentes!$G$2:$H$5,MATCH(S106,referentes!$H$2:$H$5,0),1))","v":""},null,null,{"$f":"IF(T106=\"\",\"\",VLOOKUP(T106,referentes!$Q$2:$X$209,2,FALSE))","v":""},null,null,null,null,"",null,null,null,"",null,null,{"$f":"IF(AF106<>\"\",VLOOKUP(AF106,'Otras referencias'!$H$19:$I$20,2,FALSE),\"\")","v":""},null,{"$f":"IF(AH106<>\"\",VLOOKUP(AH106,'Otras referencias'!$H$19:$I$20,2,FALSE),\"\")","v":""},null,{"$f":"IF(AJ106<>\"\",VLOOKUP(AJ106,'Otras referencias'!$H$19:$I$20,2,FALSE),\"\")","v":""},null,{"$f":"IF(AL106<>\"\",VLOOKUP(AL106,'Otras referencias'!$H$19:$I$20,2,FALSE),\"\")","v":""}]
[null,{"$f":"IF(C107=\"\",\"\",IF(COUNTIF($C$3:C107, C107)>1, \"\", C107))","v":""},{"$f":"IF(J107=\"\",\"\",CONCATENATE(DIGITADOR!$M$1,J107,E107))","v":""},"",{"$f":"IF(H107=\"\",\"\",VLOOKUP(H107,'Otras referencias'!$A$24:$E$48,2,FALSE))","v":""},null,null,null,{"$f":"IF(H107=\"\",\"\",VLOOKUP(H107,'Otras referencias'!$A$24:$E$48,5,FALSE))","v":""},null,null,null,null,null,null,"",{"$f":"IF(AND(P107<>\"\",O107<>\"\"),IF(N107=\"A\",VLOOKUP(P107,'Otras referencias'!$J$24:$K$35,2,FALSE),IF(N107=\"B\",VLOOKUP(P107,'Otras referencias'!$N$24:$O$35,2,),IF(N107=\"C\",VLOOKUP(P107,'Otras referencias'!$R$24:$S$35,2,FALSE)))),\"\")","v":""},{"$f":"IF(S107=\"\",\"\",INDEX(referentes!$G$2:$H$5,MATCH(S107,referentes!$H$2:$H$5,0),1))","v":""},null,null,{"$f":"IF(T107=\"\",\"\",VLOOKUP(T107,referentes!$Q$2:$X$209,2,FALSE))","v":""},null,null,null,null,"",null,null,null,"",null,null,{"$f":"IF(AF107<>\"\",VLOOKUP(AF107,'Otras referencias'!$H$19:$I$20,2,FALSE),\"\")","v":""},null,{"$f":"IF(AH107<>\"\",VLOOKUP(AH107,'Otras referencias'!$H$19:$I$20,2,FALSE),\"\")","v":""},null,{"$f":"IF(AJ107<>\"\",VLOOKUP(AJ107,'Otras referencias'!$H$19:$I$20,2,FALSE),\"\")","v":""},null,{"$f":"IF(AL107<>\"\",VLOOKUP(AL107,'Otras referencias'!$H$19:$I$20,2,FALSE),\"\")","v":""}]
[null,{"$f":"IF(C108=\"\",\"\",IF(COUNTIF($C$3:C108, C108)>1, \"\", C108))","v":""},{"$f":"IF(J108=\"\",\"\",CONCATENATE(DIGITADOR!$M$1,J108,E108))","v":""},"",{"$f":"IF(H108=\"\",\"\",VLOOKUP(H108,'Otras referencias'!$A$24:$E$48,2,FALSE))","v":""},null,null,null,{"$f":"IF(H108=\"\",\"\",VLOOKUP(H108,'Otras referencias'!$A$24:$E$48,5,FALSE))","v":""},null,null,null,null,null,null,"",{"$f":"IF(AND(P108<>\"\",O108<>\"\"),IF(N108=\"A\",VLOOKUP(P108,'Otras referencias'!$J$24:$K$35,2,FALSE),IF(N108=\"B\",VLOOKUP(P108,'Otras referencias'!$N$24:$O$35,2,),IF(N108=\"C\",VLOOKUP(P108,'Otras referencias'!$R$24:$S$35,2,FALSE)))),\"\")","v":""},{"$f":"IF(S108=\"\",\"\",INDEX(referentes!$G$2:$H$5,MATCH(S108,referentes!$H$2:$H$5,0),1))","v":""},null,null,{"$f":"IF(T108=\"\",\"\",VLOOKUP(T108,referentes!$Q$2:$X$209,2,FALSE))","v":""},null,null,null,null,"",null,null,null,"",null,null,{"$f":"IF(AF108<>\"\",VLOOKUP(AF108,'Otras referencias'!$H$19:$I$20,2,FALSE),\"\")","v":""},null,{"$f":"IF(AH108<>\"\",VLOOKUP(AH108,'Otras referencias'!$H$19:$I$20,2,FALSE),\"\")","v":""},null,{"$f":"IF(AJ108<>\"\",VLOOKUP(AJ108,'Otras referencias'!$H$19:$I$20,2,FALSE),\"\")","v":""},null,{"$f":"IF(AL108<>\"\",VLOOKUP(AL108,'Otras referencias'!$H$19:$I$20,2,FALSE),\"\")","v":""}]
[null,{"$f":"IF(C109=\"\",\"\",IF(COUNTIF($C$3:C109, C109)>1, \"\", C109))","v":""},{"$f":"IF(J109=\"\",\"\",CONCATENATE(DIGITADOR!$M$1,J109,E109))","v":""},"",{"$f":"IF(H109=\"\",\"\",VLOOKUP(H109,'Otras referencias'!$A$24:$E$48,2,FALSE))","v":""},null,null,null,{"$f":"IF(H109=\"\",\"\",VLOOKUP(H109,'Otras referencias'!$A$24:$E$48,5,FALSE))","v":""},null,null,null,null,null,null,"",{"$f":"IF(AND(P109<>\"\",O109<>\"\"),IF(N109=\"A\",VLOOKUP(P109,'Otras referencias'!$J$24:$K$35,2,FALSE),IF(N109=\"B\",VLOOKUP(P109,'Otras referencias'!$N$24:$O$35,2,),IF(N109=\"C\",VLOOKUP(P109,'Otras referencias'!$R$24:$S$35,2,FALSE)))),\"\")","v":""},{"$f":"IF(S109=\"\",\"\",INDEX(referentes!$G$2:$H$5,MATCH(S109,referentes!$H$2:$H$5,0),1))","v":""},null,null,{"$f":"IF(T109=\"\",\"\",VLOOKUP(T109,referentes!$Q$2:$X$209,2,FALSE))","v":""},null,null,null,null,"",null,null,null,"",null,null,{"$f":"IF(AF109<>\"\",VLOOKUP(AF109,'Otras referencias'!$H$19:$I$20,2,FALSE),\"\")","v":""},null,{"$f":"IF(AH109<>\"\",VLOOKUP(AH109,'Otras referencias'!$H$19:$I$20,2,FALSE),\"\")","v":""},null,{"$f":"IF(AJ109<>\"\",VLOOKUP(AJ109,'Otras referencias'!$H$19:$I$20,2,FALSE),\"\")","v":""},null,{"$f":"IF(AL109<>\"\",VLOOKUP(AL109,'Otras referencias'!$H$19:$I$20,2,FALSE),\"\")","v":""}]
[null,{"$f":"IF(C110=\"\",\"\",IF(COUNTIF($C$3:C110, C110)>1, \"\", C110))","v":""},{"$f":"IF(J110=\"\",\"\",CONCATENATE(DIGITADOR!$M$1,J110,E110))","v":""},"",{"$f":"IF(H110=\"\",\"\",VLOOKUP(H110,'Otras referencias'!$A$24:$E$48,2,FALSE))","v":""},null,null,null,{"$f":"IF(H110=\"\",\"\",VLOOKUP(H110,'Otras referencias'!$A$24:$E$48,5,FALSE))","v":""},null,null,null,null,null,null,"",{"$f":"IF(AND(P110<>\"\",O110<>\"\"),IF(N110=\"A\",VLOOKUP(P110,'Otras referencias'!$J$24:$K$35,2,FALSE),IF(N110=\"B\",VLOOKUP(P110,'Otras referencias'!$N$24:$O$35,2,),IF(N110=\"C\",VLOOKUP(P110,'Otras referencias'!$R$24:$S$35,2,FALSE)))),\"\")","v":""},{"$f":"IF(S110=\"\",\"\",INDEX(referentes!$G$2:$H$5,MATCH(S110,referentes!$H$2:$H$5,0),1))","v":""},null,null,{"$f":"IF(T110=\"\",\"\",VLOOKUP(T110,referentes!$Q$2:$X$209,2,FALSE))","v":""},null,null,null,null,"",null,null,null,"",null,null,{"$f":"IF(AF110<>\"\",VLOOKUP(AF110,'Otras referencias'!$H$19:$I$20,2,FALSE),\"\")","v":""},null,{"$f":"IF(AH110<>\"\",VLOOKUP(AH110,'Otras referencias'!$H$19:$I$20,2,FALSE),\"\")","v":""},null,{"$f":"IF(AJ110<>\"\",VLOOKUP(AJ110,'Otras referencias'!$H$19:$I$20,2,FALSE),\"\")","v":""},null,{"$f":"IF(AL110<>\"\",VLOOKUP(AL110,'Otras referencias'!$H$19:$I$20,2,FALSE),\"\")","v":""}]
[null,{"$f":"IF(C111=\"\",\"\",IF(COUNTIF($C$3:C111, C111)>1, \"\", C111))","v":""},{"$f":"IF(J111=\"\",\"\",CONCATENATE(DIGITADOR!$M$1,J111,E111))","v":""},"",{"$f":"IF(H111=\"\",\"\",VLOOKUP(H111,'Otras referencias'!$A$24:$E$48,2,FALSE))","v":""},null,null,null,{"$f":"IF(H111=\"\",\"\",VLOOKUP(H111,'Otras referencias'!$A$24:$E$48,5,FALSE))","v":""},null,null,null,null,null,null,"",{"$f":"IF(AND(P111<>\"\",O111<>\"\"),IF(N111=\"A\",VLOOKUP(P111,'Otras referencias'!$J$24:$K$35,2,FALSE),IF(N111=\"B\",VLOOKUP(P111,'Otras referencias'!$N$24:$O$35,2,),IF(N111=\"C\",VLOOKUP(P111,'Otras referencias'!$R$24:$S$35,2,FALSE)))),\"\")","v":""},{"$f":"IF(S111=\"\",\"\",INDEX(referentes!$G$2:$H$5,MATCH(S111,referentes!$H$2:$H$5,0),1))","v":""},null,null,{"$f":"IF(T111=\"\",\"\",VLOOKUP(T111,referentes!$Q$2:$X$209,2,FALSE))","v":""},null,null,null,null,"",null,null,null,"",null,null,{"$f":"IF(AF111<>\"\",VLOOKUP(AF111,'Otras referencias'!$H$19:$I$20,2,FALSE),\"\")","v":""},null,{"$f":"IF(AH111<>\"\",VLOOKUP(AH111,'Otras referencias'!$H$19:$I$20,2,FALSE),\"\")","v":""},null,{"$f":"IF(AJ111<>\"\",VLOOKUP(AJ111,'Otras referencias'!$H$19:$I$20,2,FALSE),\"\")","v":""},null,{"$f":"IF(AL111<>\"\",VLOOKUP(AL111,'Otras referencias'!$H$19:$I$20,2,FALSE),\"\")","v":""}]
[null,{"$f":"IF(C112=\"\",\"\",IF(COUNTIF($C$3:C112, C112)>1, \"\", C112))","v":""},{"$f":"IF(J112=\"\",\"\",CONCATENATE(DIGITADOR!$M$1,J112,E112))","v":""},"",{"$f":"IF(H112=\"\",\"\",VLOOKUP(H112,'Otras referencias'!$A$24:$E$48,2,FALSE))","v":""},null,null,null,{"$f":"IF(H112=\"\",\"\",VLOOKUP(H112,'Otras referencias'!$A$24:$E$48,5,FALSE))","v":""},null,null,null,null,null,null,"",{"$f":"IF(AND(P112<>\"\",O112<>\"\"),IF(N112=\"A\",VLOOKUP(P112,'Otras referencias'!$J$24:$K$35,2,FALSE),IF(N112=\"B\",VLOOKUP(P112,'Otras referencias'!$N$24:$O$35,2,),IF(N112=\"C\",VLOOKUP(P112,'Otras referencias'!$R$24:$S$35,2,FALSE)))),\"\")","v":""},{"$f":"IF(S112=\"\",\"\",INDEX(referentes!$G$2:$H$5,MATCH(S112,referentes!$H$2:$H$5,0),1))","v":""},null,null,{"$f":"IF(T112=\"\",\"\",VLOOKUP(T112,referentes!$Q$2:$X$209,2,FALSE))","v":""},null,null,null,null,"",null,null,null,"",null,null,{"$f":"IF(AF112<>\"\",VLOOKUP(AF112,'Otras referencias'!$H$19:$I$20,2,FALSE),\"\")","v":""},null,{"$f":"IF(AH112<>\"\",VLOOKUP(AH112,'Otras referencias'!$H$19:$I$20,2,FALSE),\"\")","v":""},null,{"$f":"IF(AJ112<>\"\",VLOOKUP(AJ112,'Otras referencias'!$H$19:$I$20,2,FALSE),\"\")","v":""},null,{"$f":"IF(AL112<>\"\",VLOOKUP(AL112,'Otras referencias'!$H$19:$I$20,2,FALSE),\"\")","v":""}]
[null,{"$f":"IF(C113=\"\",\"\",IF(COUNTIF($C$3:C113, C113)>1, \"\", C113))","v":""},{"$f":"IF(J113=\"\",\"\",CONCATENATE(DIGITADOR!$M$1,J113,E113))","v":""},"",{"$f":"IF(H113=\"\",\"\",VLOOKUP(H113,'Otras referencias'!$A$24:$E$48,2,FALSE))","v":""},null,null,null,{"$f":"IF(H113=\"\",\"\",VLOOKUP(H113,'Otras referencias'!$A$24:$E$48,5,FALSE))","v":""},null,null,null,null,null,null,"",{"$f":"IF(AND(P113<>\"\",O113<>\"\"),IF(N113=\"A\",VLOOKUP(P113,'Otras referencias'!$J$24:$K$35,2,FALSE),IF(N113=\"B\",VLOOKUP(P113,'Otras referencias'!$N$24:$O$35,2,),IF(N113=\"C\",VLOOKUP(P113,'Otras referencias'!$R$24:$S$35,2,FALSE)))),\"\")","v":""},{"$f":"IF(S113=\"\",\"\",INDEX(referentes!$G$2:$H$5,MATCH(S113,referentes!$H$2:$H$5,0),1))","v":""},null,null,{"$f":"IF(T113=\"\",\"\",VLOOKUP(T113,referentes!$Q$2:$X$209,2,FALSE))","v":""},null,null,null,null,"",null,null,null,"",null,null,{"$f":"IF(AF113<>\"\",VLOOKUP(AF113,'Otras referencias'!$H$19:$I$20,2,FALSE),\"\")","v":""},null,{"$f":"IF(AH113<>\"\",VLOOKUP(AH113,'Otras referencias'!$H$19:$I$20,2,FALSE),\"\")","v":""},null,{"$f":"IF(AJ113<>\"\",VLOOKUP(AJ113,'Otras referencias'!$H$19:$I$20,2,FALSE),\"\")","v":""},null,{"$f":"IF(AL113<>\"\",VLOOKUP(AL113,'Otras referencias'!$H$19:$I$20,2,FALSE),\"\")","v":""}]
[null,{"$f":"IF(C114=\"\",\"\",IF(COUNTIF($C$3:C114, C114)>1, \"\", C114))","v":""},{"$f":"IF(J114=\"\",\"\",CONCATENATE(DIGITADOR!$M$1,J114,E114))","v":""},"",{"$f":"IF(H114=\"\",\"\",VLOOKUP(H114,'Otras referencias'!$A$24:$E$48,2,FALSE))","v":""},null,null,null,{"$f":"IF(H114=\"\",\"\",VLOOKUP(H114,'Otras referencias'!$A$24:$E$48,5,FALSE))","v":""},null,null,null,null,null,null,"",{"$f":"IF(AND(P114<>\"\",O114<>\"\"),IF(N114=\"A\",VLOOKUP(P114,'Otras referencias'!$J$24:$K$35,2,FALSE),IF(N114=\"B\",VLOOKUP(P114,'Otras referencias'!$N$24:$O$35,2,),IF(N114=\"C\",VLOOKUP(P114,'Otras referencias'!$R$24:$S$35,2,FALSE)))),\"\")","v":""},{"$f":"IF(S114=\"\",\"\",INDEX(referentes!$G$2:$H$5,MATCH(S114,referentes!$H$2:$H$5,0),1))","v":""},null,null,{"$f":"IF(T114=\"\",\"\",VLOOKUP(T114,referentes!$Q$2:$X$209,2,FALSE))","v":""},null,null,null,null,"",null,null,null,"",null,null,{"$f":"IF(AF114<>\"\",VLOOKUP(AF114,'Otras referencias'!$H$19:$I$20,2,FALSE),\"\")","v":""},null,{"$f":"IF(AH114<>\"\",VLOOKUP(AH114,'Otras referencias'!$H$19:$I$20,2,FALSE),\"\")","v":""},null,{"$f":"IF(AJ114<>\"\",VLOOKUP(AJ114,'Otras referencias'!$H$19:$I$20,2,FALSE),\"\")","v":""},null,{"$f":"IF(AL114<>\"\",VLOOKUP(AL114,'Otras referencias'!$H$19:$I$20,2,FALSE),\"\")","v":""}]
[null,{"$f":"IF(C115=\"\",\"\",IF(COUNTIF($C$3:C115, C115)>1, \"\", C115))","v":""},{"$f":"IF(J115=\"\",\"\",CONCATENATE(DIGITADOR!$M$1,J115,E115))","v":""},"",{"$f":"IF(H115=\"\",\"\",VLOOKUP(H115,'Otras referencias'!$A$24:$E$48,2,FALSE))","v":""},null,null,null,{"$f":"IF(H115=\"\",\"\",VLOOKUP(H115,'Otras referencias'!$A$24:$E$48,5,FALSE))","v":""},null,null,null,null,null,null,"",{"$f":"IF(AND(P115<>\"\",O115<>\"\"),IF(N115=\"A\",VLOOKUP(P115,'Otras referencias'!$J$24:$K$35,2,FALSE),IF(N115=\"B\",VLOOKUP(P115,'Otras referencias'!$N$24:$O$35,2,),IF(N115=\"C\",VLOOKUP(P115,'Otras referencias'!$R$24:$S$35,2,FALSE)))),\"\")","v":""},{"$f":"IF(S115=\"\",\"\",INDEX(referentes!$G$2:$H$5,MATCH(S115,referentes!$H$2:$H$5,0),1))","v":""},null,null,{"$f":"IF(T115=\"\",\"\",VLOOKUP(T115,referentes!$Q$2:$X$209,2,FALSE))","v":""},null,null,null,null,"",null,null,null,"",null,null,{"$f":"IF(AF115<>\"\",VLOOKUP(AF115,'Otras referencias'!$H$19:$I$20,2,FALSE),\"\")","v":""},null,{"$f":"IF(AH115<>\"\",VLOOKUP(AH115,'Otras referencias'!$H$19:$I$20,2,FALSE),\"\")","v":""},null,{"$f":"IF(AJ115<>\"\",VLOOKUP(AJ115,'Otras referencias'!$H$19:$I$20,2,FALSE),\"\")","v":""},null,{"$f":"IF(AL115<>\"\",VLOOKUP(AL115,'Otras referencias'!$H$19:$I$20,2,FALSE),\"\")","v":""}]
[null,{"$f":"IF(C116=\"\",\"\",IF(COUNTIF($C$3:C116, C116)>1, \"\", C116))","v":""},{"$f":"IF(J116=\"\",\"\",CONCATENATE(DIGITADOR!$M$1,J116,E116))","v":""},"",{"$f":"IF(H116=\"\",\"\",VLOOKUP(H116,'Otras referencias'!$A$24:$E$48,2,FALSE))","v":""},null,null,null,{"$f":"IF(H116=\"\",\"\",VLOOKUP(H116,'Otras referencias'!$A$24:$E$48,5,FALSE))","v":""},null,null,null,null,null,null,"",{"$f":"IF(AND(P116<>\"\",O116<>\"\"),IF(N116=\"A\",VLOOKUP(P116,'Otras referencias'!$J$24:$K$35,2,FALSE),IF(N116=\"B\",VLOOKUP(P116,'Otras referencias'!$N$24:$O$35,2,),IF(N116=\"C\",VLOOKUP(P116,'Otras referencias'!$R$24:$S$35,2,FALSE)))),\"\")","v":""},{"$f":"IF(S116=\"\",\"\",INDEX(referentes!$G$2:$H$5,MATCH(S116,referentes!$H$2:$H$5,0),1))","v":""},null,null,{"$f":"IF(T116=\"\",\"\",VLOOKUP(T116,referentes!$Q$2:$X$209,2,FALSE))","v":""},null,null,null,null,"",null,null,null,"",null,null,{"$f":"IF(AF116<>\"\",VLOOKUP(AF116,'Otras referencias'!$H$19:$I$20,2,FALSE),\"\")","v":""},null,{"$f":"IF(AH116<>\"\",VLOOKUP(AH116,'Otras referencias'!$H$19:$I$20,2,FALSE),\"\")","v":""},null,{"$f":"IF(AJ116<>\"\",VLOOKUP(AJ116,'Otras referencias'!$H$19:$I$20,2,FALSE),\"\")","v":""},null,{"$f":"IF(AL116<>\"\",VLOOKUP(AL116,'Otras referencias'!$H$19:$I$20,2,FALSE),\"\")","v":""}]
[null,{"$f":"IF(C117=\"\",\"\",IF(COUNTIF($C$3:C117, C117)>1, \"\", C117))","v":""},{"$f":"IF(J117=\"\",\"\",CONCATENATE(DIGITADOR!$M$1,J117,E117))","v":""},"",{"$f":"IF(H117=\"\",\"\",VLOOKUP(H117,'Otras referencias'!$A$24:$E$48,2,FALSE))","v":""},null,null,null,{"$f":"IF(H117=\"\",\"\",VLOOKUP(H117,'Otras referencias'!$A$24:$E$48,5,FALSE))","v":""},null,null,null,null,null,null,"",{"$f":"IF(AND(P117<>\"\",O117<>\"\"),IF(N117=\"A\",VLOOKUP(P117,'Otras referencias'!$J$24:$K$35,2,FALSE),IF(N117=\"B\",VLOOKUP(P117,'Otras referencias'!$N$24:$O$35,2,),IF(N117=\"C\",VLOOKUP(P117,'Otras referencias'!$R$24:$S$35,2,FALSE)))),\"\")","v":""},{"$f":"IF(S117=\"\",\"\",INDEX(referentes!$G$2:$H$5,MATCH(S117,referentes!$H$2:$H$5,0),1))","v":""},null,null,{"$f":"IF(T117=\"\",\"\",VLOOKUP(T117,referentes!$Q$2:$X$209,2,FALSE))","v":""},null,null,null,null,"",null,null,null,"",null,null,{"$f":"IF(AF117<>\"\",VLOOKUP(AF117,'Otras referencias'!$H$19:$I$20,2,FALSE),\"\")","v":""},null,{"$f":"IF(AH117<>\"\",VLOOKUP(AH117,'Otras referencias'!$H$19:$I$20,2,FALSE),\"\")","v":""},null,{"$f":"IF(AJ117<>\"\",VLOOKUP(AJ117,'Otras referencias'!$H$19:$I$20,2,FALSE),\"\")","v":""},null,{"$f":"IF(AL117<>\"\",VLOOKUP(AL117,'Otras referencias'!$H$19:$I$20,2,FALSE),\"\")","v":""}]
[null,{"$f":"IF(C118=\"\",\"\",IF(COUNTIF($C$3:C118, C118)>1, \"\", C118))","v":""},{"$f":"IF(J118=\"\",\"\",CONCATENATE(DIGITADOR!$M$1,J118,E118))","v":""},"",{"$f":"IF(H118=\"\",\"\",VLOOKUP(H118,'Otras referencias'!$A$24:$E$48,2,FALSE))","v":""},null,null,null,{"$f":"IF(H118=\"\",\"\",VLOOKUP(H118,'Otras referencias'!$A$24:$E$48,5,FALSE))","v":""},null,null,null,null,null,null,"",{"$f":"IF(AND(P118<>\"\",O118<>\"\"),IF(N118=\"A\",VLOOKUP(P118,'Otras referencias'!$J$24:$K$35,2,FALSE),IF(N118=\"B\",VLOOKUP(P118,'Otras referencias'!$N$24:$O$35,2,),IF(N118=\"C\",VLOOKUP(P118,'Otras referencias'!$R$24:$S$35,2,FALSE)))),\"\")","v":""},{"$f":"IF(S118=\"\",\"\",INDEX(referentes!$G$2:$H$5,MATCH(S118,referentes!$H$2:$H$5,0),1))","v":""},null,null,{"$f":"IF(T118=\"\",\"\",VLOOKUP(T118,referentes!$Q$2:$X$209,2,FALSE))","v":""},null,null,null,null,"",null,null,null,"",null,null,{"$f":"IF(AF118<>\"\",VLOOKUP(AF118,'Otras referencias'!$H$19:$I$20,2,FALSE),\"\")","v":""},null,{"$f":"IF(AH118<>\"\",VLOOKUP(AH118,'Otras referencias'!$H$19:$I$20,2,FALSE),\"\")","v":""},null,{"$f":"IF(AJ118<>\"\",VLOOKUP(AJ118,'Otras referencias'!$H$19:$I$20,2,FALSE),\"\")","v":""},null,{"$f":"IF(AL118<>\"\",VLOOKUP(AL118,'Otras referencias'!$H$19:$I$20,2,FALSE),\"\")","v":""}]
[null,{"$f":"IF(C119=\"\",\"\",IF(COUNTIF($C$3:C119, C119)>1, \"\", C119))","v":""},{"$f":"IF(J119=\"\",\"\",CONCATENATE(DIGITADOR!$M$1,J119,E119))","v":""},"",{"$f":"IF(H119=\"\",\"\",VLOOKUP(H119,'Otras referencias'!$A$24:$E$48,2,FALSE))","v":""},null,null,null,{"$f":"IF(H119=\"\",\"\",VLOOKUP(H119,'Otras referencias'!$A$24:$E$48,5,FALSE))","v":""},null,null,null,null,null,null,"",{"$f":"IF(AND(P119<>\"\",O119<>\"\"),IF(N119=\"A\",VLOOKUP(P119,'Otras referencias'!$J$24:$K$35,2,FALSE),IF(N119=\"B\",VLOOKUP(P119,'Otras referencias'!$N$24:$O$35,2,),IF(N119=\"C\",VLOOKUP(P119,'Otras referencias'!$R$24:$S$35,2,FALSE)))),\"\")","v":""},{"$f":"IF(S119=\"\",\"\",INDEX(referentes!$G$2:$H$5,MATCH(S119,referentes!$H$2:$H$5,0),1))","v":""},null,null,{"$f":"IF(T119=\"\",\"\",VLOOKUP(T119,referentes!$Q$2:$X$209,2,FALSE))","v":""},null,null,null,null,"",null,null,null,"",null,null,{"$f":"IF(AF119<>\"\",VLOOKUP(AF119,'Otras referencias'!$H$19:$I$20,2,FALSE),\"\")","v":""},null,{"$f":"IF(AH119<>\"\",VLOOKUP(AH119,'Otras referencias'!$H$19:$I$20,2,FALSE),\"\")","v":""},null,{"$f":"IF(AJ119<>\"\",VLOOKUP(AJ119,'Otras referencias'!$H$19:$I$20,2,FALSE),\"\")","v":""},null,{"$f":"IF(AL119<>\"\",VLOOKUP(AL119,'Otras referencias'!$H$19:$I$20,2,FALSE),\"\")","v":""}]
[null,{"$f":"IF(C120=\"\",\"\",IF(COUNTIF($C$3:C120, C120)>1, \"\", C120))","v":""},{"$f":"IF(J120=\"\",\"\",CONCATENATE(DIGITADOR!$M$1,J120,E120))","v":""},"",{"$f":"IF(H120=\"\",\"\",VLOOKUP(H120,'Otras referencias'!$A$24:$E$48,2,FALSE))","v":""},null,null,null,{"$f":"IF(H120=\"\",\"\",VLOOKUP(H120,'Otras referencias'!$A$24:$E$48,5,FALSE))","v":""},null,null,null,null,null,null,"",{"$f":"IF(AND(P120<>\"\",O120<>\"\"),IF(N120=\"A\",VLOOKUP(P120,'Otras referencias'!$J$24:$K$35,2,FALSE),IF(N120=\"B\",VLOOKUP(P120,'Otras referencias'!$N$24:$O$35,2,),IF(N120=\"C\",VLOOKUP(P120,'Otras referencias'!$R$24:$S$35,2,FALSE)))),\"\")","v":""},{"$f":"IF(S120=\"\",\"\",INDEX(referentes!$G$2:$H$5,MATCH(S120,referentes!$H$2:$H$5,0),1))","v":""},null,null,{"$f":"IF(T120=\"\",\"\",VLOOKUP(T120,referentes!$Q$2:$X$209,2,FALSE))","v":""},null,null,null,null,"",null,null,null,"",null,null,{"$f":"IF(AF120<>\"\",VLOOKUP(AF120,'Otras referencias'!$H$19:$I$20,2,FALSE),\"\")","v":""},null,{"$f":"IF(AH120<>\"\",VLOOKUP(AH120,'Otras referencias'!$H$19:$I$20,2,FALSE),\"\")","v":""},null,{"$f":"IF(AJ120<>\"\",VLOOKUP(AJ120,'Otras referencias'!$H$19:$I$20,2,FALSE),\"\")","v":""},null,{"$f":"IF(AL120<>\"\",VLOOKUP(AL120,'Otras referencias'!$H$19:$I$20,2,FALSE),\"\")","v":""}]
[null,{"$f":"IF(C121=\"\",\"\",IF(COUNTIF($C$3:C121, C121)>1, \"\", C121))","v":""},{"$f":"IF(J121=\"\",\"\",CONCATENATE(DIGITADOR!$M$1,J121,E121))","v":""},"",{"$f":"IF(H121=\"\",\"\",VLOOKUP(H121,'Otras referencias'!$A$24:$E$48,2,FALSE))","v":""},null,null,null,{"$f":"IF(H121=\"\",\"\",VLOOKUP(H121,'Otras referencias'!$A$24:$E$48,5,FALSE))","v":""},null,null,null,null,null,null,"",{"$f":"IF(AND(P121<>\"\",O121<>\"\"),IF(N121=\"A\",VLOOKUP(P121,'Otras referencias'!$J$24:$K$35,2,FALSE),IF(N121=\"B\",VLOOKUP(P121,'Otras referencias'!$N$24:$O$35,2,),IF(N121=\"C\",VLOOKUP(P121,'Otras referencias'!$R$24:$S$35,2,FALSE)))),\"\")","v":""},{"$f":"IF(S121=\"\",\"\",INDEX(referentes!$G$2:$H$5,MATCH(S121,referentes!$H$2:$H$5,0),1))","v":""},null,null,{"$f":"IF(T121=\"\",\"\",VLOOKUP(T121,referentes!$Q$2:$X$209,2,FALSE))","v":""},null,null,null,null,"",null,null,null,"",null,null,{"$f":"IF(AF121<>\"\",VLOOKUP(AF121,'Otras referencias'!$H$19:$I$20,2,FALSE),\"\")","v":""},null,{"$f":"IF(AH121<>\"\",VLOOKUP(AH121,'Otras referencias'!$H$19:$I$20,2,FALSE),\"\")","v":""},null,{"$f":"IF(AJ121<>\"\",VLOOKUP(AJ121,'Otras referencias'!$H$19:$I$20,2,FALSE),\"\")","v":""},null,{"$f":"IF(AL121<>\"\",VLOOKUP(AL121,'Otras referencias'!$H$19:$I$20,2,FALSE),\"\")","v":""}]
[null,{"$f":"IF(C122=\"\",\"\",IF(COUNTIF($C$3:C122, C122)>1, \"\", C122))","v":""},{"$f":"IF(J122=\"\",\"\",CONCATENATE(DIGITADOR!$M$1,J122,E122))","v":""},"",{"$f":"IF(H122=\"\",\"\",VLOOKUP(H122,'Otras referencias'!$A$24:$E$48,2,FALSE))","v":""},null,null,null,{"$f":"IF(H122=\"\",\"\",VLOOKUP(H122,'Otras referencias'!$A$24:$E$48,5,FALSE))","v":""},null,null,null,null,null,null,"",{"$f":"IF(AND(P122<>\"\",O122<>\"\"),IF(N122=\"A\",VLOOKUP(P122,'Otras referencias'!$J$24:$K$35,2,FALSE),IF(N122=\"B\",VLOOKUP(P122,'Otras referencias'!$N$24:$O$35,2,),IF(N122=\"C\",VLOOKUP(P122,'Otras referencias'!$R$24:$S$35,2,FALSE)))),\"\")","v":""},{"$f":"IF(S122=\"\",\"\",INDEX(referentes!$G$2:$H$5,MATCH(S122,referentes!$H$2:$H$5,0),1))","v":""},null,null,{"$f":"IF(T122=\"\",\"\",VLOOKUP(T122,referentes!$Q$2:$X$209,2,FALSE))","v":""},null,null,null,null,"",null,null,null,"",null,null,{"$f":"IF(AF122<>\"\",VLOOKUP(AF122,'Otras referencias'!$H$19:$I$20,2,FALSE),\"\")","v":""},null,{"$f":"IF(AH122<>\"\",VLOOKUP(AH122,'Otras referencias'!$H$19:$I$20,2,FALSE),\"\")","v":""},null,{"$f":"IF(AJ122<>\"\",VLOOKUP(AJ122,'Otras referencias'!$H$19:$I$20,2,FALSE),\"\")","v":""},null,{"$f":"IF(AL122<>\"\",VLOOKUP(AL122,'Otras referencias'!$H$19:$I$20,2,FALSE),\"\")","v":""}]
[null,{"$f":"IF(C123=\"\",\"\",IF(COUNTIF($C$3:C123, C123)>1, \"\", C123))","v":""},{"$f":"IF(J123=\"\",\"\",CONCATENATE(DIGITADOR!$M$1,J123,E123))","v":""},"",{"$f":"IF(H123=\"\",\"\",VLOOKUP(H123,'Otras referencias'!$A$24:$E$48,2,FALSE))","v":""},null,null,null,{"$f":"IF(H123=\"\",\"\",VLOOKUP(H123,'Otras referencias'!$A$24:$E$48,5,FALSE))","v":""},null,null,null,null,null,null,"",{"$f":"IF(AND(P123<>\"\",O123<>\"\"),IF(N123=\"A\",VLOOKUP(P123,'Otras referencias'!$J$24:$K$35,2,FALSE),IF(N123=\"B\",VLOOKUP(P123,'Otras referencias'!$N$24:$O$35,2,),IF(N123=\"C\",VLOOKUP(P123,'Otras referencias'!$R$24:$S$35,2,FALSE)))),\"\")","v":""},{"$f":"IF(S123=\"\",\"\",INDEX(referentes!$G$2:$H$5,MATCH(S123,referentes!$H$2:$H$5,0),1))","v":""},null,null,{"$f":"IF(T123=\"\",\"\",VLOOKUP(T123,referentes!$Q$2:$X$209,2,FALSE))","v":""},null,null,null,null,"",null,null,null,"",null,null,{"$f":"IF(AF123<>\"\",VLOOKUP(AF123,'Otras referencias'!$H$19:$I$20,2,FALSE),\"\")","v":""},null,{"$f":"IF(AH123<>\"\",VLOOKUP(AH123,'Otras referencias'!$H$19:$I$20,2,FALSE),\"\")","v":""},null,{"$f":"IF(AJ123<>\"\",VLOOKUP(AJ123,'Otras referencias'!$H$19:$I$20,2,FALSE),\"\")","v":""},null,{"$f":"IF(AL123<>\"\",VLOOKUP(AL123,'Otras referencias'!$H$19:$I$20,2,FALSE),\"\")","v":""}]
[null,{"$f":"IF(C124=\"\",\"\",IF(COUNTIF($C$3:C124, C124)>1, \"\", C124))","v":""},{"$f":"IF(J124=\"\",\"\",CONCATENATE(DIGITADOR!$M$1,J124,E124))","v":""},"",{"$f":"IF(H124=\"\",\"\",VLOOKUP(H124,'Otras referencias'!$A$24:$E$48,2,FALSE))","v":""},null,null,null,{"$f":"IF(H124=\"\",\"\",VLOOKUP(H124,'Otras referencias'!$A$24:$E$48,5,FALSE))","v":""},null,null,null,null,null,null,"",{"$f":"IF(AND(P124<>\"\",O124<>\"\"),IF(N124=\"A\",VLOOKUP(P124,'Otras referencias'!$J$24:$K$35,2,FALSE),IF(N124=\"B\",VLOOKUP(P124,'Otras referencias'!$N$24:$O$35,2,),IF(N124=\"C\",VLOOKUP(P124,'Otras referencias'!$R$24:$S$35,2,FALSE)))),\"\")","v":""},{"$f":"IF(S124=\"\",\"\",INDEX(referentes!$G$2:$H$5,MATCH(S124,referentes!$H$2:$H$5,0),1))","v":""},null,null,{"$f":"IF(T124=\"\",\"\",VLOOKUP(T124,referentes!$Q$2:$X$209,2,FALSE))","v":""},null,null,null,null,"",null,null,null,"",null,null,{"$f":"IF(AF124<>\"\",VLOOKUP(AF124,'Otras referencias'!$H$19:$I$20,2,FALSE),\"\")","v":""},null,{"$f":"IF(AH124<>\"\",VLOOKUP(AH124,'Otras referencias'!$H$19:$I$20,2,FALSE),\"\")","v":""},null,{"$f":"IF(AJ124<>\"\",VLOOKUP(AJ124,'Otras referencias'!$H$19:$I$20,2,FALSE),\"\")","v":""},null,{"$f":"IF(AL124<>\"\",VLOOKUP(AL124,'Otras referencias'!$H$19:$I$20,2,FALSE),\"\")","v":""}]
[null,{"$f":"IF(C125=\"\",\"\",IF(COUNTIF($C$3:C125, C125)>1, \"\", C125))","v":""},{"$f":"IF(J125=\"\",\"\",CONCATENATE(DIGITADOR!$M$1,J125,E125))","v":""},"",{"$f":"IF(H125=\"\",\"\",VLOOKUP(H125,'Otras referencias'!$A$24:$E$48,2,FALSE))","v":""},null,null,null,{"$f":"IF(H125=\"\",\"\",VLOOKUP(H125,'Otras referencias'!$A$24:$E$48,5,FALSE))","v":""},null,null,null,null,null,null,"",{"$f":"IF(AND(P125<>\"\",O125<>\"\"),IF(N125=\"A\",VLOOKUP(P125,'Otras referencias'!$J$24:$K$35,2,FALSE),IF(N125=\"B\",VLOOKUP(P125,'Otras referencias'!$N$24:$O$35,2,),IF(N125=\"C\",VLOOKUP(P125,'Otras referencias'!$R$24:$S$35,2,FALSE)))),\"\")","v":""},{"$f":"IF(S125=\"\",\"\",INDEX(referentes!$G$2:$H$5,MATCH(S125,referentes!$H$2:$H$5,0),1))","v":""},null,null,{"$f":"IF(T125=\"\",\"\",VLOOKUP(T125,referentes!$Q$2:$X$209,2,FALSE))","v":""},null,null,null,null,"",null,null,null,"",null,null,{"$f":"IF(AF125<>\"\",VLOOKUP(AF125,'Otras referencias'!$H$19:$I$20,2,FALSE),\"\")","v":""},null,{"$f":"IF(AH125<>\"\",VLOOKUP(AH125,'Otras referencias'!$H$19:$I$20,2,FALSE),\"\")","v":""},null,{"$f":"IF(AJ125<>\"\",VLOOKUP(AJ125,'Otras referencias'!$H$19:$I$20,2,FALSE),\"\")","v":""},null,{"$f":"IF(AL125<>\"\",VLOOKUP(AL125,'Otras referencias'!$H$19:$I$20,2,FALSE),\"\")","v":""}]
[null,{"$f":"IF(C126=\"\",\"\",IF(COUNTIF($C$3:C126, C126)>1, \"\", C126))","v":""},{"$f":"IF(J126=\"\",\"\",CONCATENATE(DIGITADOR!$M$1,J126,E126))","v":""},"",{"$f":"IF(H126=\"\",\"\",VLOOKUP(H126,'Otras referencias'!$A$24:$E$48,2,FALSE))","v":""},null,null,null,{"$f":"IF(H126=\"\",\"\",VLOOKUP(H126,'Otras referencias'!$A$24:$E$48,5,FALSE))","v":""},null,null,null,null,null,null,"",{"$f":"IF(AND(P126<>\"\",O126<>\"\"),IF(N126=\"A\",VLOOKUP(P126,'Otras referencias'!$J$24:$K$35,2,FALSE),IF(N126=\"B\",VLOOKUP(P126,'Otras referencias'!$N$24:$O$35,2,),IF(N126=\"C\",VLOOKUP(P126,'Otras referencias'!$R$24:$S$35,2,FALSE)))),\"\")","v":""},{"$f":"IF(S126=\"\",\"\",INDEX(referentes!$G$2:$H$5,MATCH(S126,referentes!$H$2:$H$5,0),1))","v":""},null,null,{"$f":"IF(T126=\"\",\"\",VLOOKUP(T126,referentes!$Q$2:$X$209,2,FALSE))","v":""},null,null,null,null,"",null,null,null,"",null,null,{"$f":"IF(AF126<>\"\",VLOOKUP(AF126,'Otras referencias'!$H$19:$I$20,2,FALSE),\"\")","v":""},null,{"$f":"IF(AH126<>\"\",VLOOKUP(AH126,'Otras referencias'!$H$19:$I$20,2,FALSE),\"\")","v":""},null,{"$f":"IF(AJ126<>\"\",VLOOKUP(AJ126,'Otras referencias'!$H$19:$I$20,2,FALSE),\"\")","v":""},null,{"$f":"IF(AL126<>\"\",VLOOKUP(AL126,'Otras referencias'!$H$19:$I$20,2,FALSE),\"\")","v":""}]
[null,{"$f":"IF(C127=\"\",\"\",IF(COUNTIF($C$3:C127, C127)>1, \"\", C127))","v":""},{"$f":"IF(J127=\"\",\"\",CONCATENATE(DIGITADOR!$M$1,J127,E127))","v":""},"",{"$f":"IF(H127=\"\",\"\",VLOOKUP(H127,'Otras referencias'!$A$24:$E$48,2,FALSE))","v":""},null,null,null,{"$f":"IF(H127=\"\",\"\",VLOOKUP(H127,'Otras referencias'!$A$24:$E$48,5,FALSE))","v":""},null,null,null,null,null,null,"",{"$f":"IF(AND(P127<>\"\",O127<>\"\"),IF(N127=\"A\",VLOOKUP(P127,'Otras referencias'!$J$24:$K$35,2,FALSE),IF(N127=\"B\",VLOOKUP(P127,'Otras referencias'!$N$24:$O$35,2,),IF(N127=\"C\",VLOOKUP(P127,'Otras referencias'!$R$24:$S$35,2,FALSE)))),\"\")","v":""},{"$f":"IF(S127=\"\",\"\",INDEX(referentes!$G$2:$H$5,MATCH(S127,referentes!$H$2:$H$5,0),1))","v":""},null,null,{"$f":"IF(T127=\"\",\"\",VLOOKUP(T127,referentes!$Q$2:$X$209,2,FALSE))","v":""},null,null,null,null,"",null,null,null,"",null,null,{"$f":"IF(AF127<>\"\",VLOOKUP(AF127,'Otras referencias'!$H$19:$I$20,2,FALSE),\"\")","v":""},null,{"$f":"IF(AH127<>\"\",VLOOKUP(AH127,'Otras referencias'!$H$19:$I$20,2,FALSE),\"\")","v":""},null,{"$f":"IF(AJ127<>\"\",VLOOKUP(AJ127,'Otras referencias'!$H$19:$I$20,2,FALSE),\"\")","v":""},null,{"$f":"IF(AL127<>\"\",VLOOKUP(AL127,'Otras referencias'!$H$19:$I$20,2,FALSE),\"\")","v":""}]
[null,{"$f":"IF(C128=\"\",\"\",IF(COUNTIF($C$3:C128, C128)>1, \"\", C128))","v":""},{"$f":"IF(J128=\"\",\"\",CONCATENATE(DIGITADOR!$M$1,J128,E128))","v":""},"",{"$f":"IF(H128=\"\",\"\",VLOOKUP(H128,'Otras referencias'!$A$24:$E$48,2,FALSE))","v":""},null,null,null,{"$f":"IF(H128=\"\",\"\",VLOOKUP(H128,'Otras referencias'!$A$24:$E$48,5,FALSE))","v":""},null,null,null,null,null,null,"",{"$f":"IF(AND(P128<>\"\",O128<>\"\"),IF(N128=\"A\",VLOOKUP(P128,'Otras referencias'!$J$24:$K$35,2,FALSE),IF(N128=\"B\",VLOOKUP(P128,'Otras referencias'!$N$24:$O$35,2,),IF(N128=\"C\",VLOOKUP(P128,'Otras referencias'!$R$24:$S$35,2,FALSE)))),\"\")","v":""},{"$f":"IF(S128=\"\",\"\",INDEX(referentes!$G$2:$H$5,MATCH(S128,referentes!$H$2:$H$5,0),1))","v":""},null,null,{"$f":"IF(T128=\"\",\"\",VLOOKUP(T128,referentes!$Q$2:$X$209,2,FALSE))","v":""},null,null,null,null,"",null,null,null,"",null,null,{"$f":"IF(AF128<>\"\",VLOOKUP(AF128,'Otras referencias'!$H$19:$I$20,2,FALSE),\"\")","v":""},null,{"$f":"IF(AH128<>\"\",VLOOKUP(AH128,'Otras referencias'!$H$19:$I$20,2,FALSE),\"\")","v":""},null,{"$f":"IF(AJ128<>\"\",VLOOKUP(AJ128,'Otras referencias'!$H$19:$I$20,2,FALSE),\"\")","v":""},null,{"$f":"IF(AL128<>\"\",VLOOKUP(AL128,'Otras referencias'!$H$19:$I$20,2,FALSE),\"\")","v":""}]
[null,{"$f":"IF(C129=\"\",\"\",IF(COUNTIF($C$3:C129, C129)>1, \"\", C129))","v":""},{"$f":"IF(J129=\"\",\"\",CONCATENATE(DIGITADOR!$M$1,J129,E129))","v":""},"",{"$f":"IF(H129=\"\",\"\",VLOOKUP(H129,'Otras referencias'!$A$24:$E$48,2,FALSE))","v":""},null,null,null,{"$f":"IF(H129=\"\",\"\",VLOOKUP(H129,'Otras referencias'!$A$24:$E$48,5,FALSE))","v":""},null,null,null,null,null,null,"",{"$f":"IF(AND(P129<>\"\",O129<>\"\"),IF(N129=\"A\",VLOOKUP(P129,'Otras referencias'!$J$24:$K$35,2,FALSE),IF(N129=\"B\",VLOOKUP(P129,'Otras referencias'!$N$24:$O$35,2,),IF(N129=\"C\",VLOOKUP(P129,'Otras referencias'!$R$24:$S$35,2,FALSE)))),\"\")","v":""},{"$f":"IF(S129=\"\",\"\",INDEX(referentes!$G$2:$H$5,MATCH(S129,referentes!$H$2:$H$5,0),1))","v":""},null,null,{"$f":"IF(T129=\"\",\"\",VLOOKUP(T129,referentes!$Q$2:$X$209,2,FALSE))","v":""},null,null,null,null,"",null,null,null,"",null,null,{"$f":"IF(AF129<>\"\",VLOOKUP(AF129,'Otras referencias'!$H$19:$I$20,2,FALSE),\"\")","v":""},null,{"$f":"IF(AH129<>\"\",VLOOKUP(AH129,'Otras referencias'!$H$19:$I$20,2,FALSE),\"\")","v":""},null,{"$f":"IF(AJ129<>\"\",VLOOKUP(AJ129,'Otras referencias'!$H$19:$I$20,2,FALSE),\"\")","v":""},null,{"$f":"IF(AL129<>\"\",VLOOKUP(AL129,'Otras referencias'!$H$19:$I$20,2,FALSE),\"\")","v":""}]
[null,{"$f":"IF(C130=\"\",\"\",IF(COUNTIF($C$3:C130, C130)>1, \"\", C130))","v":""},{"$f":"IF(J130=\"\",\"\",CONCATENATE(DIGITADOR!$M$1,J130,E130))","v":""},"",{"$f":"IF(H130=\"\",\"\",VLOOKUP(H130,'Otras referencias'!$A$24:$E$48,2,FALSE))","v":""},null,null,null,{"$f":"IF(H130=\"\",\"\",VLOOKUP(H130,'Otras referencias'!$A$24:$E$48,5,FALSE))","v":""},null,null,null,null,null,null,"",{"$f":"IF(AND(P130<>\"\",O130<>\"\"),IF(N130=\"A\",VLOOKUP(P130,'Otras referencias'!$J$24:$K$35,2,FALSE),IF(N130=\"B\",VLOOKUP(P130,'Otras referencias'!$N$24:$O$35,2,),IF(N130=\"C\",VLOOKUP(P130,'Otras referencias'!$R$24:$S$35,2,FALSE)))),\"\")","v":""},{"$f":"IF(S130=\"\",\"\",INDEX(referentes!$G$2:$H$5,MATCH(S130,referentes!$H$2:$H$5,0),1))","v":""},null,null,{"$f":"IF(T130=\"\",\"\",VLOOKUP(T130,referentes!$Q$2:$X$209,2,FALSE))","v":""},null,null,null,null,"",null,null,null,"",null,null,{"$f":"IF(AF130<>\"\",VLOOKUP(AF130,'Otras referencias'!$H$19:$I$20,2,FALSE),\"\")","v":""},null,{"$f":"IF(AH130<>\"\",VLOOKUP(AH130,'Otras referencias'!$H$19:$I$20,2,FALSE),\"\")","v":""},null,{"$f":"IF(AJ130<>\"\",VLOOKUP(AJ130,'Otras referencias'!$H$19:$I$20,2,FALSE),\"\")","v":""},null,{"$f":"IF(AL130<>\"\",VLOOKUP(AL130,'Otras referencias'!$H$19:$I$20,2,FALSE),\"\")","v":""}]
[null,{"$f":"IF(C131=\"\",\"\",IF(COUNTIF($C$3:C131, C131)>1, \"\", C131))","v":""},{"$f":"IF(J131=\"\",\"\",CONCATENATE(DIGITADOR!$M$1,J131,E131))","v":""},"",{"$f":"IF(H131=\"\",\"\",VLOOKUP(H131,'Otras referencias'!$A$24:$E$48,2,FALSE))","v":""},null,null,null,{"$f":"IF(H131=\"\",\"\",VLOOKUP(H131,'Otras referencias'!$A$24:$E$48,5,FALSE))","v":""},null,null,null,null,null,null,"",{"$f":"IF(AND(P131<>\"\",O131<>\"\"),IF(N131=\"A\",VLOOKUP(P131,'Otras referencias'!$J$24:$K$35,2,FALSE),IF(N131=\"B\",VLOOKUP(P131,'Otras referencias'!$N$24:$O$35,2,),IF(N131=\"C\",VLOOKUP(P131,'Otras referencias'!$R$24:$S$35,2,FALSE)))),\"\")","v":""},{"$f":"IF(S131=\"\",\"\",INDEX(referentes!$G$2:$H$5,MATCH(S131,referentes!$H$2:$H$5,0),1))","v":""},null,null,{"$f":"IF(T131=\"\",\"\",VLOOKUP(T131,referentes!$Q$2:$X$209,2,FALSE))","v":""},null,null,null,null,"",null,null,null,"",null,null,{"$f":"IF(AF131<>\"\",VLOOKUP(AF131,'Otras referencias'!$H$19:$I$20,2,FALSE),\"\")","v":""},null,{"$f":"IF(AH131<>\"\",VLOOKUP(AH131,'Otras referencias'!$H$19:$I$20,2,FALSE),\"\")","v":""},null,{"$f":"IF(AJ131<>\"\",VLOOKUP(AJ131,'Otras referencias'!$H$19:$I$20,2,FALSE),\"\")","v":""},null,{"$f":"IF(AL131<>\"\",VLOOKUP(AL131,'Otras referencias'!$H$19:$I$20,2,FALSE),\"\")","v":""}]
[null,{"$f":"IF(C132=\"\",\"\",IF(COUNTIF($C$3:C132, C132)>1, \"\", C132))","v":""},{"$f":"IF(J132=\"\",\"\",CONCATENATE(DIGITADOR!$M$1,J132,E132))","v":""},{"$f":"IF(C132=\"\",\"\",CONCATENATE(C132,ROW()-2))","v":""},{"$f":"IF(H132=\"\",\"\",VLOOKUP(H132,'Otras referencias'!$A$24:$E$48,2,FALSE))","v":""},null,null,null,{"$f":"IF(H132=\"\",\"\",VLOOKUP(H132,'Otras referencias'!$A$24:$E$48,5,FALSE))","v":""},null,null,null,null,null,null,{"$f":"CONCATENATE(N132,O132)","v":""},{"$f":"IF(AND(P132<>\"\",O132<>\"\"),IF(N132=\"A\",VLOOKUP(P132,'Otras referencias'!$J$24:$K$35,2,FALSE),IF(N132=\"B\",VLOOKUP(P132,'Otras referencias'!$N$24:$O$35,2,),IF(N132=\"C\",VLOOKUP(P132,'Otras referencias'!$R$24:$S$35,2,FALSE)))),\"\")","v":""},{"$f":"IF(S132=\"\",\"\",INDEX(referentes!$G$2:$H$5,MATCH(S132,referentes!$H$2:$H$5,0),1))","v":""},null,null,{"$f":"IF(T132=\"\",\"\",VLOOKUP(T132,referentes!$Q$2:$X$209,2,FALSE))","v":""},null,null,null,null,{"$f":"IF(OR(W132=\"\",X132=\"\",Y132=\"\"),\"\",AVERAGE(W132,X132,Y132))","v":""},null,null,null,{"$f":"IF(OR(AA132=\"\",AB132=\"\",AC132=\"\"),\"\",AVERAGE(AA132,AB132,AC132))","v":""},null,null,{"$f":"IF(AF132<>\"\",VLOOKUP(AF132,'Otras referencias'!$H$19:$I$20,2,FALSE),\"\")","v":""},null,{"$f":"IF(AH132<>\"\",VLOOKUP(AH132,'Otras referencias'!$H$19:$I$20,2,FALSE),\"\")","v":""},null,{"$f":"IF(AJ132<>\"\",VLOOKUP(AJ132,'Otras referencias'!$H$19:$I$20,2,FALSE),\"\")","v":""},null,{"$f":"IF(AL132<>\"\",VLOOKUP(AL132,'Otras referencias'!$H$19:$I$20,2,FALSE),\"\")","v":""}]
[null,{"$f":"IF(C133=\"\",\"\",IF(COUNTIF($C$3:C133, C133)>1, \"\", C133))","v":""},{"$f":"IF(J133=\"\",\"\",CONCATENATE(DIGITADOR!$M$1,J133,E133))","v":""},"",{"$f":"IF(H133=\"\",\"\",VLOOKUP(H133,'Otras referencias'!$A$24:$E$48,2,FALSE))","v":""},null,null,null,{"$f":"IF(H133=\"\",\"\",VLOOKUP(H133,'Otras referencias'!$A$24:$E$48,5,FALSE))","v":""},null,null,null,null,null,null,"",{"$f":"IF(AND(P133<>\"\",O133<>\"\"),IF(N133=\"A\",VLOOKUP(P133,'Otras referencias'!$J$24:$K$35,2,FALSE),IF(N133=\"B\",VLOOKUP(P133,'Otras referencias'!$N$24:$O$35,2,),IF(N133=\"C\",VLOOKUP(P133,'Otras referencias'!$R$24:$S$35,2,FALSE)))),\"\")","v":""},{"$f":"IF(S133=\"\",\"\",INDEX(referentes!$G$2:$H$5,MATCH(S133,referentes!$H$2:$H$5,0),1))","v":""},null,null,{"$f":"IF(T133=\"\",\"\",VLOOKUP(T133,referentes!$Q$2:$X$209,2,FALSE))","v":""},null,null,null,null,"",null,null,null,"",null,null,{"$f":"IF(AF133<>\"\",VLOOKUP(AF133,'Otras referencias'!$H$19:$I$20,2,FALSE),\"\")","v":""},null,{"$f":"IF(AH133<>\"\",VLOOKUP(AH133,'Otras referencias'!$H$19:$I$20,2,FALSE),\"\")","v":""},null,{"$f":"IF(AJ133<>\"\",VLOOKUP(AJ133,'Otras referencias'!$H$19:$I$20,2,FALSE),\"\")","v":""},null,{"$f":"IF(AL133<>\"\",VLOOKUP(AL133,'Otras referencias'!$H$19:$I$20,2,FALSE),\"\")","v":""}]
[null,{"$f":"IF(C134=\"\",\"\",IF(COUNTIF($C$3:C134, C134)>1, \"\", C134))","v":""},{"$f":"IF(J134=\"\",\"\",CONCATENATE(DIGITADOR!$M$1,J134,E134))","v":""},"",{"$f":"IF(H134=\"\",\"\",VLOOKUP(H134,'Otras referencias'!$A$24:$E$48,2,FALSE))","v":""},null,null,null,{"$f":"IF(H134=\"\",\"\",VLOOKUP(H134,'Otras referencias'!$A$24:$E$48,5,FALSE))","v":""},null,null,null,null,null,null,"",{"$f":"IF(AND(P134<>\"\",O134<>\"\"),IF(N134=\"A\",VLOOKUP(P134,'Otras referencias'!$J$24:$K$35,2,FALSE),IF(N134=\"B\",VLOOKUP(P134,'Otras referencias'!$N$24:$O$35,2,),IF(N134=\"C\",VLOOKUP(P134,'Otras referencias'!$R$24:$S$35,2,FALSE)))),\"\")","v":""},{"$f":"IF(S134=\"\",\"\",INDEX(referentes!$G$2:$H$5,MATCH(S134,referentes!$H$2:$H$5,0),1))","v":""},null,null,{"$f":"IF(T134=\"\",\"\",VLOOKUP(T134,referentes!$Q$2:$X$209,2,FALSE))","v":""},null,null,null,null,"",null,null,null,"",null,null,{"$f":"IF(AF134<>\"\",VLOOKUP(AF134,'Otras referencias'!$H$19:$I$20,2,FALSE),\"\")","v":""},null,{"$f":"IF(AH134<>\"\",VLOOKUP(AH134,'Otras referencias'!$H$19:$I$20,2,FALSE),\"\")","v":""},null,{"$f":"IF(AJ134<>\"\",VLOOKUP(AJ134,'Otras referencias'!$H$19:$I$20,2,FALSE),\"\")","v":""},null,{"$f":"IF(AL134<>\"\",VLOOKUP(AL134,'Otras referencias'!$H$19:$I$20,2,FALSE),\"\")","v":""}]
[null,{"$f":"IF(C135=\"\",\"\",IF(COUNTIF($C$3:C135, C135)>1, \"\", C135))","v":""},{"$f":"IF(J135=\"\",\"\",CONCATENATE(DIGITADOR!$M$1,J135,E135))","v":""},"",{"$f":"IF(H135=\"\",\"\",VLOOKUP(H135,'Otras referencias'!$A$24:$E$48,2,FALSE))","v":""},null,null,null,{"$f":"IF(H135=\"\",\"\",VLOOKUP(H135,'Otras referencias'!$A$24:$E$48,5,FALSE))","v":""},null,null,null,null,null,null,"",{"$f":"IF(AND(P135<>\"\",O135<>\"\"),IF(N135=\"A\",VLOOKUP(P135,'Otras referencias'!$J$24:$K$35,2,FALSE),IF(N135=\"B\",VLOOKUP(P135,'Otras referencias'!$N$24:$O$35,2,),IF(N135=\"C\",VLOOKUP(P135,'Otras referencias'!$R$24:$S$35,2,FALSE)))),\"\")","v":""},{"$f":"IF(S135=\"\",\"\",INDEX(referentes!$G$2:$H$5,MATCH(S135,referentes!$H$2:$H$5,0),1))","v":""},null,null,{"$f":"IF(T135=\"\",\"\",VLOOKUP(T135,referentes!$Q$2:$X$209,2,FALSE))","v":""},null,null,null,null,"",null,null,null,"",null,null,{"$f":"IF(AF135<>\"\",VLOOKUP(AF135,'Otras referencias'!$H$19:$I$20,2,FALSE),\"\")","v":""},null,{"$f":"IF(AH135<>\"\",VLOOKUP(AH135,'Otras referencias'!$H$19:$I$20,2,FALSE),\"\")","v":""},null,{"$f":"IF(AJ135<>\"\",VLOOKUP(AJ135,'Otras referencias'!$H$19:$I$20,2,FALSE),\"\")","v":""},null,{"$f":"IF(AL135<>\"\",VLOOKUP(AL135,'Otras referencias'!$H$19:$I$20,2,FALSE),\"\")","v":""}]
[null,{"$f":"IF(C136=\"\",\"\",IF(COUNTIF($C$3:C136, C136)>1, \"\", C136))","v":""},{"$f":"IF(J136=\"\",\"\",CONCATENATE(DIGITADOR!$M$1,J136,E136))","v":""},"",{"$f":"IF(H136=\"\",\"\",VLOOKUP(H136,'Otras referencias'!$A$24:$E$48,2,FALSE))","v":""},null,null,null,{"$f":"IF(H136=\"\",\"\",VLOOKUP(H136,'Otras referencias'!$A$24:$E$48,5,FALSE))","v":""},null,null,null,null,null,null,"",{"$f":"IF(AND(P136<>\"\",O136<>\"\"),IF(N136=\"A\",VLOOKUP(P136,'Otras referencias'!$J$24:$K$35,2,FALSE),IF(N136=\"B\",VLOOKUP(P136,'Otras referencias'!$N$24:$O$35,2,),IF(N136=\"C\",VLOOKUP(P136,'Otras referencias'!$R$24:$S$35,2,FALSE)))),\"\")","v":""},{"$f":"IF(S136=\"\",\"\",INDEX(referentes!$G$2:$H$5,MATCH(S136,referentes!$H$2:$H$5,0),1))","v":""},null,null,{"$f":"IF(T136=\"\",\"\",VLOOKUP(T136,referentes!$Q$2:$X$209,2,FALSE))","v":""},null,null,null,null,"",null,null,null,"",null,null,{"$f":"IF(AF136<>\"\",VLOOKUP(AF136,'Otras referencias'!$H$19:$I$20,2,FALSE),\"\")","v":""},null,{"$f":"IF(AH136<>\"\",VLOOKUP(AH136,'Otras referencias'!$H$19:$I$20,2,FALSE),\"\")","v":""},null,{"$f":"IF(AJ136<>\"\",VLOOKUP(AJ136,'Otras referencias'!$H$19:$I$20,2,FALSE),\"\")","v":""},null,{"$f":"IF(AL136<>\"\",VLOOKUP(AL136,'Otras referencias'!$H$19:$I$20,2,FALSE),\"\")","v":""}]
[null,{"$f":"IF(C137=\"\",\"\",IF(COUNTIF($C$3:C137, C137)>1, \"\", C137))","v":""},{"$f":"IF(J137=\"\",\"\",CONCATENATE(DIGITADOR!$M$1,J137,E137))","v":""},"",{"$f":"IF(H137=\"\",\"\",VLOOKUP(H137,'Otras referencias'!$A$24:$E$48,2,FALSE))","v":""},null,null,null,{"$f":"IF(H137=\"\",\"\",VLOOKUP(H137,'Otras referencias'!$A$24:$E$48,5,FALSE))","v":""},null,null,null,null,null,null,"",{"$f":"IF(AND(P137<>\"\",O137<>\"\"),IF(N137=\"A\",VLOOKUP(P137,'Otras referencias'!$J$24:$K$35,2,FALSE),IF(N137=\"B\",VLOOKUP(P137,'Otras referencias'!$N$24:$O$35,2,),IF(N137=\"C\",VLOOKUP(P137,'Otras referencias'!$R$24:$S$35,2,FALSE)))),\"\")","v":""},{"$f":"IF(S137=\"\",\"\",INDEX(referentes!$G$2:$H$5,MATCH(S137,referentes!$H$2:$H$5,0),1))","v":""},null,null,{"$f":"IF(T137=\"\",\"\",VLOOKUP(T137,referentes!$Q$2:$X$209,2,FALSE))","v":""},null,null,null,null,"",null,null,null,"",null,null,{"$f":"IF(AF137<>\"\",VLOOKUP(AF137,'Otras referencias'!$H$19:$I$20,2,FALSE),\"\")","v":""},null,{"$f":"IF(AH137<>\"\",VLOOKUP(AH137,'Otras referencias'!$H$19:$I$20,2,FALSE),\"\")","v":""},null,{"$f":"IF(AJ137<>\"\",VLOOKUP(AJ137,'Otras referencias'!$H$19:$I$20,2,FALSE),\"\")","v":""},null,{"$f":"IF(AL137<>\"\",VLOOKUP(AL137,'Otras referencias'!$H$19:$I$20,2,FALSE),\"\")","v":""}]
[null,{"$f":"IF(C138=\"\",\"\",IF(COUNTIF($C$3:C138, C138)>1, \"\", C138))","v":""},{"$f":"IF(J138=\"\",\"\",CONCATENATE(DIGITADOR!$M$1,J138,E138))","v":""},"",{"$f":"IF(H138=\"\",\"\",VLOOKUP(H138,'Otras referencias'!$A$24:$E$48,2,FALSE))","v":""},null,null,null,{"$f":"IF(H138=\"\",\"\",VLOOKUP(H138,'Otras referencias'!$A$24:$E$48,5,FALSE))","v":""},null,null,null,null,null,null,"",{"$f":"IF(AND(P138<>\"\",O138<>\"\"),IF(N138=\"A\",VLOOKUP(P138,'Otras referencias'!$J$24:$K$35,2,FALSE),IF(N138=\"B\",VLOOKUP(P138,'Otras referencias'!$N$24:$O$35,2,),IF(N138=\"C\",VLOOKUP(P138,'Otras referencias'!$R$24:$S$35,2,FALSE)))),\"\")","v":""},{"$f":"IF(S138=\"\",\"\",INDEX(referentes!$G$2:$H$5,MATCH(S138,referentes!$H$2:$H$5,0),1))","v":""},null,null,{"$f":"IF(T138=\"\",\"\",VLOOKUP(T138,referentes!$Q$2:$X$209,2,FALSE))","v":""},null,null,null,null,"",null,null,null,"",null,null,{"$f":"IF(AF138<>\"\",VLOOKUP(AF138,'Otras referencias'!$H$19:$I$20,2,FALSE),\"\")","v":""},null,{"$f":"IF(AH138<>\"\",VLOOKUP(AH138,'Otras referencias'!$H$19:$I$20,2,FALSE),\"\")","v":""},null,{"$f":"IF(AJ138<>\"\",VLOOKUP(AJ138,'Otras referencias'!$H$19:$I$20,2,FALSE),\"\")","v":""},null,{"$f":"IF(AL138<>\"\",VLOOKUP(AL138,'Otras referencias'!$H$19:$I$20,2,FALSE),\"\")","v":""}]
[null,{"$f":"IF(C139=\"\",\"\",IF(COUNTIF($C$3:C139, C139)>1, \"\", C139))","v":""},{"$f":"IF(J139=\"\",\"\",CONCATENATE(DIGITADOR!$M$1,J139,E139))","v":""},"",{"$f":"IF(H139=\"\",\"\",VLOOKUP(H139,'Otras referencias'!$A$24:$E$48,2,FALSE))","v":""},null,null,null,{"$f":"IF(H139=\"\",\"\",VLOOKUP(H139,'Otras referencias'!$A$24:$E$48,5,FALSE))","v":""},null,null,null,null,null,null,"",{"$f":"IF(AND(P139<>\"\",O139<>\"\"),IF(N139=\"A\",VLOOKUP(P139,'Otras referencias'!$J$24:$K$35,2,FALSE),IF(N139=\"B\",VLOOKUP(P139,'Otras referencias'!$N$24:$O$35,2,),IF(N139=\"C\",VLOOKUP(P139,'Otras referencias'!$R$24:$S$35,2,FALSE)))),\"\")","v":""},{"$f":"IF(S139=\"\",\"\",INDEX(referentes!$G$2:$H$5,MATCH(S139,referentes!$H$2:$H$5,0),1))","v":""},null,null,{"$f":"IF(T139=\"\",\"\",VLOOKUP(T139,referentes!$Q$2:$X$209,2,FALSE))","v":""},null,null,null,null,"",null,null,null,"",null,null,{"$f":"IF(AF139<>\"\",VLOOKUP(AF139,'Otras referencias'!$H$19:$I$20,2,FALSE),\"\")","v":""},null,{"$f":"IF(AH139<>\"\",VLOOKUP(AH139,'Otras referencias'!$H$19:$I$20,2,FALSE),\"\")","v":""},null,{"$f":"IF(AJ139<>\"\",VLOOKUP(AJ139,'Otras referencias'!$H$19:$I$20,2,FALSE),\"\")","v":""},null,{"$f":"IF(AL139<>\"\",VLOOKUP(AL139,'Otras referencias'!$H$19:$I$20,2,FALSE),\"\")","v":""}]
[null,{"$f":"IF(C140=\"\",\"\",IF(COUNTIF($C$3:C140, C140)>1, \"\", C140))","v":""},{"$f":"IF(J140=\"\",\"\",CONCATENATE(DIGITADOR!$M$1,J140,E140))","v":""},"",{"$f":"IF(H140=\"\",\"\",VLOOKUP(H140,'Otras referencias'!$A$24:$E$48,2,FALSE))","v":""},null,null,null,{"$f":"IF(H140=\"\",\"\",VLOOKUP(H140,'Otras referencias'!$A$24:$E$48,5,FALSE))","v":""},null,null,null,null,null,null,"",{"$f":"IF(AND(P140<>\"\",O140<>\"\"),IF(N140=\"A\",VLOOKUP(P140,'Otras referencias'!$J$24:$K$35,2,FALSE),IF(N140=\"B\",VLOOKUP(P140,'Otras referencias'!$N$24:$O$35,2,),IF(N140=\"C\",VLOOKUP(P140,'Otras referencias'!$R$24:$S$35,2,FALSE)))),\"\")","v":""},{"$f":"IF(S140=\"\",\"\",INDEX(referentes!$G$2:$H$5,MATCH(S140,referentes!$H$2:$H$5,0),1))","v":""},null,null,{"$f":"IF(T140=\"\",\"\",VLOOKUP(T140,referentes!$Q$2:$X$209,2,FALSE))","v":""},null,null,null,null,"",null,null,null,"",null,null,{"$f":"IF(AF140<>\"\",VLOOKUP(AF140,'Otras referencias'!$H$19:$I$20,2,FALSE),\"\")","v":""},null,{"$f":"IF(AH140<>\"\",VLOOKUP(AH140,'Otras referencias'!$H$19:$I$20,2,FALSE),\"\")","v":""},null,{"$f":"IF(AJ140<>\"\",VLOOKUP(AJ140,'Otras referencias'!$H$19:$I$20,2,FALSE),\"\")","v":""},null,{"$f":"IF(AL140<>\"\",VLOOKUP(AL140,'Otras referencias'!$H$19:$I$20,2,FALSE),\"\")","v":""}]
[null,{"$f":"IF(C141=\"\",\"\",IF(COUNTIF($C$3:C141, C141)>1, \"\", C141))","v":""},{"$f":"IF(J141=\"\",\"\",CONCATENATE(DIGITADOR!$M$1,J141,E141))","v":""},"",{"$f":"IF(H141=\"\",\"\",VLOOKUP(H141,'Otras referencias'!$A$24:$E$48,2,FALSE))","v":""},null,null,null,{"$f":"IF(H141=\"\",\"\",VLOOKUP(H141,'Otras referencias'!$A$24:$E$48,5,FALSE))","v":""},null,null,null,null,null,null,"",{"$f":"IF(AND(P141<>\"\",O141<>\"\"),IF(N141=\"A\",VLOOKUP(P141,'Otras referencias'!$J$24:$K$35,2,FALSE),IF(N141=\"B\",VLOOKUP(P141,'Otras referencias'!$N$24:$O$35,2,),IF(N141=\"C\",VLOOKUP(P141,'Otras referencias'!$R$24:$S$35,2,FALSE)))),\"\")","v":""},{"$f":"IF(S141=\"\",\"\",INDEX(referentes!$G$2:$H$5,MATCH(S141,referentes!$H$2:$H$5,0),1))","v":""},null,null,{"$f":"IF(T141=\"\",\"\",VLOOKUP(T141,referentes!$Q$2:$X$209,2,FALSE))","v":""},null,null,null,null,"",null,null,null,"",null,null,{"$f":"IF(AF141<>\"\",VLOOKUP(AF141,'Otras referencias'!$H$19:$I$20,2,FALSE),\"\")","v":""},null,{"$f":"IF(AH141<>\"\",VLOOKUP(AH141,'Otras referencias'!$H$19:$I$20,2,FALSE),\"\")","v":""},null,{"$f":"IF(AJ141<>\"\",VLOOKUP(AJ141,'Otras referencias'!$H$19:$I$20,2,FALSE),\"\")","v":""},null,{"$f":"IF(AL141<>\"\",VLOOKUP(AL141,'Otras referencias'!$H$19:$I$20,2,FALSE),\"\")","v":""}]
[null,{"$f":"IF(C142=\"\",\"\",IF(COUNTIF($C$3:C142, C142)>1, \"\", C142))","v":""},{"$f":"IF(J142=\"\",\"\",CONCATENATE(DIGITADOR!$M$1,J142,E142))","v":""},"",{"$f":"IF(H142=\"\",\"\",VLOOKUP(H142,'Otras referencias'!$A$24:$E$48,2,FALSE))","v":""},null,null,null,{"$f":"IF(H142=\"\",\"\",VLOOKUP(H142,'Otras referencias'!$A$24:$E$48,5,FALSE))","v":""},null,null,null,null,null,null,"",{"$f":"IF(AND(P142<>\"\",O142<>\"\"),IF(N142=\"A\",VLOOKUP(P142,'Otras referencias'!$J$24:$K$35,2,FALSE),IF(N142=\"B\",VLOOKUP(P142,'Otras referencias'!$N$24:$O$35,2,),IF(N142=\"C\",VLOOKUP(P142,'Otras referencias'!$R$24:$S$35,2,FALSE)))),\"\")","v":""},{"$f":"IF(S142=\"\",\"\",INDEX(referentes!$G$2:$H$5,MATCH(S142,referentes!$H$2:$H$5,0),1))","v":""},null,null,{"$f":"IF(T142=\"\",\"\",VLOOKUP(T142,referentes!$Q$2:$X$209,2,FALSE))","v":""},null,null,null,null,"",null,null,null,"",null,null,{"$f":"IF(AF142<>\"\",VLOOKUP(AF142,'Otras referencias'!$H$19:$I$20,2,FALSE),\"\")","v":""},null,{"$f":"IF(AH142<>\"\",VLOOKUP(AH142,'Otras referencias'!$H$19:$I$20,2,FALSE),\"\")","v":""},null,{"$f":"IF(AJ142<>\"\",VLOOKUP(AJ142,'Otras referencias'!$H$19:$I$20,2,FALSE),\"\")","v":""},null,{"$f":"IF(AL142<>\"\",VLOOKUP(AL142,'Otras referencias'!$H$19:$I$20,2,FALSE),\"\")","v":""}]
[null,{"$f":"IF(C143=\"\",\"\",IF(COUNTIF($C$3:C143, C143)>1, \"\", C143))","v":""},{"$f":"IF(J143=\"\",\"\",CONCATENATE(DIGITADOR!$M$1,J143,E143))","v":""},"",{"$f":"IF(H143=\"\",\"\",VLOOKUP(H143,'Otras referencias'!$A$24:$E$48,2,FALSE))","v":""},null,null,null,{"$f":"IF(H143=\"\",\"\",VLOOKUP(H143,'Otras referencias'!$A$24:$E$48,5,FALSE))","v":""},null,null,null,null,null,null,"",{"$f":"IF(AND(P143<>\"\",O143<>\"\"),IF(N143=\"A\",VLOOKUP(P143,'Otras referencias'!$J$24:$K$35,2,FALSE),IF(N143=\"B\",VLOOKUP(P143,'Otras referencias'!$N$24:$O$35,2,),IF(N143=\"C\",VLOOKUP(P143,'Otras referencias'!$R$24:$S$35,2,FALSE)))),\"\")","v":""},{"$f":"IF(S143=\"\",\"\",INDEX(referentes!$G$2:$H$5,MATCH(S143,referentes!$H$2:$H$5,0),1))","v":""},null,null,{"$f":"IF(T143=\"\",\"\",VLOOKUP(T143,referentes!$Q$2:$X$209,2,FALSE))","v":""},null,null,null,null,"",null,null,null,"",null,null,{"$f":"IF(AF143<>\"\",VLOOKUP(AF143,'Otras referencias'!$H$19:$I$20,2,FALSE),\"\")","v":""},null,{"$f":"IF(AH143<>\"\",VLOOKUP(AH143,'Otras referencias'!$H$19:$I$20,2,FALSE),\"\")","v":""},null,{"$f":"IF(AJ143<>\"\",VLOOKUP(AJ143,'Otras referencias'!$H$19:$I$20,2,FALSE),\"\")","v":""},null,{"$f":"IF(AL143<>\"\",VLOOKUP(AL143,'Otras referencias'!$H$19:$I$20,2,FALSE),\"\")","v":""}]
[null,{"$f":"IF(C144=\"\",\"\",IF(COUNTIF($C$3:C144, C144)>1, \"\", C144))","v":""},{"$f":"IF(J144=\"\",\"\",CONCATENATE(DIGITADOR!$M$1,J144,E144))","v":""},"",{"$f":"IF(H144=\"\",\"\",VLOOKUP(H144,'Otras referencias'!$A$24:$E$48,2,FALSE))","v":""},null,null,null,{"$f":"IF(H144=\"\",\"\",VLOOKUP(H144,'Otras referencias'!$A$24:$E$48,5,FALSE))","v":""},null,null,null,null,null,null,"",{"$f":"IF(AND(P144<>\"\",O144<>\"\"),IF(N144=\"A\",VLOOKUP(P144,'Otras referencias'!$J$24:$K$35,2,FALSE),IF(N144=\"B\",VLOOKUP(P144,'Otras referencias'!$N$24:$O$35,2,),IF(N144=\"C\",VLOOKUP(P144,'Otras referencias'!$R$24:$S$35,2,FALSE)))),\"\")","v":""},{"$f":"IF(S144=\"\",\"\",INDEX(referentes!$G$2:$H$5,MATCH(S144,referentes!$H$2:$H$5,0),1))","v":""},null,null,{"$f":"IF(T144=\"\",\"\",VLOOKUP(T144,referentes!$Q$2:$X$209,2,FALSE))","v":""},null,null,null,null,"",null,null,null,"",null,null,{"$f":"IF(AF144<>\"\",VLOOKUP(AF144,'Otras referencias'!$H$19:$I$20,2,FALSE),\"\")","v":""},null,{"$f":"IF(AH144<>\"\",VLOOKUP(AH144,'Otras referencias'!$H$19:$I$20,2,FALSE),\"\")","v":""},null,{"$f":"IF(AJ144<>\"\",VLOOKUP(AJ144,'Otras referencias'!$H$19:$I$20,2,FALSE),\"\")","v":""},null,{"$f":"IF(AL144<>\"\",VLOOKUP(AL144,'Otras referencias'!$H$19:$I$20,2,FALSE),\"\")","v":""}]
[null,{"$f":"IF(C145=\"\",\"\",IF(COUNTIF($C$3:C145, C145)>1, \"\", C145))","v":""},{"$f":"IF(J145=\"\",\"\",CONCATENATE(DIGITADOR!$M$1,J145,E145))","v":""},"",{"$f":"IF(H145=\"\",\"\",VLOOKUP(H145,'Otras referencias'!$A$24:$E$48,2,FALSE))","v":""},null,null,null,{"$f":"IF(H145=\"\",\"\",VLOOKUP(H145,'Otras referencias'!$A$24:$E$48,5,FALSE))","v":""},null,null,null,null,null,null,"",{"$f":"IF(AND(P145<>\"\",O145<>\"\"),IF(N145=\"A\",VLOOKUP(P145,'Otras referencias'!$J$24:$K$35,2,FALSE),IF(N145=\"B\",VLOOKUP(P145,'Otras referencias'!$N$24:$O$35,2,),IF(N145=\"C\",VLOOKUP(P145,'Otras referencias'!$R$24:$S$35,2,FALSE)))),\"\")","v":""},{"$f":"IF(S145=\"\",\"\",INDEX(referentes!$G$2:$H$5,MATCH(S145,referentes!$H$2:$H$5,0),1))","v":""},null,null,{"$f":"IF(T145=\"\",\"\",VLOOKUP(T145,referentes!$Q$2:$X$209,2,FALSE))","v":""},null,null,null,null,"",null,null,null,"",null,null,{"$f":"IF(AF145<>\"\",VLOOKUP(AF145,'Otras referencias'!$H$19:$I$20,2,FALSE),\"\")","v":""},null,{"$f":"IF(AH145<>\"\",VLOOKUP(AH145,'Otras referencias'!$H$19:$I$20,2,FALSE),\"\")","v":""},null,{"$f":"IF(AJ145<>\"\",VLOOKUP(AJ145,'Otras referencias'!$H$19:$I$20,2,FALSE),\"\")","v":""},null,{"$f":"IF(AL145<>\"\",VLOOKUP(AL145,'Otras referencias'!$H$19:$I$20,2,FALSE),\"\")","v":""}]
[null,{"$f":"IF(C146=\"\",\"\",IF(COUNTIF($C$3:C146, C146)>1, \"\", C146))","v":""},{"$f":"IF(J146=\"\",\"\",CONCATENATE(DIGITADOR!$M$1,J146,E146))","v":""},"",{"$f":"IF(H146=\"\",\"\",VLOOKUP(H146,'Otras referencias'!$A$24:$E$48,2,FALSE))","v":""},null,null,null,{"$f":"IF(H146=\"\",\"\",VLOOKUP(H146,'Otras referencias'!$A$24:$E$48,5,FALSE))","v":""},null,null,null,null,null,null,"",{"$f":"IF(AND(P146<>\"\",O146<>\"\"),IF(N146=\"A\",VLOOKUP(P146,'Otras referencias'!$J$24:$K$35,2,FALSE),IF(N146=\"B\",VLOOKUP(P146,'Otras referencias'!$N$24:$O$35,2,),IF(N146=\"C\",VLOOKUP(P146,'Otras referencias'!$R$24:$S$35,2,FALSE)))),\"\")","v":""},{"$f":"IF(S146=\"\",\"\",INDEX(referentes!$G$2:$H$5,MATCH(S146,referentes!$H$2:$H$5,0),1))","v":""},null,null,{"$f":"IF(T146=\"\",\"\",VLOOKUP(T146,referentes!$Q$2:$X$209,2,FALSE))","v":""},null,null,null,null,"",null,null,null,"",null,null,{"$f":"IF(AF146<>\"\",VLOOKUP(AF146,'Otras referencias'!$H$19:$I$20,2,FALSE),\"\")","v":""},null,{"$f":"IF(AH146<>\"\",VLOOKUP(AH146,'Otras referencias'!$H$19:$I$20,2,FALSE),\"\")","v":""},null,{"$f":"IF(AJ146<>\"\",VLOOKUP(AJ146,'Otras referencias'!$H$19:$I$20,2,FALSE),\"\")","v":""},null,{"$f":"IF(AL146<>\"\",VLOOKUP(AL146,'Otras referencias'!$H$19:$I$20,2,FALSE),\"\")","v":""}]
[null,{"$f":"IF(C147=\"\",\"\",IF(COUNTIF($C$3:C147, C147)>1, \"\", C147))","v":""},{"$f":"IF(J147=\"\",\"\",CONCATENATE(DIGITADOR!$M$1,J147,E147))","v":""},"",{"$f":"IF(H147=\"\",\"\",VLOOKUP(H147,'Otras referencias'!$A$24:$E$48,2,FALSE))","v":""},null,null,null,{"$f":"IF(H147=\"\",\"\",VLOOKUP(H147,'Otras referencias'!$A$24:$E$48,5,FALSE))","v":""},null,null,null,null,null,null,"",{"$f":"IF(AND(P147<>\"\",O147<>\"\"),IF(N147=\"A\",VLOOKUP(P147,'Otras referencias'!$J$24:$K$35,2,FALSE),IF(N147=\"B\",VLOOKUP(P147,'Otras referencias'!$N$24:$O$35,2,),IF(N147=\"C\",VLOOKUP(P147,'Otras referencias'!$R$24:$S$35,2,FALSE)))),\"\")","v":""},{"$f":"IF(S147=\"\",\"\",INDEX(referentes!$G$2:$H$5,MATCH(S147,referentes!$H$2:$H$5,0),1))","v":""},null,null,{"$f":"IF(T147=\"\",\"\",VLOOKUP(T147,referentes!$Q$2:$X$209,2,FALSE))","v":""},null,null,null,null,"",null,null,null,"",null,null,{"$f":"IF(AF147<>\"\",VLOOKUP(AF147,'Otras referencias'!$H$19:$I$20,2,FALSE),\"\")","v":""},null,{"$f":"IF(AH147<>\"\",VLOOKUP(AH147,'Otras referencias'!$H$19:$I$20,2,FALSE),\"\")","v":""},null,{"$f":"IF(AJ147<>\"\",VLOOKUP(AJ147,'Otras referencias'!$H$19:$I$20,2,FALSE),\"\")","v":""},null,{"$f":"IF(AL147<>\"\",VLOOKUP(AL147,'Otras referencias'!$H$19:$I$20,2,FALSE),\"\")","v":""}]
[null,{"$f":"IF(C148=\"\",\"\",IF(COUNTIF($C$3:C148, C148)>1, \"\", C148))","v":""},{"$f":"IF(J148=\"\",\"\",CONCATENATE(DIGITADOR!$M$1,J148,E148))","v":""},"",{"$f":"IF(H148=\"\",\"\",VLOOKUP(H148,'Otras referencias'!$A$24:$E$48,2,FALSE))","v":""},null,null,null,{"$f":"IF(H148=\"\",\"\",VLOOKUP(H148,'Otras referencias'!$A$24:$E$48,5,FALSE))","v":""},null,null,null,null,null,null,"",{"$f":"IF(AND(P148<>\"\",O148<>\"\"),IF(N148=\"A\",VLOOKUP(P148,'Otras referencias'!$J$24:$K$35,2,FALSE),IF(N148=\"B\",VLOOKUP(P148,'Otras referencias'!$N$24:$O$35,2,),IF(N148=\"C\",VLOOKUP(P148,'Otras referencias'!$R$24:$S$35,2,FALSE)))),\"\")","v":""},{"$f":"IF(S148=\"\",\"\",INDEX(referentes!$G$2:$H$5,MATCH(S148,referentes!$H$2:$H$5,0),1))","v":""},null,null,{"$f":"IF(T148=\"\",\"\",VLOOKUP(T148,referentes!$Q$2:$X$209,2,FALSE))","v":""},null,null,null,null,"",null,null,null,"",null,null,{"$f":"IF(AF148<>\"\",VLOOKUP(AF148,'Otras referencias'!$H$19:$I$20,2,FALSE),\"\")","v":""},null,{"$f":"IF(AH148<>\"\",VLOOKUP(AH148,'Otras referencias'!$H$19:$I$20,2,FALSE),\"\")","v":""},null,{"$f":"IF(AJ148<>\"\",VLOOKUP(AJ148,'Otras referencias'!$H$19:$I$20,2,FALSE),\"\")","v":""},null,{"$f":"IF(AL148<>\"\",VLOOKUP(AL148,'Otras referencias'!$H$19:$I$20,2,FALSE),\"\")","v":""}]
[null,{"$f":"IF(C149=\"\",\"\",IF(COUNTIF($C$3:C149, C149)>1, \"\", C149))","v":""},{"$f":"IF(J149=\"\",\"\",CONCATENATE(DIGITADOR!$M$1,J149,E149))","v":""},"",{"$f":"IF(H149=\"\",\"\",VLOOKUP(H149,'Otras referencias'!$A$24:$E$48,2,FALSE))","v":""},null,null,null,{"$f":"IF(H149=\"\",\"\",VLOOKUP(H149,'Otras referencias'!$A$24:$E$48,5,FALSE))","v":""},null,null,null,null,null,null,"",{"$f":"IF(AND(P149<>\"\",O149<>\"\"),IF(N149=\"A\",VLOOKUP(P149,'Otras referencias'!$J$24:$K$35,2,FALSE),IF(N149=\"B\",VLOOKUP(P149,'Otras referencias'!$N$24:$O$35,2,),IF(N149=\"C\",VLOOKUP(P149,'Otras referencias'!$R$24:$S$35,2,FALSE)))),\"\")","v":""},{"$f":"IF(S149=\"\",\"\",INDEX(referentes!$G$2:$H$5,MATCH(S149,referentes!$H$2:$H$5,0),1))","v":""},null,null,{"$f":"IF(T149=\"\",\"\",VLOOKUP(T149,referentes!$Q$2:$X$209,2,FALSE))","v":""},null,null,null,null,"",null,null,null,"",null,null,{"$f":"IF(AF149<>\"\",VLOOKUP(AF149,'Otras referencias'!$H$19:$I$20,2,FALSE),\"\")","v":""},null,{"$f":"IF(AH149<>\"\",VLOOKUP(AH149,'Otras referencias'!$H$19:$I$20,2,FALSE),\"\")","v":""},null,{"$f":"IF(AJ149<>\"\",VLOOKUP(AJ149,'Otras referencias'!$H$19:$I$20,2,FALSE),\"\")","v":""},null,{"$f":"IF(AL149<>\"\",VLOOKUP(AL149,'Otras referencias'!$H$19:$I$20,2,FALSE),\"\")","v":""}]
[null,{"$f":"IF(C150=\"\",\"\",IF(COUNTIF($C$3:C150, C150)>1, \"\", C150))","v":""},{"$f":"IF(J150=\"\",\"\",CONCATENATE(DIGITADOR!$M$1,J150,E150))","v":""},"",{"$f":"IF(H150=\"\",\"\",VLOOKUP(H150,'Otras referencias'!$A$24:$E$48,2,FALSE))","v":""},null,null,null,{"$f":"IF(H150=\"\",\"\",VLOOKUP(H150,'Otras referencias'!$A$24:$E$48,5,FALSE))","v":""},null,null,null,null,null,null,"",{"$f":"IF(AND(P150<>\"\",O150<>\"\"),IF(N150=\"A\",VLOOKUP(P150,'Otras referencias'!$J$24:$K$35,2,FALSE),IF(N150=\"B\",VLOOKUP(P150,'Otras referencias'!$N$24:$O$35,2,),IF(N150=\"C\",VLOOKUP(P150,'Otras referencias'!$R$24:$S$35,2,FALSE)))),\"\")","v":""},{"$f":"IF(S150=\"\",\"\",INDEX(referentes!$G$2:$H$5,MATCH(S150,referentes!$H$2:$H$5,0),1))","v":""},null,null,{"$f":"IF(T150=\"\",\"\",VLOOKUP(T150,referentes!$Q$2:$X$209,2,FALSE))","v":""},null,null,null,null,"",null,null,null,"",null,null,{"$f":"IF(AF150<>\"\",VLOOKUP(AF150,'Otras referencias'!$H$19:$I$20,2,FALSE),\"\")","v":""},null,{"$f":"IF(AH150<>\"\",VLOOKUP(AH150,'Otras referencias'!$H$19:$I$20,2,FALSE),\"\")","v":""},null,{"$f":"IF(AJ150<>\"\",VLOOKUP(AJ150,'Otras referencias'!$H$19:$I$20,2,FALSE),\"\")","v":""},null,{"$f":"IF(AL150<>\"\",VLOOKUP(AL150,'Otras referencias'!$H$19:$I$20,2,FALSE),\"\")","v":""}]
[null,{"$f":"IF(C151=\"\",\"\",IF(COUNTIF($C$3:C151, C151)>1, \"\", C151))","v":""},{"$f":"IF(J151=\"\",\"\",CONCATENATE(DIGITADOR!$M$1,J151,E151))","v":""},"",{"$f":"IF(H151=\"\",\"\",VLOOKUP(H151,'Otras referencias'!$A$24:$E$48,2,FALSE))","v":""},null,null,null,{"$f":"IF(H151=\"\",\"\",VLOOKUP(H151,'Otras referencias'!$A$24:$E$48,5,FALSE))","v":""},null,null,null,null,null,null,"",{"$f":"IF(AND(P151<>\"\",O151<>\"\"),IF(N151=\"A\",VLOOKUP(P151,'Otras referencias'!$J$24:$K$35,2,FALSE),IF(N151=\"B\",VLOOKUP(P151,'Otras referencias'!$N$24:$O$35,2,),IF(N151=\"C\",VLOOKUP(P151,'Otras referencias'!$R$24:$S$35,2,FALSE)))),\"\")","v":""},{"$f":"IF(S151=\"\",\"\",INDEX(referentes!$G$2:$H$5,MATCH(S151,referentes!$H$2:$H$5,0),1))","v":""},null,null,{"$f":"IF(T151=\"\",\"\",VLOOKUP(T151,referentes!$Q$2:$X$209,2,FALSE))","v":""},null,null,null,null,"",null,null,null,"",null,null,{"$f":"IF(AF151<>\"\",VLOOKUP(AF151,'Otras referencias'!$H$19:$I$20,2,FALSE),\"\")","v":""},null,{"$f":"IF(AH151<>\"\",VLOOKUP(AH151,'Otras referencias'!$H$19:$I$20,2,FALSE),\"\")","v":""},null,{"$f":"IF(AJ151<>\"\",VLOOKUP(AJ151,'Otras referencias'!$H$19:$I$20,2,FALSE),\"\")","v":""},null,{"$f":"IF(AL151<>\"\",VLOOKUP(AL151,'Otras referencias'!$H$19:$I$20,2,FALSE),\"\")","v":""}]
[null,{"$f":"IF(C152=\"\",\"\",IF(COUNTIF($C$3:C152, C152)>1, \"\", C152))","v":""},{"$f":"IF(J152=\"\",\"\",CONCATENATE(DIGITADOR!$M$1,J152,E152))","v":""},"",{"$f":"IF(H152=\"\",\"\",VLOOKUP(H152,'Otras referencias'!$A$24:$E$48,2,FALSE))","v":""},null,null,null,{"$f":"IF(H152=\"\",\"\",VLOOKUP(H152,'Otras referencias'!$A$24:$E$48,5,FALSE))","v":""},null,null,null,null,null,null,"",{"$f":"IF(AND(P152<>\"\",O152<>\"\"),IF(N152=\"A\",VLOOKUP(P152,'Otras referencias'!$J$24:$K$35,2,FALSE),IF(N152=\"B\",VLOOKUP(P152,'Otras referencias'!$N$24:$O$35,2,),IF(N152=\"C\",VLOOKUP(P152,'Otras referencias'!$R$24:$S$35,2,FALSE)))),\"\")","v":""},{"$f":"IF(S152=\"\",\"\",INDEX(referentes!$G$2:$H$5,MATCH(S152,referentes!$H$2:$H$5,0),1))","v":""},null,null,{"$f":"IF(T152=\"\",\"\",VLOOKUP(T152,referentes!$Q$2:$X$209,2,FALSE))","v":""},null,null,null,null,"",null,null,null,"",null,null,{"$f":"IF(AF152<>\"\",VLOOKUP(AF152,'Otras referencias'!$H$19:$I$20,2,FALSE),\"\")","v":""},null,{"$f":"IF(AH152<>\"\",VLOOKUP(AH152,'Otras referencias'!$H$19:$I$20,2,FALSE),\"\")","v":""},null,{"$f":"IF(AJ152<>\"\",VLOOKUP(AJ152,'Otras referencias'!$H$19:$I$20,2,FALSE),\"\")","v":""},null,{"$f":"IF(AL152<>\"\",VLOOKUP(AL152,'Otras referencias'!$H$19:$I$20,2,FALSE),\"\")","v":""}]
[null,{"$f":"IF(C153=\"\",\"\",IF(COUNTIF($C$3:C153, C153)>1, \"\", C153))","v":""},{"$f":"IF(J153=\"\",\"\",CONCATENATE(DIGITADOR!$M$1,J153,E153))","v":""},"",{"$f":"IF(H153=\"\",\"\",VLOOKUP(H153,'Otras referencias'!$A$24:$E$48,2,FALSE))","v":""},null,null,null,{"$f":"IF(H153=\"\",\"\",VLOOKUP(H153,'Otras referencias'!$A$24:$E$48,5,FALSE))","v":""},null,null,null,null,null,null,"",{"$f":"IF(AND(P153<>\"\",O153<>\"\"),IF(N153=\"A\",VLOOKUP(P153,'Otras referencias'!$J$24:$K$35,2,FALSE),IF(N153=\"B\",VLOOKUP(P153,'Otras referencias'!$N$24:$O$35,2,),IF(N153=\"C\",VLOOKUP(P153,'Otras referencias'!$R$24:$S$35,2,FALSE)))),\"\")","v":""},{"$f":"IF(S153=\"\",\"\",INDEX(referentes!$G$2:$H$5,MATCH(S153,referentes!$H$2:$H$5,0),1))","v":""},null,null,{"$f":"IF(T153=\"\",\"\",VLOOKUP(T153,referentes!$Q$2:$X$209,2,FALSE))","v":""},null,null,null,null,"",null,null,null,"",null,null,{"$f":"IF(AF153<>\"\",VLOOKUP(AF153,'Otras referencias'!$H$19:$I$20,2,FALSE),\"\")","v":""},null,{"$f":"IF(AH153<>\"\",VLOOKUP(AH153,'Otras referencias'!$H$19:$I$20,2,FALSE),\"\")","v":""},null,{"$f":"IF(AJ153<>\"\",VLOOKUP(AJ153,'Otras referencias'!$H$19:$I$20,2,FALSE),\"\")","v":""},null,{"$f":"IF(AL153<>\"\",VLOOKUP(AL153,'Otras referencias'!$H$19:$I$20,2,FALSE),\"\")","v":""}]
[null,{"$f":"IF(C154=\"\",\"\",IF(COUNTIF($C$3:C154, C154)>1, \"\", C154))","v":""},{"$f":"IF(J154=\"\",\"\",CONCATENATE(DIGITADOR!$M$1,J154,E154))","v":""},"",{"$f":"IF(H154=\"\",\"\",VLOOKUP(H154,'Otras referencias'!$A$24:$E$48,2,FALSE))","v":""},null,null,null,{"$f":"IF(H154=\"\",\"\",VLOOKUP(H154,'Otras referencias'!$A$24:$E$48,5,FALSE))","v":""},null,null,null,null,null,null,"",{"$f":"IF(AND(P154<>\"\",O154<>\"\"),IF(N154=\"A\",VLOOKUP(P154,'Otras referencias'!$J$24:$K$35,2,FALSE),IF(N154=\"B\",VLOOKUP(P154,'Otras referencias'!$N$24:$O$35,2,),IF(N154=\"C\",VLOOKUP(P154,'Otras referencias'!$R$24:$S$35,2,FALSE)))),\"\")","v":""},{"$f":"IF(S154=\"\",\"\",INDEX(referentes!$G$2:$H$5,MATCH(S154,referentes!$H$2:$H$5,0),1))","v":""},null,null,{"$f":"IF(T154=\"\",\"\",VLOOKUP(T154,referentes!$Q$2:$X$209,2,FALSE))","v":""},null,null,null,null,"",null,null,null,"",null,null,{"$f":"IF(AF154<>\"\",VLOOKUP(AF154,'Otras referencias'!$H$19:$I$20,2,FALSE),\"\")","v":""},null,{"$f":"IF(AH154<>\"\",VLOOKUP(AH154,'Otras referencias'!$H$19:$I$20,2,FALSE),\"\")","v":""},null,{"$f":"IF(AJ154<>\"\",VLOOKUP(AJ154,'Otras referencias'!$H$19:$I$20,2,FALSE),\"\")","v":""},null,{"$f":"IF(AL154<>\"\",VLOOKUP(AL154,'Otras referencias'!$H$19:$I$20,2,FALSE),\"\")","v":""}]
[null,{"$f":"IF(C155=\"\",\"\",IF(COUNTIF($C$3:C155, C155)>1, \"\", C155))","v":""},{"$f":"IF(J155=\"\",\"\",CONCATENATE(DIGITADOR!$M$1,J155,E155))","v":""},"",{"$f":"IF(H155=\"\",\"\",VLOOKUP(H155,'Otras referencias'!$A$24:$E$48,2,FALSE))","v":""},null,null,null,{"$f":"IF(H155=\"\",\"\",VLOOKUP(H155,'Otras referencias'!$A$24:$E$48,5,FALSE))","v":""},null,null,null,null,null,null,"",{"$f":"IF(AND(P155<>\"\",O155<>\"\"),IF(N155=\"A\",VLOOKUP(P155,'Otras referencias'!$J$24:$K$35,2,FALSE),IF(N155=\"B\",VLOOKUP(P155,'Otras referencias'!$N$24:$O$35,2,),IF(N155=\"C\",VLOOKUP(P155,'Otras referencias'!$R$24:$S$35,2,FALSE)))),\"\")","v":""},{"$f":"IF(S155=\"\",\"\",INDEX(referentes!$G$2:$H$5,MATCH(S155,referentes!$H$2:$H$5,0),1))","v":""},null,null,{"$f":"IF(T155=\"\",\"\",VLOOKUP(T155,referentes!$Q$2:$X$209,2,FALSE))","v":""},null,null,null,null,"",null,null,null,"",null,null,{"$f":"IF(AF155<>\"\",VLOOKUP(AF155,'Otras referencias'!$H$19:$I$20,2,FALSE),\"\")","v":""},null,{"$f":"IF(AH155<>\"\",VLOOKUP(AH155,'Otras referencias'!$H$19:$I$20,2,FALSE),\"\")","v":""},null,{"$f":"IF(AJ155<>\"\",VLOOKUP(AJ155,'Otras referencias'!$H$19:$I$20,2,FALSE),\"\")","v":""},null,{"$f":"IF(AL155<>\"\",VLOOKUP(AL155,'Otras referencias'!$H$19:$I$20,2,FALSE),\"\")","v":""}]
[null,{"$f":"IF(C156=\"\",\"\",IF(COUNTIF($C$3:C156, C156)>1, \"\", C156))","v":""},{"$f":"IF(J156=\"\",\"\",CONCATENATE(DIGITADOR!$M$1,J156,E156))","v":""},"",{"$f":"IF(H156=\"\",\"\",VLOOKUP(H156,'Otras referencias'!$A$24:$E$48,2,FALSE))","v":""},null,null,null,{"$f":"IF(H156=\"\",\"\",VLOOKUP(H156,'Otras referencias'!$A$24:$E$48,5,FALSE))","v":""},null,null,null,null,null,null,"",{"$f":"IF(AND(P156<>\"\",O156<>\"\"),IF(N156=\"A\",VLOOKUP(P156,'Otras referencias'!$J$24:$K$35,2,FALSE),IF(N156=\"B\",VLOOKUP(P156,'Otras referencias'!$N$24:$O$35,2,),IF(N156=\"C\",VLOOKUP(P156,'Otras referencias'!$R$24:$S$35,2,FALSE)))),\"\")","v":""},{"$f":"IF(S156=\"\",\"\",INDEX(referentes!$G$2:$H$5,MATCH(S156,referentes!$H$2:$H$5,0),1))","v":""},null,null,{"$f":"IF(T156=\"\",\"\",VLOOKUP(T156,referentes!$Q$2:$X$209,2,FALSE))","v":""},null,null,null,null,"",null,null,null,"",null,null,{"$f":"IF(AF156<>\"\",VLOOKUP(AF156,'Otras referencias'!$H$19:$I$20,2,FALSE),\"\")","v":""},null,{"$f":"IF(AH156<>\"\",VLOOKUP(AH156,'Otras referencias'!$H$19:$I$20,2,FALSE),\"\")","v":""},null,{"$f":"IF(AJ156<>\"\",VLOOKUP(AJ156,'Otras referencias'!$H$19:$I$20,2,FALSE),\"\")","v":""},null,{"$f":"IF(AL156<>\"\",VLOOKUP(AL156,'Otras referencias'!$H$19:$I$20,2,FALSE),\"\")","v":""}]
[null,{"$f":"IF(C157=\"\",\"\",IF(COUNTIF($C$3:C157, C157)>1, \"\", C157))","v":""},{"$f":"IF(J157=\"\",\"\",CONCATENATE(DIGITADOR!$M$1,J157,E157))","v":""},"",{"$f":"IF(H157=\"\",\"\",VLOOKUP(H157,'Otras referencias'!$A$24:$E$48,2,FALSE))","v":""},null,null,null,{"$f":"IF(H157=\"\",\"\",VLOOKUP(H157,'Otras referencias'!$A$24:$E$48,5,FALSE))","v":""},null,null,null,null,null,null,"",{"$f":"IF(AND(P157<>\"\",O157<>\"\"),IF(N157=\"A\",VLOOKUP(P157,'Otras referencias'!$J$24:$K$35,2,FALSE),IF(N157=\"B\",VLOOKUP(P157,'Otras referencias'!$N$24:$O$35,2,),IF(N157=\"C\",VLOOKUP(P157,'Otras referencias'!$R$24:$S$35,2,FALSE)))),\"\")","v":""},{"$f":"IF(S157=\"\",\"\",INDEX(referentes!$G$2:$H$5,MATCH(S157,referentes!$H$2:$H$5,0),1))","v":""},null,null,{"$f":"IF(T157=\"\",\"\",VLOOKUP(T157,referentes!$Q$2:$X$209,2,FALSE))","v":""},null,null,null,null,"",null,null,null,"",null,null,{"$f":"IF(AF157<>\"\",VLOOKUP(AF157,'Otras referencias'!$H$19:$I$20,2,FALSE),\"\")","v":""},null,{"$f":"IF(AH157<>\"\",VLOOKUP(AH157,'Otras referencias'!$H$19:$I$20,2,FALSE),\"\")","v":""},null,{"$f":"IF(AJ157<>\"\",VLOOKUP(AJ157,'Otras referencias'!$H$19:$I$20,2,FALSE),\"\")","v":""},null,{"$f":"IF(AL157<>\"\",VLOOKUP(AL157,'Otras referencias'!$H$19:$I$20,2,FALSE),\"\")","v":""}]
[null,{"$f":"IF(C158=\"\",\"\",IF(COUNTIF($C$3:C158, C158)>1, \"\", C158))","v":""},{"$f":"IF(J158=\"\",\"\",CONCATENATE(DIGITADOR!$M$1,J158,E158))","v":""},"",{"$f":"IF(H158=\"\",\"\",VLOOKUP(H158,'Otras referencias'!$A$24:$E$48,2,FALSE))","v":""},null,null,null,{"$f":"IF(H158=\"\",\"\",VLOOKUP(H158,'Otras referencias'!$A$24:$E$48,5,FALSE))","v":""},null,null,null,null,null,null,"",{"$f":"IF(AND(P158<>\"\",O158<>\"\"),IF(N158=\"A\",VLOOKUP(P158,'Otras referencias'!$J$24:$K$35,2,FALSE),IF(N158=\"B\",VLOOKUP(P158,'Otras referencias'!$N$24:$O$35,2,),IF(N158=\"C\",VLOOKUP(P158,'Otras referencias'!$R$24:$S$35,2,FALSE)))),\"\")","v":""},{"$f":"IF(S158=\"\",\"\",INDEX(referentes!$G$2:$H$5,MATCH(S158,referentes!$H$2:$H$5,0),1))","v":""},null,null,{"$f":"IF(T158=\"\",\"\",VLOOKUP(T158,referentes!$Q$2:$X$209,2,FALSE))","v":""},null,null,null,null,"",null,null,null,"",null,null,{"$f":"IF(AF158<>\"\",VLOOKUP(AF158,'Otras referencias'!$H$19:$I$20,2,FALSE),\"\")","v":""},null,{"$f":"IF(AH158<>\"\",VLOOKUP(AH158,'Otras referencias'!$H$19:$I$20,2,FALSE),\"\")","v":""},null,{"$f":"IF(AJ158<>\"\",VLOOKUP(AJ158,'Otras referencias'!$H$19:$I$20,2,FALSE),\"\")","v":""},null,{"$f":"IF(AL158<>\"\",VLOOKUP(AL158,'Otras referencias'!$H$19:$I$20,2,FALSE),\"\")","v":""}]
[null,{"$f":"IF(C159=\"\",\"\",IF(COUNTIF($C$3:C159, C159)>1, \"\", C159))","v":""},{"$f":"IF(J159=\"\",\"\",CONCATENATE(DIGITADOR!$M$1,J159,E159))","v":""},"",{"$f":"IF(H159=\"\",\"\",VLOOKUP(H159,'Otras referencias'!$A$24:$E$48,2,FALSE))","v":""},null,null,null,{"$f":"IF(H159=\"\",\"\",VLOOKUP(H159,'Otras referencias'!$A$24:$E$48,5,FALSE))","v":""},null,null,null,null,null,null,"",{"$f":"IF(AND(P159<>\"\",O159<>\"\"),IF(N159=\"A\",VLOOKUP(P159,'Otras referencias'!$J$24:$K$35,2,FALSE),IF(N159=\"B\",VLOOKUP(P159,'Otras referencias'!$N$24:$O$35,2,),IF(N159=\"C\",VLOOKUP(P159,'Otras referencias'!$R$24:$S$35,2,FALSE)))),\"\")","v":""},{"$f":"IF(S159=\"\",\"\",INDEX(referentes!$G$2:$H$5,MATCH(S159,referentes!$H$2:$H$5,0),1))","v":""},null,null,{"$f":"IF(T159=\"\",\"\",VLOOKUP(T159,referentes!$Q$2:$X$209,2,FALSE))","v":""},null,null,null,null,"",null,null,null,"",null,null,{"$f":"IF(AF159<>\"\",VLOOKUP(AF159,'Otras referencias'!$H$19:$I$20,2,FALSE),\"\")","v":""},null,{"$f":"IF(AH159<>\"\",VLOOKUP(AH159,'Otras referencias'!$H$19:$I$20,2,FALSE),\"\")","v":""},null,{"$f":"IF(AJ159<>\"\",VLOOKUP(AJ159,'Otras referencias'!$H$19:$I$20,2,FALSE),\"\")","v":""},null,{"$f":"IF(AL159<>\"\",VLOOKUP(AL159,'Otras referencias'!$H$19:$I$20,2,FALSE),\"\")","v":""}]
[null,{"$f":"IF(C160=\"\",\"\",IF(COUNTIF($C$3:C160, C160)>1, \"\", C160))","v":""},{"$f":"IF(J160=\"\",\"\",CONCATENATE(DIGITADOR!$M$1,J160,E160))","v":""},"",{"$f":"IF(H160=\"\",\"\",VLOOKUP(H160,'Otras referencias'!$A$24:$E$48,2,FALSE))","v":""},null,null,null,{"$f":"IF(H160=\"\",\"\",VLOOKUP(H160,'Otras referencias'!$A$24:$E$48,5,FALSE))","v":""},null,null,null,null,null,null,"",{"$f":"IF(AND(P160<>\"\",O160<>\"\"),IF(N160=\"A\",VLOOKUP(P160,'Otras referencias'!$J$24:$K$35,2,FALSE),IF(N160=\"B\",VLOOKUP(P160,'Otras referencias'!$N$24:$O$35,2,),IF(N160=\"C\",VLOOKUP(P160,'Otras referencias'!$R$24:$S$35,2,FALSE)))),\"\")","v":""},{"$f":"IF(S160=\"\",\"\",INDEX(referentes!$G$2:$H$5,MATCH(S160,referentes!$H$2:$H$5,0),1))","v":""},null,null,{"$f":"IF(T160=\"\",\"\",VLOOKUP(T160,referentes!$Q$2:$X$209,2,FALSE))","v":""},null,null,null,null,"",null,null,null,"",null,null,{"$f":"IF(AF160<>\"\",VLOOKUP(AF160,'Otras referencias'!$H$19:$I$20,2,FALSE),\"\")","v":""},null,{"$f":"IF(AH160<>\"\",VLOOKUP(AH160,'Otras referencias'!$H$19:$I$20,2,FALSE),\"\")","v":""},null,{"$f":"IF(AJ160<>\"\",VLOOKUP(AJ160,'Otras referencias'!$H$19:$I$20,2,FALSE),\"\")","v":""},null,{"$f":"IF(AL160<>\"\",VLOOKUP(AL160,'Otras referencias'!$H$19:$I$20,2,FALSE),\"\")","v":""}]
[null,{"$f":"IF(C161=\"\",\"\",IF(COUNTIF($C$3:C161, C161)>1, \"\", C161))","v":""},{"$f":"IF(J161=\"\",\"\",CONCATENATE(DIGITADOR!$M$1,J161,E161))","v":""},"",{"$f":"IF(H161=\"\",\"\",VLOOKUP(H161,'Otras referencias'!$A$24:$E$48,2,FALSE))","v":""},null,null,null,{"$f":"IF(H161=\"\",\"\",VLOOKUP(H161,'Otras referencias'!$A$24:$E$48,5,FALSE))","v":""},null,null,null,null,null,null,"",{"$f":"IF(AND(P161<>\"\",O161<>\"\"),IF(N161=\"A\",VLOOKUP(P161,'Otras referencias'!$J$24:$K$35,2,FALSE),IF(N161=\"B\",VLOOKUP(P161,'Otras referencias'!$N$24:$O$35,2,),IF(N161=\"C\",VLOOKUP(P161,'Otras referencias'!$R$24:$S$35,2,FALSE)))),\"\")","v":""},{"$f":"IF(S161=\"\",\"\",INDEX(referentes!$G$2:$H$5,MATCH(S161,referentes!$H$2:$H$5,0),1))","v":""},null,null,{"$f":"IF(T161=\"\",\"\",VLOOKUP(T161,referentes!$Q$2:$X$209,2,FALSE))","v":""},null,null,null,null,"",null,null,null,"",null,null,{"$f":"IF(AF161<>\"\",VLOOKUP(AF161,'Otras referencias'!$H$19:$I$20,2,FALSE),\"\")","v":""},null,{"$f":"IF(AH161<>\"\",VLOOKUP(AH161,'Otras referencias'!$H$19:$I$20,2,FALSE),\"\")","v":""},null,{"$f":"IF(AJ161<>\"\",VLOOKUP(AJ161,'Otras referencias'!$H$19:$I$20,2,FALSE),\"\")","v":""},null,{"$f":"IF(AL161<>\"\",VLOOKUP(AL161,'Otras referencias'!$H$19:$I$20,2,FALSE),\"\")","v":""}]
[null,{"$f":"IF(C162=\"\",\"\",IF(COUNTIF($C$3:C162, C162)>1, \"\", C162))","v":""},{"$f":"IF(J162=\"\",\"\",CONCATENATE(DIGITADOR!$M$1,J162,E162))","v":""},"",{"$f":"IF(H162=\"\",\"\",VLOOKUP(H162,'Otras referencias'!$A$24:$E$48,2,FALSE))","v":""},null,null,null,{"$f":"IF(H162=\"\",\"\",VLOOKUP(H162,'Otras referencias'!$A$24:$E$48,5,FALSE))","v":""},null,null,null,null,null,null,"",{"$f":"IF(AND(P162<>\"\",O162<>\"\"),IF(N162=\"A\",VLOOKUP(P162,'Otras referencias'!$J$24:$K$35,2,FALSE),IF(N162=\"B\",VLOOKUP(P162,'Otras referencias'!$N$24:$O$35,2,),IF(N162=\"C\",VLOOKUP(P162,'Otras referencias'!$R$24:$S$35,2,FALSE)))),\"\")","v":""},{"$f":"IF(S162=\"\",\"\",INDEX(referentes!$G$2:$H$5,MATCH(S162,referentes!$H$2:$H$5,0),1))","v":""},null,null,{"$f":"IF(T162=\"\",\"\",VLOOKUP(T162,referentes!$Q$2:$X$209,2,FALSE))","v":""},null,null,null,null,"",null,null,null,"",null,null,{"$f":"IF(AF162<>\"\",VLOOKUP(AF162,'Otras referencias'!$H$19:$I$20,2,FALSE),\"\")","v":""},null,{"$f":"IF(AH162<>\"\",VLOOKUP(AH162,'Otras referencias'!$H$19:$I$20,2,FALSE),\"\")","v":""},null,{"$f":"IF(AJ162<>\"\",VLOOKUP(AJ162,'Otras referencias'!$H$19:$I$20,2,FALSE),\"\")","v":""},null,{"$f":"IF(AL162<>\"\",VLOOKUP(AL162,'Otras referencias'!$H$19:$I$20,2,FALSE),\"\")","v":""}]
[null,{"$f":"IF(C163=\"\",\"\",IF(COUNTIF($C$3:C163, C163)>1, \"\", C163))","v":""},{"$f":"IF(J163=\"\",\"\",CONCATENATE(DIGITADOR!$M$1,J163,E163))","v":""},"",{"$f":"IF(H163=\"\",\"\",VLOOKUP(H163,'Otras referencias'!$A$24:$E$48,2,FALSE))","v":""},null,null,null,{"$f":"IF(H163=\"\",\"\",VLOOKUP(H163,'Otras referencias'!$A$24:$E$48,5,FALSE))","v":""},null,null,null,null,null,null,"",{"$f":"IF(AND(P163<>\"\",O163<>\"\"),IF(N163=\"A\",VLOOKUP(P163,'Otras referencias'!$J$24:$K$35,2,FALSE),IF(N163=\"B\",VLOOKUP(P163,'Otras referencias'!$N$24:$O$35,2,),IF(N163=\"C\",VLOOKUP(P163,'Otras referencias'!$R$24:$S$35,2,FALSE)))),\"\")","v":""},{"$f":"IF(S163=\"\",\"\",INDEX(referentes!$G$2:$H$5,MATCH(S163,referentes!$H$2:$H$5,0),1))","v":""},null,null,{"$f":"IF(T163=\"\",\"\",VLOOKUP(T163,referentes!$Q$2:$X$209,2,FALSE))","v":""},null,null,null,null,"",null,null,null,"",null,null,{"$f":"IF(AF163<>\"\",VLOOKUP(AF163,'Otras referencias'!$H$19:$I$20,2,FALSE),\"\")","v":""},null,{"$f":"IF(AH163<>\"\",VLOOKUP(AH163,'Otras referencias'!$H$19:$I$20,2,FALSE),\"\")","v":""},null,{"$f":"IF(AJ163<>\"\",VLOOKUP(AJ163,'Otras referencias'!$H$19:$I$20,2,FALSE),\"\")","v":""},null,{"$f":"IF(AL163<>\"\",VLOOKUP(AL163,'Otras referencias'!$H$19:$I$20,2,FALSE),\"\")","v":""}]
[null,{"$f":"IF(C164=\"\",\"\",IF(COUNTIF($C$3:C164, C164)>1, \"\", C164))","v":""},{"$f":"IF(J164=\"\",\"\",CONCATENATE(DIGITADOR!$M$1,J164,E164))","v":""},"",{"$f":"IF(H164=\"\",\"\",VLOOKUP(H164,'Otras referencias'!$A$24:$E$48,2,FALSE))","v":""},null,null,null,{"$f":"IF(H164=\"\",\"\",VLOOKUP(H164,'Otras referencias'!$A$24:$E$48,5,FALSE))","v":""},null,null,null,null,null,null,"",{"$f":"IF(AND(P164<>\"\",O164<>\"\"),IF(N164=\"A\",VLOOKUP(P164,'Otras referencias'!$J$24:$K$35,2,FALSE),IF(N164=\"B\",VLOOKUP(P164,'Otras referencias'!$N$24:$O$35,2,),IF(N164=\"C\",VLOOKUP(P164,'Otras referencias'!$R$24:$S$35,2,FALSE)))),\"\")","v":""},{"$f":"IF(S164=\"\",\"\",INDEX(referentes!$G$2:$H$5,MATCH(S164,referentes!$H$2:$H$5,0),1))","v":""},null,null,{"$f":"IF(T164=\"\",\"\",VLOOKUP(T164,referentes!$Q$2:$X$209,2,FALSE))","v":""},null,null,null,null,"",null,null,null,"",null,null,{"$f":"IF(AF164<>\"\",VLOOKUP(AF164,'Otras referencias'!$H$19:$I$20,2,FALSE),\"\")","v":""},null,{"$f":"IF(AH164<>\"\",VLOOKUP(AH164,'Otras referencias'!$H$19:$I$20,2,FALSE),\"\")","v":""},null,{"$f":"IF(AJ164<>\"\",VLOOKUP(AJ164,'Otras referencias'!$H$19:$I$20,2,FALSE),\"\")","v":""},null,{"$f":"IF(AL164<>\"\",VLOOKUP(AL164,'Otras referencias'!$H$19:$I$20,2,FALSE),\"\")","v":""}]
[null,{"$f":"IF(C165=\"\",\"\",IF(COUNTIF($C$3:C165, C165)>1, \"\", C165))","v":""},{"$f":"IF(J165=\"\",\"\",CONCATENATE(DIGITADOR!$M$1,J165,E165))","v":""},"",{"$f":"IF(H165=\"\",\"\",VLOOKUP(H165,'Otras referencias'!$A$24:$E$48,2,FALSE))","v":""},null,null,null,{"$f":"IF(H165=\"\",\"\",VLOOKUP(H165,'Otras referencias'!$A$24:$E$48,5,FALSE))","v":""},null,null,null,null,null,null,"",{"$f":"IF(AND(P165<>\"\",O165<>\"\"),IF(N165=\"A\",VLOOKUP(P165,'Otras referencias'!$J$24:$K$35,2,FALSE),IF(N165=\"B\",VLOOKUP(P165,'Otras referencias'!$N$24:$O$35,2,),IF(N165=\"C\",VLOOKUP(P165,'Otras referencias'!$R$24:$S$35,2,FALSE)))),\"\")","v":""},{"$f":"IF(S165=\"\",\"\",INDEX(referentes!$G$2:$H$5,MATCH(S165,referentes!$H$2:$H$5,0),1))","v":""},null,null,{"$f":"IF(T165=\"\",\"\",VLOOKUP(T165,referentes!$Q$2:$X$209,2,FALSE))","v":""},null,null,null,null,"",null,null,null,"",null,null,{"$f":"IF(AF165<>\"\",VLOOKUP(AF165,'Otras referencias'!$H$19:$I$20,2,FALSE),\"\")","v":""},null,{"$f":"IF(AH165<>\"\",VLOOKUP(AH165,'Otras referencias'!$H$19:$I$20,2,FALSE),\"\")","v":""},null,{"$f":"IF(AJ165<>\"\",VLOOKUP(AJ165,'Otras referencias'!$H$19:$I$20,2,FALSE),\"\")","v":""},null,{"$f":"IF(AL165<>\"\",VLOOKUP(AL165,'Otras referencias'!$H$19:$I$20,2,FALSE),\"\")","v":""}]
[null,{"$f":"IF(C166=\"\",\"\",IF(COUNTIF($C$3:C166, C166)>1, \"\", C166))","v":""},{"$f":"IF(J166=\"\",\"\",CONCATENATE(DIGITADOR!$M$1,J166,E166))","v":""},"",{"$f":"IF(H166=\"\",\"\",VLOOKUP(H166,'Otras referencias'!$A$24:$E$48,2,FALSE))","v":""},null,null,null,{"$f":"IF(H166=\"\",\"\",VLOOKUP(H166,'Otras referencias'!$A$24:$E$48,5,FALSE))","v":""},null,null,null,null,null,null,"",{"$f":"IF(AND(P166<>\"\",O166<>\"\"),IF(N166=\"A\",VLOOKUP(P166,'Otras referencias'!$J$24:$K$35,2,FALSE),IF(N166=\"B\",VLOOKUP(P166,'Otras referencias'!$N$24:$O$35,2,),IF(N166=\"C\",VLOOKUP(P166,'Otras referencias'!$R$24:$S$35,2,FALSE)))),\"\")","v":""},{"$f":"IF(S166=\"\",\"\",INDEX(referentes!$G$2:$H$5,MATCH(S166,referentes!$H$2:$H$5,0),1))","v":""},null,null,{"$f":"IF(T166=\"\",\"\",VLOOKUP(T166,referentes!$Q$2:$X$209,2,FALSE))","v":""},null,null,null,null,"",null,null,null,"",null,null,{"$f":"IF(AF166<>\"\",VLOOKUP(AF166,'Otras referencias'!$H$19:$I$20,2,FALSE),\"\")","v":""},null,{"$f":"IF(AH166<>\"\",VLOOKUP(AH166,'Otras referencias'!$H$19:$I$20,2,FALSE),\"\")","v":""},null,{"$f":"IF(AJ166<>\"\",VLOOKUP(AJ166,'Otras referencias'!$H$19:$I$20,2,FALSE),\"\")","v":""},null,{"$f":"IF(AL166<>\"\",VLOOKUP(AL166,'Otras referencias'!$H$19:$I$20,2,FALSE),\"\")","v":""}]
[null,{"$f":"IF(C167=\"\",\"\",IF(COUNTIF($C$3:C167, C167)>1, \"\", C167))","v":""},{"$f":"IF(J167=\"\",\"\",CONCATENATE(DIGITADOR!$M$1,J167,E167))","v":""},"",{"$f":"IF(H167=\"\",\"\",VLOOKUP(H167,'Otras referencias'!$A$24:$E$48,2,FALSE))","v":""},null,null,null,{"$f":"IF(H167=\"\",\"\",VLOOKUP(H167,'Otras referencias'!$A$24:$E$48,5,FALSE))","v":""},null,null,null,null,null,null,"",{"$f":"IF(AND(P167<>\"\",O167<>\"\"),IF(N167=\"A\",VLOOKUP(P167,'Otras referencias'!$J$24:$K$35,2,FALSE),IF(N167=\"B\",VLOOKUP(P167,'Otras referencias'!$N$24:$O$35,2,),IF(N167=\"C\",VLOOKUP(P167,'Otras referencias'!$R$24:$S$35,2,FALSE)))),\"\")","v":""},{"$f":"IF(S167=\"\",\"\",INDEX(referentes!$G$2:$H$5,MATCH(S167,referentes!$H$2:$H$5,0),1))","v":""},null,null,{"$f":"IF(T167=\"\",\"\",VLOOKUP(T167,referentes!$Q$2:$X$209,2,FALSE))","v":""},null,null,null,null,"",null,null,null,"",null,null,{"$f":"IF(AF167<>\"\",VLOOKUP(AF167,'Otras referencias'!$H$19:$I$20,2,FALSE),\"\")","v":""},null,{"$f":"IF(AH167<>\"\",VLOOKUP(AH167,'Otras referencias'!$H$19:$I$20,2,FALSE),\"\")","v":""},null,{"$f":"IF(AJ167<>\"\",VLOOKUP(AJ167,'Otras referencias'!$H$19:$I$20,2,FALSE),\"\")","v":""},null,{"$f":"IF(AL167<>\"\",VLOOKUP(AL167,'Otras referencias'!$H$19:$I$20,2,FALSE),\"\")","v":""}]
[null,{"$f":"IF(C168=\"\",\"\",IF(COUNTIF($C$3:C168, C168)>1, \"\", C168))","v":""},{"$f":"IF(J168=\"\",\"\",CONCATENATE(DIGITADOR!$M$1,J168,E168))","v":""},"",{"$f":"IF(H168=\"\",\"\",VLOOKUP(H168,'Otras referencias'!$A$24:$E$48,2,FALSE))","v":""},null,null,null,{"$f":"IF(H168=\"\",\"\",VLOOKUP(H168,'Otras referencias'!$A$24:$E$48,5,FALSE))","v":""},null,null,null,null,null,null,"",{"$f":"IF(AND(P168<>\"\",O168<>\"\"),IF(N168=\"A\",VLOOKUP(P168,'Otras referencias'!$J$24:$K$35,2,FALSE),IF(N168=\"B\",VLOOKUP(P168,'Otras referencias'!$N$24:$O$35,2,),IF(N168=\"C\",VLOOKUP(P168,'Otras referencias'!$R$24:$S$35,2,FALSE)))),\"\")","v":""},{"$f":"IF(S168=\"\",\"\",INDEX(referentes!$G$2:$H$5,MATCH(S168,referentes!$H$2:$H$5,0),1))","v":""},null,null,{"$f":"IF(T168=\"\",\"\",VLOOKUP(T168,referentes!$Q$2:$X$209,2,FALSE))","v":""},null,null,null,null,"",null,null,null,"",null,null,{"$f":"IF(AF168<>\"\",VLOOKUP(AF168,'Otras referencias'!$H$19:$I$20,2,FALSE),\"\")","v":""},null,{"$f":"IF(AH168<>\"\",VLOOKUP(AH168,'Otras referencias'!$H$19:$I$20,2,FALSE),\"\")","v":""},null,{"$f":"IF(AJ168<>\"\",VLOOKUP(AJ168,'Otras referencias'!$H$19:$I$20,2,FALSE),\"\")","v":""},null,{"$f":"IF(AL168<>\"\",VLOOKUP(AL168,'Otras referencias'!$H$19:$I$20,2,FALSE),\"\")","v":""}]
[null,{"$f":"IF(C169=\"\",\"\",IF(COUNTIF($C$3:C169, C169)>1, \"\", C169))","v":""},{"$f":"IF(J169=\"\",\"\",CONCATENATE(DIGITADOR!$M$1,J169,E169))","v":""},"",{"$f":"IF(H169=\"\",\"\",VLOOKUP(H169,'Otras referencias'!$A$24:$E$48,2,FALSE))","v":""},null,null,null,{"$f":"IF(H169=\"\",\"\",VLOOKUP(H169,'Otras referencias'!$A$24:$E$48,5,FALSE))","v":""},null,null,null,null,null,null,"",{"$f":"IF(AND(P169<>\"\",O169<>\"\"),IF(N169=\"A\",VLOOKUP(P169,'Otras referencias'!$J$24:$K$35,2,FALSE),IF(N169=\"B\",VLOOKUP(P169,'Otras referencias'!$N$24:$O$35,2,),IF(N169=\"C\",VLOOKUP(P169,'Otras referencias'!$R$24:$S$35,2,FALSE)))),\"\")","v":""},{"$f":"IF(S169=\"\",\"\",INDEX(referentes!$G$2:$H$5,MATCH(S169,referentes!$H$2:$H$5,0),1))","v":""},null,null,{"$f":"IF(T169=\"\",\"\",VLOOKUP(T169,referentes!$Q$2:$X$209,2,FALSE))","v":""},null,null,null,null,"",null,null,null,"",null,null,{"$f":"IF(AF169<>\"\",VLOOKUP(AF169,'Otras referencias'!$H$19:$I$20,2,FALSE),\"\")","v":""},null,{"$f":"IF(AH169<>\"\",VLOOKUP(AH169,'Otras referencias'!$H$19:$I$20,2,FALSE),\"\")","v":""},null,{"$f":"IF(AJ169<>\"\",VLOOKUP(AJ169,'Otras referencias'!$H$19:$I$20,2,FALSE),\"\")","v":""},null,{"$f":"IF(AL169<>\"\",VLOOKUP(AL169,'Otras referencias'!$H$19:$I$20,2,FALSE),\"\")","v":""}]
[null,{"$f":"IF(C170=\"\",\"\",IF(COUNTIF($C$3:C170, C170)>1, \"\", C170))","v":""},{"$f":"IF(J170=\"\",\"\",CONCATENATE(DIGITADOR!$M$1,J170,E170))","v":""},"",{"$f":"IF(H170=\"\",\"\",VLOOKUP(H170,'Otras referencias'!$A$24:$E$48,2,FALSE))","v":""},null,null,null,{"$f":"IF(H170=\"\",\"\",VLOOKUP(H170,'Otras referencias'!$A$24:$E$48,5,FALSE))","v":""},null,null,null,null,null,null,"",{"$f":"IF(AND(P170<>\"\",O170<>\"\"),IF(N170=\"A\",VLOOKUP(P170,'Otras referencias'!$J$24:$K$35,2,FALSE),IF(N170=\"B\",VLOOKUP(P170,'Otras referencias'!$N$24:$O$35,2,),IF(N170=\"C\",VLOOKUP(P170,'Otras referencias'!$R$24:$S$35,2,FALSE)))),\"\")","v":""},{"$f":"IF(S170=\"\",\"\",INDEX(referentes!$G$2:$H$5,MATCH(S170,referentes!$H$2:$H$5,0),1))","v":""},null,null,{"$f":"IF(T170=\"\",\"\",VLOOKUP(T170,referentes!$Q$2:$X$209,2,FALSE))","v":""},null,null,null,null,"",null,null,null,"",null,null,{"$f":"IF(AF170<>\"\",VLOOKUP(AF170,'Otras referencias'!$H$19:$I$20,2,FALSE),\"\")","v":""},null,{"$f":"IF(AH170<>\"\",VLOOKUP(AH170,'Otras referencias'!$H$19:$I$20,2,FALSE),\"\")","v":""},null,{"$f":"IF(AJ170<>\"\",VLOOKUP(AJ170,'Otras referencias'!$H$19:$I$20,2,FALSE),\"\")","v":""},null,{"$f":"IF(AL170<>\"\",VLOOKUP(AL170,'Otras referencias'!$H$19:$I$20,2,FALSE),\"\")","v":""}]
[null,{"$f":"IF(C171=\"\",\"\",IF(COUNTIF($C$3:C171, C171)>1, \"\", C171))","v":""},{"$f":"IF(J171=\"\",\"\",CONCATENATE(DIGITADOR!$M$1,J171,E171))","v":""},"",{"$f":"IF(H171=\"\",\"\",VLOOKUP(H171,'Otras referencias'!$A$24:$E$48,2,FALSE))","v":""},null,null,null,{"$f":"IF(H171=\"\",\"\",VLOOKUP(H171,'Otras referencias'!$A$24:$E$48,5,FALSE))","v":""},null,null,null,null,null,null,"",{"$f":"IF(AND(P171<>\"\",O171<>\"\"),IF(N171=\"A\",VLOOKUP(P171,'Otras referencias'!$J$24:$K$35,2,FALSE),IF(N171=\"B\",VLOOKUP(P171,'Otras referencias'!$N$24:$O$35,2,),IF(N171=\"C\",VLOOKUP(P171,'Otras referencias'!$R$24:$S$35,2,FALSE)))),\"\")","v":""},{"$f":"IF(S171=\"\",\"\",INDEX(referentes!$G$2:$H$5,MATCH(S171,referentes!$H$2:$H$5,0),1))","v":""},null,null,{"$f":"IF(T171=\"\",\"\",VLOOKUP(T171,referentes!$Q$2:$X$209,2,FALSE))","v":""},null,null,null,null,"",null,null,null,"",null,null,{"$f":"IF(AF171<>\"\",VLOOKUP(AF171,'Otras referencias'!$H$19:$I$20,2,FALSE),\"\")","v":""},null,{"$f":"IF(AH171<>\"\",VLOOKUP(AH171,'Otras referencias'!$H$19:$I$20,2,FALSE),\"\")","v":""},null,{"$f":"IF(AJ171<>\"\",VLOOKUP(AJ171,'Otras referencias'!$H$19:$I$20,2,FALSE),\"\")","v":""},null,{"$f":"IF(AL171<>\"\",VLOOKUP(AL171,'Otras referencias'!$H$19:$I$20,2,FALSE),\"\")","v":""}]
[null,{"$f":"IF(C172=\"\",\"\",IF(COUNTIF($C$3:C172, C172)>1, \"\", C172))","v":""},{"$f":"IF(J172=\"\",\"\",CONCATENATE(DIGITADOR!$M$1,J172,E172))","v":""},"",{"$f":"IF(H172=\"\",\"\",VLOOKUP(H172,'Otras referencias'!$A$24:$E$48,2,FALSE))","v":""},null,null,null,{"$f":"IF(H172=\"\",\"\",VLOOKUP(H172,'Otras referencias'!$A$24:$E$48,5,FALSE))","v":""},null,null,null,null,null,null,"",{"$f":"IF(AND(P172<>\"\",O172<>\"\"),IF(N172=\"A\",VLOOKUP(P172,'Otras referencias'!$J$24:$K$35,2,FALSE),IF(N172=\"B\",VLOOKUP(P172,'Otras referencias'!$N$24:$O$35,2,),IF(N172=\"C\",VLOOKUP(P172,'Otras referencias'!$R$24:$S$35,2,FALSE)))),\"\")","v":""},{"$f":"IF(S172=\"\",\"\",INDEX(referentes!$G$2:$H$5,MATCH(S172,referentes!$H$2:$H$5,0),1))","v":""},null,null,{"$f":"IF(T172=\"\",\"\",VLOOKUP(T172,referentes!$Q$2:$X$209,2,FALSE))","v":""},null,null,null,null,"",null,null,null,"",null,null,{"$f":"IF(AF172<>\"\",VLOOKUP(AF172,'Otras referencias'!$H$19:$I$20,2,FALSE),\"\")","v":""},null,{"$f":"IF(AH172<>\"\",VLOOKUP(AH172,'Otras referencias'!$H$19:$I$20,2,FALSE),\"\")","v":""},null,{"$f":"IF(AJ172<>\"\",VLOOKUP(AJ172,'Otras referencias'!$H$19:$I$20,2,FALSE),\"\")","v":""},null,{"$f":"IF(AL172<>\"\",VLOOKUP(AL172,'Otras referencias'!$H$19:$I$20,2,FALSE),\"\")","v":""}]
[null,{"$f":"IF(C173=\"\",\"\",IF(COUNTIF($C$3:C173, C173)>1, \"\", C173))","v":""},{"$f":"IF(J173=\"\",\"\",CONCATENATE(DIGITADOR!$M$1,J173,E173))","v":""},"",{"$f":"IF(H173=\"\",\"\",VLOOKUP(H173,'Otras referencias'!$A$24:$E$48,2,FALSE))","v":""},null,null,null,{"$f":"IF(H173=\"\",\"\",VLOOKUP(H173,'Otras referencias'!$A$24:$E$48,5,FALSE))","v":""},null,null,null,null,null,null,"",{"$f":"IF(AND(P173<>\"\",O173<>\"\"),IF(N173=\"A\",VLOOKUP(P173,'Otras referencias'!$J$24:$K$35,2,FALSE),IF(N173=\"B\",VLOOKUP(P173,'Otras referencias'!$N$24:$O$35,2,),IF(N173=\"C\",VLOOKUP(P173,'Otras referencias'!$R$24:$S$35,2,FALSE)))),\"\")","v":""},{"$f":"IF(S173=\"\",\"\",INDEX(referentes!$G$2:$H$5,MATCH(S173,referentes!$H$2:$H$5,0),1))","v":""},null,null,{"$f":"IF(T173=\"\",\"\",VLOOKUP(T173,referentes!$Q$2:$X$209,2,FALSE))","v":""},null,null,null,null,"",null,null,null,"",null,null,{"$f":"IF(AF173<>\"\",VLOOKUP(AF173,'Otras referencias'!$H$19:$I$20,2,FALSE),\"\")","v":""},null,{"$f":"IF(AH173<>\"\",VLOOKUP(AH173,'Otras referencias'!$H$19:$I$20,2,FALSE),\"\")","v":""},null,{"$f":"IF(AJ173<>\"\",VLOOKUP(AJ173,'Otras referencias'!$H$19:$I$20,2,FALSE),\"\")","v":""},null,{"$f":"IF(AL173<>\"\",VLOOKUP(AL173,'Otras referencias'!$H$19:$I$20,2,FALSE),\"\")","v":""}]
[null,{"$f":"IF(C174=\"\",\"\",IF(COUNTIF($C$3:C174, C174)>1, \"\", C174))","v":""},{"$f":"IF(J174=\"\",\"\",CONCATENATE(DIGITADOR!$M$1,J174,E174))","v":""},"",{"$f":"IF(H174=\"\",\"\",VLOOKUP(H174,'Otras referencias'!$A$24:$E$48,2,FALSE))","v":""},null,null,null,{"$f":"IF(H174=\"\",\"\",VLOOKUP(H174,'Otras referencias'!$A$24:$E$48,5,FALSE))","v":""},null,null,null,null,null,null,"",{"$f":"IF(AND(P174<>\"\",O174<>\"\"),IF(N174=\"A\",VLOOKUP(P174,'Otras referencias'!$J$24:$K$35,2,FALSE),IF(N174=\"B\",VLOOKUP(P174,'Otras referencias'!$N$24:$O$35,2,),IF(N174=\"C\",VLOOKUP(P174,'Otras referencias'!$R$24:$S$35,2,FALSE)))),\"\")","v":""},{"$f":"IF(S174=\"\",\"\",INDEX(referentes!$G$2:$H$5,MATCH(S174,referentes!$H$2:$H$5,0),1))","v":""},null,null,{"$f":"IF(T174=\"\",\"\",VLOOKUP(T174,referentes!$Q$2:$X$209,2,FALSE))","v":""},null,null,null,null,"",null,null,null,"",null,null,{"$f":"IF(AF174<>\"\",VLOOKUP(AF174,'Otras referencias'!$H$19:$I$20,2,FALSE),\"\")","v":""},null,{"$f":"IF(AH174<>\"\",VLOOKUP(AH174,'Otras referencias'!$H$19:$I$20,2,FALSE),\"\")","v":""},null,{"$f":"IF(AJ174<>\"\",VLOOKUP(AJ174,'Otras referencias'!$H$19:$I$20,2,FALSE),\"\")","v":""},null,{"$f":"IF(AL174<>\"\",VLOOKUP(AL174,'Otras referencias'!$H$19:$I$20,2,FALSE),\"\")","v":""}]
[null,{"$f":"IF(C175=\"\",\"\",IF(COUNTIF($C$3:C175, C175)>1, \"\", C175))","v":""},{"$f":"IF(J175=\"\",\"\",CONCATENATE(DIGITADOR!$M$1,J175,E175))","v":""},"",{"$f":"IF(H175=\"\",\"\",VLOOKUP(H175,'Otras referencias'!$A$24:$E$48,2,FALSE))","v":""},null,null,null,{"$f":"IF(H175=\"\",\"\",VLOOKUP(H175,'Otras referencias'!$A$24:$E$48,5,FALSE))","v":""},null,null,null,null,null,null,"",{"$f":"IF(AND(P175<>\"\",O175<>\"\"),IF(N175=\"A\",VLOOKUP(P175,'Otras referencias'!$J$24:$K$35,2,FALSE),IF(N175=\"B\",VLOOKUP(P175,'Otras referencias'!$N$24:$O$35,2,),IF(N175=\"C\",VLOOKUP(P175,'Otras referencias'!$R$24:$S$35,2,FALSE)))),\"\")","v":""},{"$f":"IF(S175=\"\",\"\",INDEX(referentes!$G$2:$H$5,MATCH(S175,referentes!$H$2:$H$5,0),1))","v":""},null,null,{"$f":"IF(T175=\"\",\"\",VLOOKUP(T175,referentes!$Q$2:$X$209,2,FALSE))","v":""},null,null,null,null,"",null,null,null,"",null,null,{"$f":"IF(AF175<>\"\",VLOOKUP(AF175,'Otras referencias'!$H$19:$I$20,2,FALSE),\"\")","v":""},null,{"$f":"IF(AH175<>\"\",VLOOKUP(AH175,'Otras referencias'!$H$19:$I$20,2,FALSE),\"\")","v":""},null,{"$f":"IF(AJ175<>\"\",VLOOKUP(AJ175,'Otras referencias'!$H$19:$I$20,2,FALSE),\"\")","v":""},null,{"$f":"IF(AL175<>\"\",VLOOKUP(AL175,'Otras referencias'!$H$19:$I$20,2,FALSE),\"\")","v":""}]
[null,{"$f":"IF(C176=\"\",\"\",IF(COUNTIF($C$3:C176, C176)>1, \"\", C176))","v":""},{"$f":"IF(J176=\"\",\"\",CONCATENATE(DIGITADOR!$M$1,J176,E176))","v":""},"",{"$f":"IF(H176=\"\",\"\",VLOOKUP(H176,'Otras referencias'!$A$24:$E$48,2,FALSE))","v":""},null,null,null,{"$f":"IF(H176=\"\",\"\",VLOOKUP(H176,'Otras referencias'!$A$24:$E$48,5,FALSE))","v":""},null,null,null,null,null,null,"",{"$f":"IF(AND(P176<>\"\",O176<>\"\"),IF(N176=\"A\",VLOOKUP(P176,'Otras referencias'!$J$24:$K$35,2,FALSE),IF(N176=\"B\",VLOOKUP(P176,'Otras referencias'!$N$24:$O$35,2,),IF(N176=\"C\",VLOOKUP(P176,'Otras referencias'!$R$24:$S$35,2,FALSE)))),\"\")","v":""},{"$f":"IF(S176=\"\",\"\",INDEX(referentes!$G$2:$H$5,MATCH(S176,referentes!$H$2:$H$5,0),1))","v":""},null,null,{"$f":"IF(T176=\"\",\"\",VLOOKUP(T176,referentes!$Q$2:$X$209,2,FALSE))","v":""},null,null,null,null,"",null,null,null,"",null,null,{"$f":"IF(AF176<>\"\",VLOOKUP(AF176,'Otras referencias'!$H$19:$I$20,2,FALSE),\"\")","v":""},null,{"$f":"IF(AH176<>\"\",VLOOKUP(AH176,'Otras referencias'!$H$19:$I$20,2,FALSE),\"\")","v":""},null,{"$f":"IF(AJ176<>\"\",VLOOKUP(AJ176,'Otras referencias'!$H$19:$I$20,2,FALSE),\"\")","v":""},null,{"$f":"IF(AL176<>\"\",VLOOKUP(AL176,'Otras referencias'!$H$19:$I$20,2,FALSE),\"\")","v":""}]
[null,{"$f":"IF(C177=\"\",\"\",IF(COUNTIF($C$3:C177, C177)>1, \"\", C177))","v":""},{"$f":"IF(J177=\"\",\"\",CONCATENATE(DIGITADOR!$M$1,J177,E177))","v":""},"",{"$f":"IF(H177=\"\",\"\",VLOOKUP(H177,'Otras referencias'!$A$24:$E$48,2,FALSE))","v":""},null,null,null,{"$f":"IF(H177=\"\",\"\",VLOOKUP(H177,'Otras referencias'!$A$24:$E$48,5,FALSE))","v":""},null,null,null,null,null,null,"",{"$f":"IF(AND(P177<>\"\",O177<>\"\"),IF(N177=\"A\",VLOOKUP(P177,'Otras referencias'!$J$24:$K$35,2,FALSE),IF(N177=\"B\",VLOOKUP(P177,'Otras referencias'!$N$24:$O$35,2,),IF(N177=\"C\",VLOOKUP(P177,'Otras referencias'!$R$24:$S$35,2,FALSE)))),\"\")","v":""},{"$f":"IF(S177=\"\",\"\",INDEX(referentes!$G$2:$H$5,MATCH(S177,referentes!$H$2:$H$5,0),1))","v":""},null,null,{"$f":"IF(T177=\"\",\"\",VLOOKUP(T177,referentes!$Q$2:$X$209,2,FALSE))","v":""},null,null,null,null,"",null,null,null,"",null,null,{"$f":"IF(AF177<>\"\",VLOOKUP(AF177,'Otras referencias'!$H$19:$I$20,2,FALSE),\"\")","v":""},null,{"$f":"IF(AH177<>\"\",VLOOKUP(AH177,'Otras referencias'!$H$19:$I$20,2,FALSE),\"\")","v":""},null,{"$f":"IF(AJ177<>\"\",VLOOKUP(AJ177,'Otras referencias'!$H$19:$I$20,2,FALSE),\"\")","v":""},null,{"$f":"IF(AL177<>\"\",VLOOKUP(AL177,'Otras referencias'!$H$19:$I$20,2,FALSE),\"\")","v":""}]
[null,{"$f":"IF(C178=\"\",\"\",IF(COUNTIF($C$3:C178, C178)>1, \"\", C178))","v":""},{"$f":"IF(J178=\"\",\"\",CONCATENATE(DIGITADOR!$M$1,J178,E178))","v":""},"",{"$f":"IF(H178=\"\",\"\",VLOOKUP(H178,'Otras referencias'!$A$24:$E$48,2,FALSE))","v":""},null,null,null,{"$f":"IF(H178=\"\",\"\",VLOOKUP(H178,'Otras referencias'!$A$24:$E$48,5,FALSE))","v":""},null,null,null,null,null,null,"",{"$f":"IF(AND(P178<>\"\",O178<>\"\"),IF(N178=\"A\",VLOOKUP(P178,'Otras referencias'!$J$24:$K$35,2,FALSE),IF(N178=\"B\",VLOOKUP(P178,'Otras referencias'!$N$24:$O$35,2,),IF(N178=\"C\",VLOOKUP(P178,'Otras referencias'!$R$24:$S$35,2,FALSE)))),\"\")","v":""},{"$f":"IF(S178=\"\",\"\",INDEX(referentes!$G$2:$H$5,MATCH(S178,referentes!$H$2:$H$5,0),1))","v":""},null,null,{"$f":"IF(T178=\"\",\"\",VLOOKUP(T178,referentes!$Q$2:$X$209,2,FALSE))","v":""},null,null,null,null,"",null,null,null,"",null,null,{"$f":"IF(AF178<>\"\",VLOOKUP(AF178,'Otras referencias'!$H$19:$I$20,2,FALSE),\"\")","v":""},null,{"$f":"IF(AH178<>\"\",VLOOKUP(AH178,'Otras referencias'!$H$19:$I$20,2,FALSE),\"\")","v":""},null,{"$f":"IF(AJ178<>\"\",VLOOKUP(AJ178,'Otras referencias'!$H$19:$I$20,2,FALSE),\"\")","v":""},null,{"$f":"IF(AL178<>\"\",VLOOKUP(AL178,'Otras referencias'!$H$19:$I$20,2,FALSE),\"\")","v":""}]
[null,{"$f":"IF(C179=\"\",\"\",IF(COUNTIF($C$3:C179, C179)>1, \"\", C179))","v":""},{"$f":"IF(J179=\"\",\"\",CONCATENATE(DIGITADOR!$M$1,J179,E179))","v":""},"",{"$f":"IF(H179=\"\",\"\",VLOOKUP(H179,'Otras referencias'!$A$24:$E$48,2,FALSE))","v":""},null,null,null,{"$f":"IF(H179=\"\",\"\",VLOOKUP(H179,'Otras referencias'!$A$24:$E$48,5,FALSE))","v":""},null,null,null,null,null,null,"",{"$f":"IF(AND(P179<>\"\",O179<>\"\"),IF(N179=\"A\",VLOOKUP(P179,'Otras referencias'!$J$24:$K$35,2,FALSE),IF(N179=\"B\",VLOOKUP(P179,'Otras referencias'!$N$24:$O$35,2,),IF(N179=\"C\",VLOOKUP(P179,'Otras referencias'!$R$24:$S$35,2,FALSE)))),\"\")","v":""},{"$f":"IF(S179=\"\",\"\",INDEX(referentes!$G$2:$H$5,MATCH(S179,referentes!$H$2:$H$5,0),1))","v":""},null,null,{"$f":"IF(T179=\"\",\"\",VLOOKUP(T179,referentes!$Q$2:$X$209,2,FALSE))","v":""},null,null,null,null,"",null,null,null,"",null,null,{"$f":"IF(AF179<>\"\",VLOOKUP(AF179,'Otras referencias'!$H$19:$I$20,2,FALSE),\"\")","v":""},null,{"$f":"IF(AH179<>\"\",VLOOKUP(AH179,'Otras referencias'!$H$19:$I$20,2,FALSE),\"\")","v":""},null,{"$f":"IF(AJ179<>\"\",VLOOKUP(AJ179,'Otras referencias'!$H$19:$I$20,2,FALSE),\"\")","v":""},null,{"$f":"IF(AL179<>\"\",VLOOKUP(AL179,'Otras referencias'!$H$19:$I$20,2,FALSE),\"\")","v":""}]
[null,{"$f":"IF(C180=\"\",\"\",IF(COUNTIF($C$3:C180, C180)>1, \"\", C180))","v":""},{"$f":"IF(J180=\"\",\"\",CONCATENATE(DIGITADOR!$M$1,J180,E180))","v":""},"",{"$f":"IF(H180=\"\",\"\",VLOOKUP(H180,'Otras referencias'!$A$24:$E$48,2,FALSE))","v":""},null,null,null,{"$f":"IF(H180=\"\",\"\",VLOOKUP(H180,'Otras referencias'!$A$24:$E$48,5,FALSE))","v":""},null,null,null,null,null,null,"",{"$f":"IF(AND(P180<>\"\",O180<>\"\"),IF(N180=\"A\",VLOOKUP(P180,'Otras referencias'!$J$24:$K$35,2,FALSE),IF(N180=\"B\",VLOOKUP(P180,'Otras referencias'!$N$24:$O$35,2,),IF(N180=\"C\",VLOOKUP(P180,'Otras referencias'!$R$24:$S$35,2,FALSE)))),\"\")","v":""},{"$f":"IF(S180=\"\",\"\",INDEX(referentes!$G$2:$H$5,MATCH(S180,referentes!$H$2:$H$5,0),1))","v":""},null,null,{"$f":"IF(T180=\"\",\"\",VLOOKUP(T180,referentes!$Q$2:$X$209,2,FALSE))","v":""},null,null,null,null,"",null,null,null,"",null,null,{"$f":"IF(AF180<>\"\",VLOOKUP(AF180,'Otras referencias'!$H$19:$I$20,2,FALSE),\"\")","v":""},null,{"$f":"IF(AH180<>\"\",VLOOKUP(AH180,'Otras referencias'!$H$19:$I$20,2,FALSE),\"\")","v":""},null,{"$f":"IF(AJ180<>\"\",VLOOKUP(AJ180,'Otras referencias'!$H$19:$I$20,2,FALSE),\"\")","v":""},null,{"$f":"IF(AL180<>\"\",VLOOKUP(AL180,'Otras referencias'!$H$19:$I$20,2,FALSE),\"\")","v":""}]
[null,{"$f":"IF(C181=\"\",\"\",IF(COUNTIF($C$3:C181, C181)>1, \"\", C181))","v":""},{"$f":"IF(J181=\"\",\"\",CONCATENATE(DIGITADOR!$M$1,J181,E181))","v":""},"",{"$f":"IF(H181=\"\",\"\",VLOOKUP(H181,'Otras referencias'!$A$24:$E$48,2,FALSE))","v":""},null,null,null,{"$f":"IF(H181=\"\",\"\",VLOOKUP(H181,'Otras referencias'!$A$24:$E$48,5,FALSE))","v":""},null,null,null,null,null,null,"",{"$f":"IF(AND(P181<>\"\",O181<>\"\"),IF(N181=\"A\",VLOOKUP(P181,'Otras referencias'!$J$24:$K$35,2,FALSE),IF(N181=\"B\",VLOOKUP(P181,'Otras referencias'!$N$24:$O$35,2,),IF(N181=\"C\",VLOOKUP(P181,'Otras referencias'!$R$24:$S$35,2,FALSE)))),\"\")","v":""},{"$f":"IF(S181=\"\",\"\",INDEX(referentes!$G$2:$H$5,MATCH(S181,referentes!$H$2:$H$5,0),1))","v":""},null,null,{"$f":"IF(T181=\"\",\"\",VLOOKUP(T181,referentes!$Q$2:$X$209,2,FALSE))","v":""},null,null,null,null,"",null,null,null,"",null,null,{"$f":"IF(AF181<>\"\",VLOOKUP(AF181,'Otras referencias'!$H$19:$I$20,2,FALSE),\"\")","v":""},null,{"$f":"IF(AH181<>\"\",VLOOKUP(AH181,'Otras referencias'!$H$19:$I$20,2,FALSE),\"\")","v":""},null,{"$f":"IF(AJ181<>\"\",VLOOKUP(AJ181,'Otras referencias'!$H$19:$I$20,2,FALSE),\"\")","v":""},null,{"$f":"IF(AL181<>\"\",VLOOKUP(AL181,'Otras referencias'!$H$19:$I$20,2,FALSE),\"\")","v":""}]
[null,{"$f":"IF(C182=\"\",\"\",IF(COUNTIF($C$3:C182, C182)>1, \"\", C182))","v":""},{"$f":"IF(J182=\"\",\"\",CONCATENATE(DIGITADOR!$M$1,J182,E182))","v":""},"",{"$f":"IF(H182=\"\",\"\",VLOOKUP(H182,'Otras referencias'!$A$24:$E$48,2,FALSE))","v":""},null,null,null,{"$f":"IF(H182=\"\",\"\",VLOOKUP(H182,'Otras referencias'!$A$24:$E$48,5,FALSE))","v":""},null,null,null,null,null,null,"",{"$f":"IF(AND(P182<>\"\",O182<>\"\"),IF(N182=\"A\",VLOOKUP(P182,'Otras referencias'!$J$24:$K$35,2,FALSE),IF(N182=\"B\",VLOOKUP(P182,'Otras referencias'!$N$24:$O$35,2,),IF(N182=\"C\",VLOOKUP(P182,'Otras referencias'!$R$24:$S$35,2,FALSE)))),\"\")","v":""},{"$f":"IF(S182=\"\",\"\",INDEX(referentes!$G$2:$H$5,MATCH(S182,referentes!$H$2:$H$5,0),1))","v":""},null,null,{"$f":"IF(T182=\"\",\"\",VLOOKUP(T182,referentes!$Q$2:$X$209,2,FALSE))","v":""},null,null,null,null,"",null,null,null,"",null,null,{"$f":"IF(AF182<>\"\",VLOOKUP(AF182,'Otras referencias'!$H$19:$I$20,2,FALSE),\"\")","v":""},null,{"$f":"IF(AH182<>\"\",VLOOKUP(AH182,'Otras referencias'!$H$19:$I$20,2,FALSE),\"\")","v":""},null,{"$f":"IF(AJ182<>\"\",VLOOKUP(AJ182,'Otras referencias'!$H$19:$I$20,2,FALSE),\"\")","v":""},null,{"$f":"IF(AL182<>\"\",VLOOKUP(AL182,'Otras referencias'!$H$19:$I$20,2,FALSE),\"\")","v":""}]
[null,{"$f":"IF(C183=\"\",\"\",IF(COUNTIF($C$3:C183, C183)>1, \"\", C183))","v":""},{"$f":"IF(J183=\"\",\"\",CONCATENATE(DIGITADOR!$M$1,J183,E183))","v":""},"",{"$f":"IF(H183=\"\",\"\",VLOOKUP(H183,'Otras referencias'!$A$24:$E$48,2,FALSE))","v":""},null,null,null,{"$f":"IF(H183=\"\",\"\",VLOOKUP(H183,'Otras referencias'!$A$24:$E$48,5,FALSE))","v":""},null,null,null,null,null,null,"",{"$f":"IF(AND(P183<>\"\",O183<>\"\"),IF(N183=\"A\",VLOOKUP(P183,'Otras referencias'!$J$24:$K$35,2,FALSE),IF(N183=\"B\",VLOOKUP(P183,'Otras referencias'!$N$24:$O$35,2,),IF(N183=\"C\",VLOOKUP(P183,'Otras referencias'!$R$24:$S$35,2,FALSE)))),\"\")","v":""},{"$f":"IF(S183=\"\",\"\",INDEX(referentes!$G$2:$H$5,MATCH(S183,referentes!$H$2:$H$5,0),1))","v":""},null,null,{"$f":"IF(T183=\"\",\"\",VLOOKUP(T183,referentes!$Q$2:$X$209,2,FALSE))","v":""},null,null,null,null,"",null,null,null,"",null,null,{"$f":"IF(AF183<>\"\",VLOOKUP(AF183,'Otras referencias'!$H$19:$I$20,2,FALSE),\"\")","v":""},null,{"$f":"IF(AH183<>\"\",VLOOKUP(AH183,'Otras referencias'!$H$19:$I$20,2,FALSE),\"\")","v":""},null,{"$f":"IF(AJ183<>\"\",VLOOKUP(AJ183,'Otras referencias'!$H$19:$I$20,2,FALSE),\"\")","v":""},null,{"$f":"IF(AL183<>\"\",VLOOKUP(AL183,'Otras referencias'!$H$19:$I$20,2,FALSE),\"\")","v":""}]
[null,{"$f":"IF(C184=\"\",\"\",IF(COUNTIF($C$3:C184, C184)>1, \"\", C184))","v":""},{"$f":"IF(J184=\"\",\"\",CONCATENATE(DIGITADOR!$M$1,J184,E184))","v":""},"",{"$f":"IF(H184=\"\",\"\",VLOOKUP(H184,'Otras referencias'!$A$24:$E$48,2,FALSE))","v":""},null,null,null,{"$f":"IF(H184=\"\",\"\",VLOOKUP(H184,'Otras referencias'!$A$24:$E$48,5,FALSE))","v":""},null,null,null,null,null,null,"",{"$f":"IF(AND(P184<>\"\",O184<>\"\"),IF(N184=\"A\",VLOOKUP(P184,'Otras referencias'!$J$24:$K$35,2,FALSE),IF(N184=\"B\",VLOOKUP(P184,'Otras referencias'!$N$24:$O$35,2,),IF(N184=\"C\",VLOOKUP(P184,'Otras referencias'!$R$24:$S$35,2,FALSE)))),\"\")","v":""},{"$f":"IF(S184=\"\",\"\",INDEX(referentes!$G$2:$H$5,MATCH(S184,referentes!$H$2:$H$5,0),1))","v":""},null,null,{"$f":"IF(T184=\"\",\"\",VLOOKUP(T184,referentes!$Q$2:$X$209,2,FALSE))","v":""},null,null,null,null,"",null,null,null,"",null,null,{"$f":"IF(AF184<>\"\",VLOOKUP(AF184,'Otras referencias'!$H$19:$I$20,2,FALSE),\"\")","v":""},null,{"$f":"IF(AH184<>\"\",VLOOKUP(AH184,'Otras referencias'!$H$19:$I$20,2,FALSE),\"\")","v":""},null,{"$f":"IF(AJ184<>\"\",VLOOKUP(AJ184,'Otras referencias'!$H$19:$I$20,2,FALSE),\"\")","v":""},null,{"$f":"IF(AL184<>\"\",VLOOKUP(AL184,'Otras referencias'!$H$19:$I$20,2,FALSE),\"\")","v":""}]
[null,{"$f":"IF(C185=\"\",\"\",IF(COUNTIF($C$3:C185, C185)>1, \"\", C185))","v":""},{"$f":"IF(J185=\"\",\"\",CONCATENATE(DIGITADOR!$M$1,J185,E185))","v":""},"",{"$f":"IF(H185=\"\",\"\",VLOOKUP(H185,'Otras referencias'!$A$24:$E$48,2,FALSE))","v":""},null,null,null,{"$f":"IF(H185=\"\",\"\",VLOOKUP(H185,'Otras referencias'!$A$24:$E$48,5,FALSE))","v":""},null,null,null,null,null,null,"",{"$f":"IF(AND(P185<>\"\",O185<>\"\"),IF(N185=\"A\",VLOOKUP(P185,'Otras referencias'!$J$24:$K$35,2,FALSE),IF(N185=\"B\",VLOOKUP(P185,'Otras referencias'!$N$24:$O$35,2,),IF(N185=\"C\",VLOOKUP(P185,'Otras referencias'!$R$24:$S$35,2,FALSE)))),\"\")","v":""},{"$f":"IF(S185=\"\",\"\",INDEX(referentes!$G$2:$H$5,MATCH(S185,referentes!$H$2:$H$5,0),1))","v":""},null,null,{"$f":"IF(T185=\"\",\"\",VLOOKUP(T185,referentes!$Q$2:$X$209,2,FALSE))","v":""},null,null,null,null,"",null,null,null,"",null,null,{"$f":"IF(AF185<>\"\",VLOOKUP(AF185,'Otras referencias'!$H$19:$I$20,2,FALSE),\"\")","v":""},null,{"$f":"IF(AH185<>\"\",VLOOKUP(AH185,'Otras referencias'!$H$19:$I$20,2,FALSE),\"\")","v":""},null,{"$f":"IF(AJ185<>\"\",VLOOKUP(AJ185,'Otras referencias'!$H$19:$I$20,2,FALSE),\"\")","v":""},null,{"$f":"IF(AL185<>\"\",VLOOKUP(AL185,'Otras referencias'!$H$19:$I$20,2,FALSE),\"\")","v":""}]
[null,{"$f":"IF(C186=\"\",\"\",IF(COUNTIF($C$3:C186, C186)>1, \"\", C186))","v":""},{"$f":"IF(J186=\"\",\"\",CONCATENATE(DIGITADOR!$M$1,J186,E186))","v":""},"",{"$f":"IF(H186=\"\",\"\",VLOOKUP(H186,'Otras referencias'!$A$24:$E$48,2,FALSE))","v":""},null,null,null,{"$f":"IF(H186=\"\",\"\",VLOOKUP(H186,'Otras referencias'!$A$24:$E$48,5,FALSE))","v":""},null,null,null,null,null,null,"",{"$f":"IF(AND(P186<>\"\",O186<>\"\"),IF(N186=\"A\",VLOOKUP(P186,'Otras referencias'!$J$24:$K$35,2,FALSE),IF(N186=\"B\",VLOOKUP(P186,'Otras referencias'!$N$24:$O$35,2,),IF(N186=\"C\",VLOOKUP(P186,'Otras referencias'!$R$24:$S$35,2,FALSE)))),\"\")","v":""},{"$f":"IF(S186=\"\",\"\",INDEX(referentes!$G$2:$H$5,MATCH(S186,referentes!$H$2:$H$5,0),1))","v":""},null,null,{"$f":"IF(T186=\"\",\"\",VLOOKUP(T186,referentes!$Q$2:$X$209,2,FALSE))","v":""},null,null,null,null,"",null,null,null,"",null,null,{"$f":"IF(AF186<>\"\",VLOOKUP(AF186,'Otras referencias'!$H$19:$I$20,2,FALSE),\"\")","v":""},null,{"$f":"IF(AH186<>\"\",VLOOKUP(AH186,'Otras referencias'!$H$19:$I$20,2,FALSE),\"\")","v":""},null,{"$f":"IF(AJ186<>\"\",VLOOKUP(AJ186,'Otras referencias'!$H$19:$I$20,2,FALSE),\"\")","v":""},null,{"$f":"IF(AL186<>\"\",VLOOKUP(AL186,'Otras referencias'!$H$19:$I$20,2,FALSE),\"\")","v":""}]
[null,{"$f":"IF(C187=\"\",\"\",IF(COUNTIF($C$3:C187, C187)>1, \"\", C187))","v":""},{"$f":"IF(J187=\"\",\"\",CONCATENATE(DIGITADOR!$M$1,J187,E187))","v":""},"",{"$f":"IF(H187=\"\",\"\",VLOOKUP(H187,'Otras referencias'!$A$24:$E$48,2,FALSE))","v":""},null,null,null,{"$f":"IF(H187=\"\",\"\",VLOOKUP(H187,'Otras referencias'!$A$24:$E$48,5,FALSE))","v":""},null,null,null,null,null,null,"",{"$f":"IF(AND(P187<>\"\",O187<>\"\"),IF(N187=\"A\",VLOOKUP(P187,'Otras referencias'!$J$24:$K$35,2,FALSE),IF(N187=\"B\",VLOOKUP(P187,'Otras referencias'!$N$24:$O$35,2,),IF(N187=\"C\",VLOOKUP(P187,'Otras referencias'!$R$24:$S$35,2,FALSE)))),\"\")","v":""},{"$f":"IF(S187=\"\",\"\",INDEX(referentes!$G$2:$H$5,MATCH(S187,referentes!$H$2:$H$5,0),1))","v":""},null,null,{"$f":"IF(T187=\"\",\"\",VLOOKUP(T187,referentes!$Q$2:$X$209,2,FALSE))","v":""},null,null,null,null,"",null,null,null,"",null,null,{"$f":"IF(AF187<>\"\",VLOOKUP(AF187,'Otras referencias'!$H$19:$I$20,2,FALSE),\"\")","v":""},null,{"$f":"IF(AH187<>\"\",VLOOKUP(AH187,'Otras referencias'!$H$19:$I$20,2,FALSE),\"\")","v":""},null,{"$f":"IF(AJ187<>\"\",VLOOKUP(AJ187,'Otras referencias'!$H$19:$I$20,2,FALSE),\"\")","v":""},null,{"$f":"IF(AL187<>\"\",VLOOKUP(AL187,'Otras referencias'!$H$19:$I$20,2,FALSE),\"\")","v":""}]
[null,{"$f":"IF(C188=\"\",\"\",IF(COUNTIF($C$3:C188, C188)>1, \"\", C188))","v":""},{"$f":"IF(J188=\"\",\"\",CONCATENATE(DIGITADOR!$M$1,J188,E188))","v":""},"",{"$f":"IF(H188=\"\",\"\",VLOOKUP(H188,'Otras referencias'!$A$24:$E$48,2,FALSE))","v":""},null,null,null,{"$f":"IF(H188=\"\",\"\",VLOOKUP(H188,'Otras referencias'!$A$24:$E$48,5,FALSE))","v":""},null,null,null,null,null,null,"",{"$f":"IF(AND(P188<>\"\",O188<>\"\"),IF(N188=\"A\",VLOOKUP(P188,'Otras referencias'!$J$24:$K$35,2,FALSE),IF(N188=\"B\",VLOOKUP(P188,'Otras referencias'!$N$24:$O$35,2,),IF(N188=\"C\",VLOOKUP(P188,'Otras referencias'!$R$24:$S$35,2,FALSE)))),\"\")","v":""},{"$f":"IF(S188=\"\",\"\",INDEX(referentes!$G$2:$H$5,MATCH(S188,referentes!$H$2:$H$5,0),1))","v":""},null,null,{"$f":"IF(T188=\"\",\"\",VLOOKUP(T188,referentes!$Q$2:$X$209,2,FALSE))","v":""},null,null,null,null,"",null,null,null,"",null,null,{"$f":"IF(AF188<>\"\",VLOOKUP(AF188,'Otras referencias'!$H$19:$I$20,2,FALSE),\"\")","v":""},null,{"$f":"IF(AH188<>\"\",VLOOKUP(AH188,'Otras referencias'!$H$19:$I$20,2,FALSE),\"\")","v":""},null,{"$f":"IF(AJ188<>\"\",VLOOKUP(AJ188,'Otras referencias'!$H$19:$I$20,2,FALSE),\"\")","v":""},null,{"$f":"IF(AL188<>\"\",VLOOKUP(AL188,'Otras referencias'!$H$19:$I$20,2,FALSE),\"\")","v":""}]
[null,{"$f":"IF(C189=\"\",\"\",IF(COUNTIF($C$3:C189, C189)>1, \"\", C189))","v":""},{"$f":"IF(J189=\"\",\"\",CONCATENATE(DIGITADOR!$M$1,J189,E189))","v":""},"",{"$f":"IF(H189=\"\",\"\",VLOOKUP(H189,'Otras referencias'!$A$24:$E$48,2,FALSE))","v":""},null,null,null,{"$f":"IF(H189=\"\",\"\",VLOOKUP(H189,'Otras referencias'!$A$24:$E$48,5,FALSE))","v":""},null,null,null,null,null,null,"",{"$f":"IF(AND(P189<>\"\",O189<>\"\"),IF(N189=\"A\",VLOOKUP(P189,'Otras referencias'!$J$24:$K$35,2,FALSE),IF(N189=\"B\",VLOOKUP(P189,'Otras referencias'!$N$24:$O$35,2,),IF(N189=\"C\",VLOOKUP(P189,'Otras referencias'!$R$24:$S$35,2,FALSE)))),\"\")","v":""},{"$f":"IF(S189=\"\",\"\",INDEX(referentes!$G$2:$H$5,MATCH(S189,referentes!$H$2:$H$5,0),1))","v":""},null,null,{"$f":"IF(T189=\"\",\"\",VLOOKUP(T189,referentes!$Q$2:$X$209,2,FALSE))","v":""},null,null,null,null,"",null,null,null,"",null,null,{"$f":"IF(AF189<>\"\",VLOOKUP(AF189,'Otras referencias'!$H$19:$I$20,2,FALSE),\"\")","v":""},null,{"$f":"IF(AH189<>\"\",VLOOKUP(AH189,'Otras referencias'!$H$19:$I$20,2,FALSE),\"\")","v":""},null,{"$f":"IF(AJ189<>\"\",VLOOKUP(AJ189,'Otras referencias'!$H$19:$I$20,2,FALSE),\"\")","v":""},null,{"$f":"IF(AL189<>\"\",VLOOKUP(AL189,'Otras referencias'!$H$19:$I$20,2,FALSE),\"\")","v":""}]
[null,{"$f":"IF(C190=\"\",\"\",IF(COUNTIF($C$3:C190, C190)>1, \"\", C190))","v":""},{"$f":"IF(J190=\"\",\"\",CONCATENATE(DIGITADOR!$M$1,J190,E190))","v":""},"",{"$f":"IF(H190=\"\",\"\",VLOOKUP(H190,'Otras referencias'!$A$24:$E$48,2,FALSE))","v":""},null,null,null,{"$f":"IF(H190=\"\",\"\",VLOOKUP(H190,'Otras referencias'!$A$24:$E$48,5,FALSE))","v":""},null,null,null,null,null,null,"",{"$f":"IF(AND(P190<>\"\",O190<>\"\"),IF(N190=\"A\",VLOOKUP(P190,'Otras referencias'!$J$24:$K$35,2,FALSE),IF(N190=\"B\",VLOOKUP(P190,'Otras referencias'!$N$24:$O$35,2,),IF(N190=\"C\",VLOOKUP(P190,'Otras referencias'!$R$24:$S$35,2,FALSE)))),\"\")","v":""},{"$f":"IF(S190=\"\",\"\",INDEX(referentes!$G$2:$H$5,MATCH(S190,referentes!$H$2:$H$5,0),1))","v":""},null,null,{"$f":"IF(T190=\"\",\"\",VLOOKUP(T190,referentes!$Q$2:$X$209,2,FALSE))","v":""},null,null,null,null,"",null,null,null,"",null,null,{"$f":"IF(AF190<>\"\",VLOOKUP(AF190,'Otras referencias'!$H$19:$I$20,2,FALSE),\"\")","v":""},null,{"$f":"IF(AH190<>\"\",VLOOKUP(AH190,'Otras referencias'!$H$19:$I$20,2,FALSE),\"\")","v":""},null,{"$f":"IF(AJ190<>\"\",VLOOKUP(AJ190,'Otras referencias'!$H$19:$I$20,2,FALSE),\"\")","v":""},null,{"$f":"IF(AL190<>\"\",VLOOKUP(AL190,'Otras referencias'!$H$19:$I$20,2,FALSE),\"\")","v":""}]
[null,{"$f":"IF(C191=\"\",\"\",IF(COUNTIF($C$3:C191, C191)>1, \"\", C191))","v":""},{"$f":"IF(J191=\"\",\"\",CONCATENATE(DIGITADOR!$M$1,J191,E191))","v":""},"",{"$f":"IF(H191=\"\",\"\",VLOOKUP(H191,'Otras referencias'!$A$24:$E$48,2,FALSE))","v":""},null,null,null,{"$f":"IF(H191=\"\",\"\",VLOOKUP(H191,'Otras referencias'!$A$24:$E$48,5,FALSE))","v":""},null,null,null,null,null,null,"",{"$f":"IF(AND(P191<>\"\",O191<>\"\"),IF(N191=\"A\",VLOOKUP(P191,'Otras referencias'!$J$24:$K$35,2,FALSE),IF(N191=\"B\",VLOOKUP(P191,'Otras referencias'!$N$24:$O$35,2,),IF(N191=\"C\",VLOOKUP(P191,'Otras referencias'!$R$24:$S$35,2,FALSE)))),\"\")","v":""},{"$f":"IF(S191=\"\",\"\",INDEX(referentes!$G$2:$H$5,MATCH(S191,referentes!$H$2:$H$5,0),1))","v":""},null,null,{"$f":"IF(T191=\"\",\"\",VLOOKUP(T191,referentes!$Q$2:$X$209,2,FALSE))","v":""},null,null,null,null,"",null,null,null,"",null,null,{"$f":"IF(AF191<>\"\",VLOOKUP(AF191,'Otras referencias'!$H$19:$I$20,2,FALSE),\"\")","v":""},null,{"$f":"IF(AH191<>\"\",VLOOKUP(AH191,'Otras referencias'!$H$19:$I$20,2,FALSE),\"\")","v":""},null,{"$f":"IF(AJ191<>\"\",VLOOKUP(AJ191,'Otras referencias'!$H$19:$I$20,2,FALSE),\"\")","v":""},null,{"$f":"IF(AL191<>\"\",VLOOKUP(AL191,'Otras referencias'!$H$19:$I$20,2,FALSE),\"\")","v":""}]
[null,{"$f":"IF(C192=\"\",\"\",IF(COUNTIF($C$3:C192, C192)>1, \"\", C192))","v":""},{"$f":"IF(J192=\"\",\"\",CONCATENATE(DIGITADOR!$M$1,J192,E192))","v":""},"",{"$f":"IF(H192=\"\",\"\",VLOOKUP(H192,'Otras referencias'!$A$24:$E$48,2,FALSE))","v":""},null,null,null,{"$f":"IF(H192=\"\",\"\",VLOOKUP(H192,'Otras referencias'!$A$24:$E$48,5,FALSE))","v":""},null,null,null,null,null,null,"",{"$f":"IF(AND(P192<>\"\",O192<>\"\"),IF(N192=\"A\",VLOOKUP(P192,'Otras referencias'!$J$24:$K$35,2,FALSE),IF(N192=\"B\",VLOOKUP(P192,'Otras referencias'!$N$24:$O$35,2,),IF(N192=\"C\",VLOOKUP(P192,'Otras referencias'!$R$24:$S$35,2,FALSE)))),\"\")","v":""},{"$f":"IF(S192=\"\",\"\",INDEX(referentes!$G$2:$H$5,MATCH(S192,referentes!$H$2:$H$5,0),1))","v":""},null,null,{"$f":"IF(T192=\"\",\"\",VLOOKUP(T192,referentes!$Q$2:$X$209,2,FALSE))","v":""},null,null,null,null,"",null,null,null,"",null,null,{"$f":"IF(AF192<>\"\",VLOOKUP(AF192,'Otras referencias'!$H$19:$I$20,2,FALSE),\"\")","v":""},null,{"$f":"IF(AH192<>\"\",VLOOKUP(AH192,'Otras referencias'!$H$19:$I$20,2,FALSE),\"\")","v":""},null,{"$f":"IF(AJ192<>\"\",VLOOKUP(AJ192,'Otras referencias'!$H$19:$I$20,2,FALSE),\"\")","v":""},null,{"$f":"IF(AL192<>\"\",VLOOKUP(AL192,'Otras referencias'!$H$19:$I$20,2,FALSE),\"\")","v":""}]
[null,{"$f":"IF(C193=\"\",\"\",IF(COUNTIF($C$3:C193, C193)>1, \"\", C193))","v":""},{"$f":"IF(J193=\"\",\"\",CONCATENATE(DIGITADOR!$M$1,J193,E193))","v":""},"",{"$f":"IF(H193=\"\",\"\",VLOOKUP(H193,'Otras referencias'!$A$24:$E$48,2,FALSE))","v":""},null,null,null,{"$f":"IF(H193=\"\",\"\",VLOOKUP(H193,'Otras referencias'!$A$24:$E$48,5,FALSE))","v":""},null,null,null,null,null,null,"",{"$f":"IF(AND(P193<>\"\",O193<>\"\"),IF(N193=\"A\",VLOOKUP(P193,'Otras referencias'!$J$24:$K$35,2,FALSE),IF(N193=\"B\",VLOOKUP(P193,'Otras referencias'!$N$24:$O$35,2,),IF(N193=\"C\",VLOOKUP(P193,'Otras referencias'!$R$24:$S$35,2,FALSE)))),\"\")","v":""},{"$f":"IF(S193=\"\",\"\",INDEX(referentes!$G$2:$H$5,MATCH(S193,referentes!$H$2:$H$5,0),1))","v":""},null,null,{"$f":"IF(T193=\"\",\"\",VLOOKUP(T193,referentes!$Q$2:$X$209,2,FALSE))","v":""},null,null,null,null,"",null,null,null,"",null,null,{"$f":"IF(AF193<>\"\",VLOOKUP(AF193,'Otras referencias'!$H$19:$I$20,2,FALSE),\"\")","v":""},null,{"$f":"IF(AH193<>\"\",VLOOKUP(AH193,'Otras referencias'!$H$19:$I$20,2,FALSE),\"\")","v":""},null,{"$f":"IF(AJ193<>\"\",VLOOKUP(AJ193,'Otras referencias'!$H$19:$I$20,2,FALSE),\"\")","v":""},null,{"$f":"IF(AL193<>\"\",VLOOKUP(AL193,'Otras referencias'!$H$19:$I$20,2,FALSE),\"\")","v":""}]
[null,{"$f":"IF(C194=\"\",\"\",IF(COUNTIF($C$3:C194, C194)>1, \"\", C194))","v":""},{"$f":"IF(J194=\"\",\"\",CONCATENATE(DIGITADOR!$M$1,J194,E194))","v":""},"",{"$f":"IF(H194=\"\",\"\",VLOOKUP(H194,'Otras referencias'!$A$24:$E$48,2,FALSE))","v":""},null,null,null,{"$f":"IF(H194=\"\",\"\",VLOOKUP(H194,'Otras referencias'!$A$24:$E$48,5,FALSE))","v":""},null,null,null,null,null,null,"",{"$f":"IF(AND(P194<>\"\",O194<>\"\"),IF(N194=\"A\",VLOOKUP(P194,'Otras referencias'!$J$24:$K$35,2,FALSE),IF(N194=\"B\",VLOOKUP(P194,'Otras referencias'!$N$24:$O$35,2,),IF(N194=\"C\",VLOOKUP(P194,'Otras referencias'!$R$24:$S$35,2,FALSE)))),\"\")","v":""},{"$f":"IF(S194=\"\",\"\",INDEX(referentes!$G$2:$H$5,MATCH(S194,referentes!$H$2:$H$5,0),1))","v":""},null,null,{"$f":"IF(T194=\"\",\"\",VLOOKUP(T194,referentes!$Q$2:$X$209,2,FALSE))","v":""},null,null,null,null,"",null,null,null,"",null,null,{"$f":"IF(AF194<>\"\",VLOOKUP(AF194,'Otras referencias'!$H$19:$I$20,2,FALSE),\"\")","v":""},null,{"$f":"IF(AH194<>\"\",VLOOKUP(AH194,'Otras referencias'!$H$19:$I$20,2,FALSE),\"\")","v":""},null,{"$f":"IF(AJ194<>\"\",VLOOKUP(AJ194,'Otras referencias'!$H$19:$I$20,2,FALSE),\"\")","v":""},null,{"$f":"IF(AL194<>\"\",VLOOKUP(AL194,'Otras referencias'!$H$19:$I$20,2,FALSE),\"\")","v":""}]
[null,{"$f":"IF(C195=\"\",\"\",IF(COUNTIF($C$3:C195, C195)>1, \"\", C195))","v":""},{"$f":"IF(J195=\"\",\"\",CONCATENATE(DIGITADOR!$M$1,J195,E195))","v":""},"",{"$f":"IF(H195=\"\",\"\",VLOOKUP(H195,'Otras referencias'!$A$24:$E$48,2,FALSE))","v":""},null,null,null,{"$f":"IF(H195=\"\",\"\",VLOOKUP(H195,'Otras referencias'!$A$24:$E$48,5,FALSE))","v":""},null,null,null,null,null,null,"",{"$f":"IF(AND(P195<>\"\",O195<>\"\"),IF(N195=\"A\",VLOOKUP(P195,'Otras referencias'!$J$24:$K$35,2,FALSE),IF(N195=\"B\",VLOOKUP(P195,'Otras referencias'!$N$24:$O$35,2,),IF(N195=\"C\",VLOOKUP(P195,'Otras referencias'!$R$24:$S$35,2,FALSE)))),\"\")","v":""},{"$f":"IF(S195=\"\",\"\",INDEX(referentes!$G$2:$H$5,MATCH(S195,referentes!$H$2:$H$5,0),1))","v":""},null,null,{"$f":"IF(T195=\"\",\"\",VLOOKUP(T195,referentes!$Q$2:$X$209,2,FALSE))","v":""},null,null,null,null,"",null,null,null,"",null,null,{"$f":"IF(AF195<>\"\",VLOOKUP(AF195,'Otras referencias'!$H$19:$I$20,2,FALSE),\"\")","v":""},null,{"$f":"IF(AH195<>\"\",VLOOKUP(AH195,'Otras referencias'!$H$19:$I$20,2,FALSE),\"\")","v":""},null,{"$f":"IF(AJ195<>\"\",VLOOKUP(AJ195,'Otras referencias'!$H$19:$I$20,2,FALSE),\"\")","v":""},null,{"$f":"IF(AL195<>\"\",VLOOKUP(AL195,'Otras referencias'!$H$19:$I$20,2,FALSE),\"\")","v":""}]
[null,{"$f":"IF(C196=\"\",\"\",IF(COUNTIF($C$3:C196, C196)>1, \"\", C196))","v":""},{"$f":"IF(J196=\"\",\"\",CONCATENATE(DIGITADOR!$M$1,J196,E196))","v":""},{"$f":"IF(C196=\"\",\"\",CONCATENATE(C196,ROW()-2))","v":""},{"$f":"IF(H196=\"\",\"\",VLOOKUP(H196,'Otras referencias'!$A$24:$E$48,2,FALSE))","v":""},null,null,null,{"$f":"IF(H196=\"\",\"\",VLOOKUP(H196,'Otras referencias'!$A$24:$E$48,5,FALSE))","v":""},null,null,null,null,null,null,{"$f":"CONCATENATE(N196,O196)","v":""},{"$f":"IF(AND(P196<>\"\",O196<>\"\"),IF(N196=\"A\",VLOOKUP(P196,'Otras referencias'!$J$24:$K$35,2,FALSE),IF(N196=\"B\",VLOOKUP(P196,'Otras referencias'!$N$24:$O$35,2,),IF(N196=\"C\",VLOOKUP(P196,'Otras referencias'!$R$24:$S$35,2,FALSE)))),\"\")","v":""},{"$f":"IF(S196=\"\",\"\",INDEX(referentes!$G$2:$H$5,MATCH(S196,referentes!$H$2:$H$5,0),1))","v":""},null,null,{"$f":"IF(T196=\"\",\"\",VLOOKUP(T196,referentes!$Q$2:$X$209,2,FALSE))","v":""},null,null,null,null,{"$f":"IF(OR(W196=\"\",X196=\"\",Y196=\"\"),\"\",AVERAGE(W196,X196,Y196))","v":""},null,null,null,{"$f":"IF(OR(AA196=\"\",AB196=\"\",AC196=\"\"),\"\",AVERAGE(AA196,AB196,AC196))","v":""},null,null,{"$f":"IF(AF196<>\"\",VLOOKUP(AF196,'Otras referencias'!$H$19:$I$20,2,FALSE),\"\")","v":""},null,{"$f":"IF(AH196<>\"\",VLOOKUP(AH196,'Otras referencias'!$H$19:$I$20,2,FALSE),\"\")","v":""},null,{"$f":"IF(AJ196<>\"\",VLOOKUP(AJ196,'Otras referencias'!$H$19:$I$20,2,FALSE),\"\")","v":""},null,{"$f":"IF(AL196<>\"\",VLOOKUP(AL196,'Otras referencias'!$H$19:$I$20,2,FALSE),\"\")","v":""}]
[null,{"$f":"IF(C197=\"\",\"\",IF(COUNTIF($C$3:C197, C197)>1, \"\", C197))","v":""},{"$f":"IF(J197=\"\",\"\",CONCATENATE(DIGITADOR!$M$1,J197,E197))","v":""},"",{"$f":"IF(H197=\"\",\"\",VLOOKUP(H197,'Otras referencias'!$A$24:$E$48,2,FALSE))","v":""},null,null,null,{"$f":"IF(H197=\"\",\"\",VLOOKUP(H197,'Otras referencias'!$A$24:$E$48,5,FALSE))","v":""},null,null,null,null,null,null,"",{"$f":"IF(AND(P197<>\"\",O197<>\"\"),IF(N197=\"A\",VLOOKUP(P197,'Otras referencias'!$J$24:$K$35,2,FALSE),IF(N197=\"B\",VLOOKUP(P197,'Otras referencias'!$N$24:$O$35,2,),IF(N197=\"C\",VLOOKUP(P197,'Otras referencias'!$R$24:$S$35,2,FALSE)))),\"\")","v":""},{"$f":"IF(S197=\"\",\"\",INDEX(referentes!$G$2:$H$5,MATCH(S197,referentes!$H$2:$H$5,0),1))","v":""},null,null,{"$f":"IF(T197=\"\",\"\",VLOOKUP(T197,referentes!$Q$2:$X$209,2,FALSE))","v":""},null,null,null,null,"",null,null,null,"",null,null,{"$f":"IF(AF197<>\"\",VLOOKUP(AF197,'Otras referencias'!$H$19:$I$20,2,FALSE),\"\")","v":""},null,{"$f":"IF(AH197<>\"\",VLOOKUP(AH197,'Otras referencias'!$H$19:$I$20,2,FALSE),\"\")","v":""},null,{"$f":"IF(AJ197<>\"\",VLOOKUP(AJ197,'Otras referencias'!$H$19:$I$20,2,FALSE),\"\")","v":""},null,{"$f":"IF(AL197<>\"\",VLOOKUP(AL197,'Otras referencias'!$H$19:$I$20,2,FALSE),\"\")","v":""}]
[null,{"$f":"IF(C198=\"\",\"\",IF(COUNTIF($C$3:C198, C198)>1, \"\", C198))","v":""},{"$f":"IF(J198=\"\",\"\",CONCATENATE(DIGITADOR!$M$1,J198,E198))","v":""},"",{"$f":"IF(H198=\"\",\"\",VLOOKUP(H198,'Otras referencias'!$A$24:$E$48,2,FALSE))","v":""},null,null,null,{"$f":"IF(H198=\"\",\"\",VLOOKUP(H198,'Otras referencias'!$A$24:$E$48,5,FALSE))","v":""},null,null,null,null,null,null,"",{"$f":"IF(AND(P198<>\"\",O198<>\"\"),IF(N198=\"A\",VLOOKUP(P198,'Otras referencias'!$J$24:$K$35,2,FALSE),IF(N198=\"B\",VLOOKUP(P198,'Otras referencias'!$N$24:$O$35,2,),IF(N198=\"C\",VLOOKUP(P198,'Otras referencias'!$R$24:$S$35,2,FALSE)))),\"\")","v":""},{"$f":"IF(S198=\"\",\"\",INDEX(referentes!$G$2:$H$5,MATCH(S198,referentes!$H$2:$H$5,0),1))","v":""},null,null,{"$f":"IF(T198=\"\",\"\",VLOOKUP(T198,referentes!$Q$2:$X$209,2,FALSE))","v":""},null,null,null,null,"",null,null,null,"",null,null,{"$f":"IF(AF198<>\"\",VLOOKUP(AF198,'Otras referencias'!$H$19:$I$20,2,FALSE),\"\")","v":""},null,{"$f":"IF(AH198<>\"\",VLOOKUP(AH198,'Otras referencias'!$H$19:$I$20,2,FALSE),\"\")","v":""},null,{"$f":"IF(AJ198<>\"\",VLOOKUP(AJ198,'Otras referencias'!$H$19:$I$20,2,FALSE),\"\")","v":""},null,{"$f":"IF(AL198<>\"\",VLOOKUP(AL198,'Otras referencias'!$H$19:$I$20,2,FALSE),\"\")","v":""}]
[null,{"$f":"IF(C199=\"\",\"\",IF(COUNTIF($C$3:C199, C199)>1, \"\", C199))","v":""},{"$f":"IF(J199=\"\",\"\",CONCATENATE(DIGITADOR!$M$1,J199,E199))","v":""},"",{"$f":"IF(H199=\"\",\"\",VLOOKUP(H199,'Otras referencias'!$A$24:$E$48,2,FALSE))","v":""},null,null,null,{"$f":"IF(H199=\"\",\"\",VLOOKUP(H199,'Otras referencias'!$A$24:$E$48,5,FALSE))","v":""},null,null,null,null,null,null,"",{"$f":"IF(AND(P199<>\"\",O199<>\"\"),IF(N199=\"A\",VLOOKUP(P199,'Otras referencias'!$J$24:$K$35,2,FALSE),IF(N199=\"B\",VLOOKUP(P199,'Otras referencias'!$N$24:$O$35,2,),IF(N199=\"C\",VLOOKUP(P199,'Otras referencias'!$R$24:$S$35,2,FALSE)))),\"\")","v":""},{"$f":"IF(S199=\"\",\"\",INDEX(referentes!$G$2:$H$5,MATCH(S199,referentes!$H$2:$H$5,0),1))","v":""},null,null,{"$f":"IF(T199=\"\",\"\",VLOOKUP(T199,referentes!$Q$2:$X$209,2,FALSE))","v":""},null,null,null,null,"",null,null,null,"",null,null,{"$f":"IF(AF199<>\"\",VLOOKUP(AF199,'Otras referencias'!$H$19:$I$20,2,FALSE),\"\")","v":""},null,{"$f":"IF(AH199<>\"\",VLOOKUP(AH199,'Otras referencias'!$H$19:$I$20,2,FALSE),\"\")","v":""},null,{"$f":"IF(AJ199<>\"\",VLOOKUP(AJ199,'Otras referencias'!$H$19:$I$20,2,FALSE),\"\")","v":""},null,{"$f":"IF(AL199<>\"\",VLOOKUP(AL199,'Otras referencias'!$H$19:$I$20,2,FALSE),\"\")","v":""}]
[null,{"$f":"IF(C200=\"\",\"\",IF(COUNTIF($C$3:C200, C200)>1, \"\", C200))","v":""},{"$f":"IF(J200=\"\",\"\",CONCATENATE(DIGITADOR!$M$1,J200,E200))","v":""},"",{"$f":"IF(H200=\"\",\"\",VLOOKUP(H200,'Otras referencias'!$A$24:$E$48,2,FALSE))","v":""},null,null,null,{"$f":"IF(H200=\"\",\"\",VLOOKUP(H200,'Otras referencias'!$A$24:$E$48,5,FALSE))","v":""},null,null,null,null,null,null,"",{"$f":"IF(AND(P200<>\"\",O200<>\"\"),IF(N200=\"A\",VLOOKUP(P200,'Otras referencias'!$J$24:$K$35,2,FALSE),IF(N200=\"B\",VLOOKUP(P200,'Otras referencias'!$N$24:$O$35,2,),IF(N200=\"C\",VLOOKUP(P200,'Otras referencias'!$R$24:$S$35,2,FALSE)))),\"\")","v":""},{"$f":"IF(S200=\"\",\"\",INDEX(referentes!$G$2:$H$5,MATCH(S200,referentes!$H$2:$H$5,0),1))","v":""},null,null,{"$f":"IF(T200=\"\",\"\",VLOOKUP(T200,referentes!$Q$2:$X$209,2,FALSE))","v":""},null,null,null,null,"",null,null,null,"",null,null,{"$f":"IF(AF200<>\"\",VLOOKUP(AF200,'Otras referencias'!$H$19:$I$20,2,FALSE),\"\")","v":""},null,{"$f":"IF(AH200<>\"\",VLOOKUP(AH200,'Otras referencias'!$H$19:$I$20,2,FALSE),\"\")","v":""},null,{"$f":"IF(AJ200<>\"\",VLOOKUP(AJ200,'Otras referencias'!$H$19:$I$20,2,FALSE),\"\")","v":""},null,{"$f":"IF(AL200<>\"\",VLOOKUP(AL200,'Otras referencias'!$H$19:$I$20,2,FALSE),\"\")","v":""}]
[null,{"$f":"IF(C201=\"\",\"\",IF(COUNTIF($C$3:C201, C201)>1, \"\", C201))","v":""},{"$f":"IF(J201=\"\",\"\",CONCATENATE(DIGITADOR!$M$1,J201,E201))","v":""},"",{"$f":"IF(H201=\"\",\"\",VLOOKUP(H201,'Otras referencias'!$A$24:$E$48,2,FALSE))","v":""},null,null,null,{"$f":"IF(H201=\"\",\"\",VLOOKUP(H201,'Otras referencias'!$A$24:$E$48,5,FALSE))","v":""},null,null,null,null,null,null,"",{"$f":"IF(AND(P201<>\"\",O201<>\"\"),IF(N201=\"A\",VLOOKUP(P201,'Otras referencias'!$J$24:$K$35,2,FALSE),IF(N201=\"B\",VLOOKUP(P201,'Otras referencias'!$N$24:$O$35,2,),IF(N201=\"C\",VLOOKUP(P201,'Otras referencias'!$R$24:$S$35,2,FALSE)))),\"\")","v":""},{"$f":"IF(S201=\"\",\"\",INDEX(referentes!$G$2:$H$5,MATCH(S201,referentes!$H$2:$H$5,0),1))","v":""},null,null,{"$f":"IF(T201=\"\",\"\",VLOOKUP(T201,referentes!$Q$2:$X$209,2,FALSE))","v":""},null,null,null,null,"",null,null,null,"",null,null,{"$f":"IF(AF201<>\"\",VLOOKUP(AF201,'Otras referencias'!$H$19:$I$20,2,FALSE),\"\")","v":""},null,{"$f":"IF(AH201<>\"\",VLOOKUP(AH201,'Otras referencias'!$H$19:$I$20,2,FALSE),\"\")","v":""},null,{"$f":"IF(AJ201<>\"\",VLOOKUP(AJ201,'Otras referencias'!$H$19:$I$20,2,FALSE),\"\")","v":""},null,{"$f":"IF(AL201<>\"\",VLOOKUP(AL201,'Otras referencias'!$H$19:$I$20,2,FALSE),\"\")","v":""}]
[null,{"$f":"IF(C202=\"\",\"\",IF(COUNTIF($C$3:C202, C202)>1, \"\", C202))","v":""},{"$f":"IF(J202=\"\",\"\",CONCATENATE(DIGITADOR!$M$1,J202,E202))","v":""},"",{"$f":"IF(H202=\"\",\"\",VLOOKUP(H202,'Otras referencias'!$A$24:$E$48,2,FALSE))","v":""},null,null,null,{"$f":"IF(H202=\"\",\"\",VLOOKUP(H202,'Otras referencias'!$A$24:$E$48,5,FALSE))","v":""},null,null,null,null,null,null,"",{"$f":"IF(AND(P202<>\"\",O202<>\"\"),IF(N202=\"A\",VLOOKUP(P202,'Otras referencias'!$J$24:$K$35,2,FALSE),IF(N202=\"B\",VLOOKUP(P202,'Otras referencias'!$N$24:$O$35,2,),IF(N202=\"C\",VLOOKUP(P202,'Otras referencias'!$R$24:$S$35,2,FALSE)))),\"\")","v":""},{"$f":"IF(S202=\"\",\"\",INDEX(referentes!$G$2:$H$5,MATCH(S202,referentes!$H$2:$H$5,0),1))","v":""},null,null,{"$f":"IF(T202=\"\",\"\",VLOOKUP(T202,referentes!$Q$2:$X$209,2,FALSE))","v":""},null,null,null,null,"",null,null,null,"",null,null,{"$f":"IF(AF202<>\"\",VLOOKUP(AF202,'Otras referencias'!$H$19:$I$20,2,FALSE),\"\")","v":""},null,{"$f":"IF(AH202<>\"\",VLOOKUP(AH202,'Otras referencias'!$H$19:$I$20,2,FALSE),\"\")","v":""},null,{"$f":"IF(AJ202<>\"\",VLOOKUP(AJ202,'Otras referencias'!$H$19:$I$20,2,FALSE),\"\")","v":""},null,{"$f":"IF(AL202<>\"\",VLOOKUP(AL202,'Otras referencias'!$H$19:$I$20,2,FALSE),\"\")","v":""}]
[null,{"$f":"IF(C203=\"\",\"\",IF(COUNTIF($C$3:C203, C203)>1, \"\", C203))","v":""},{"$f":"IF(J203=\"\",\"\",CONCATENATE(DIGITADOR!$M$1,J203,E203))","v":""},"",{"$f":"IF(H203=\"\",\"\",VLOOKUP(H203,'Otras referencias'!$A$24:$E$48,2,FALSE))","v":""},null,null,null,{"$f":"IF(H203=\"\",\"\",VLOOKUP(H203,'Otras referencias'!$A$24:$E$48,5,FALSE))","v":""},null,null,null,null,null,null,"",{"$f":"IF(AND(P203<>\"\",O203<>\"\"),IF(N203=\"A\",VLOOKUP(P203,'Otras referencias'!$J$24:$K$35,2,FALSE),IF(N203=\"B\",VLOOKUP(P203,'Otras referencias'!$N$24:$O$35,2,),IF(N203=\"C\",VLOOKUP(P203,'Otras referencias'!$R$24:$S$35,2,FALSE)))),\"\")","v":""},{"$f":"IF(S203=\"\",\"\",INDEX(referentes!$G$2:$H$5,MATCH(S203,referentes!$H$2:$H$5,0),1))","v":""},null,null,{"$f":"IF(T203=\"\",\"\",VLOOKUP(T203,referentes!$Q$2:$X$209,2,FALSE))","v":""},null,null,null,null,"",null,null,null,"",null,null,{"$f":"IF(AF203<>\"\",VLOOKUP(AF203,'Otras referencias'!$H$19:$I$20,2,FALSE),\"\")","v":""},null,{"$f":"IF(AH203<>\"\",VLOOKUP(AH203,'Otras referencias'!$H$19:$I$20,2,FALSE),\"\")","v":""},null,{"$f":"IF(AJ203<>\"\",VLOOKUP(AJ203,'Otras referencias'!$H$19:$I$20,2,FALSE),\"\")","v":""},null,{"$f":"IF(AL203<>\"\",VLOOKUP(AL203,'Otras referencias'!$H$19:$I$20,2,FALSE),\"\")","v":""}]
[null,{"$f":"IF(C204=\"\",\"\",IF(COUNTIF($C$3:C204, C204)>1, \"\", C204))","v":""},{"$f":"IF(J204=\"\",\"\",CONCATENATE(DIGITADOR!$M$1,J204,E204))","v":""},"",{"$f":"IF(H204=\"\",\"\",VLOOKUP(H204,'Otras referencias'!$A$24:$E$48,2,FALSE))","v":""},null,null,null,{"$f":"IF(H204=\"\",\"\",VLOOKUP(H204,'Otras referencias'!$A$24:$E$48,5,FALSE))","v":""},null,null,null,null,null,null,"",{"$f":"IF(AND(P204<>\"\",O204<>\"\"),IF(N204=\"A\",VLOOKUP(P204,'Otras referencias'!$J$24:$K$35,2,FALSE),IF(N204=\"B\",VLOOKUP(P204,'Otras referencias'!$N$24:$O$35,2,),IF(N204=\"C\",VLOOKUP(P204,'Otras referencias'!$R$24:$S$35,2,FALSE)))),\"\")","v":""},{"$f":"IF(S204=\"\",\"\",INDEX(referentes!$G$2:$H$5,MATCH(S204,referentes!$H$2:$H$5,0),1))","v":""},null,null,{"$f":"IF(T204=\"\",\"\",VLOOKUP(T204,referentes!$Q$2:$X$209,2,FALSE))","v":""},null,null,null,null,"",null,null,null,"",null,null,{"$f":"IF(AF204<>\"\",VLOOKUP(AF204,'Otras referencias'!$H$19:$I$20,2,FALSE),\"\")","v":""},null,{"$f":"IF(AH204<>\"\",VLOOKUP(AH204,'Otras referencias'!$H$19:$I$20,2,FALSE),\"\")","v":""},null,{"$f":"IF(AJ204<>\"\",VLOOKUP(AJ204,'Otras referencias'!$H$19:$I$20,2,FALSE),\"\")","v":""},null,{"$f":"IF(AL204<>\"\",VLOOKUP(AL204,'Otras referencias'!$H$19:$I$20,2,FALSE),\"\")","v":""}]
[null,{"$f":"IF(C205=\"\",\"\",IF(COUNTIF($C$3:C205, C205)>1, \"\", C205))","v":""},{"$f":"IF(J205=\"\",\"\",CONCATENATE(DIGITADOR!$M$1,J205,E205))","v":""},"",{"$f":"IF(H205=\"\",\"\",VLOOKUP(H205,'Otras referencias'!$A$24:$E$48,2,FALSE))","v":""},null,null,null,{"$f":"IF(H205=\"\",\"\",VLOOKUP(H205,'Otras referencias'!$A$24:$E$48,5,FALSE))","v":""},null,null,null,null,null,null,"",{"$f":"IF(AND(P205<>\"\",O205<>\"\"),IF(N205=\"A\",VLOOKUP(P205,'Otras referencias'!$J$24:$K$35,2,FALSE),IF(N205=\"B\",VLOOKUP(P205,'Otras referencias'!$N$24:$O$35,2,),IF(N205=\"C\",VLOOKUP(P205,'Otras referencias'!$R$24:$S$35,2,FALSE)))),\"\")","v":""},{"$f":"IF(S205=\"\",\"\",INDEX(referentes!$G$2:$H$5,MATCH(S205,referentes!$H$2:$H$5,0),1))","v":""},null,null,{"$f":"IF(T205=\"\",\"\",VLOOKUP(T205,referentes!$Q$2:$X$209,2,FALSE))","v":""},null,null,null,null,"",null,null,null,"",null,null,{"$f":"IF(AF205<>\"\",VLOOKUP(AF205,'Otras referencias'!$H$19:$I$20,2,FALSE),\"\")","v":""},null,{"$f":"IF(AH205<>\"\",VLOOKUP(AH205,'Otras referencias'!$H$19:$I$20,2,FALSE),\"\")","v":""},null,{"$f":"IF(AJ205<>\"\",VLOOKUP(AJ205,'Otras referencias'!$H$19:$I$20,2,FALSE),\"\")","v":""},null,{"$f":"IF(AL205<>\"\",VLOOKUP(AL205,'Otras referencias'!$H$19:$I$20,2,FALSE),\"\")","v":""}]
[null,{"$f":"IF(C206=\"\",\"\",IF(COUNTIF($C$3:C206, C206)>1, \"\", C206))","v":""},{"$f":"IF(J206=\"\",\"\",CONCATENATE(DIGITADOR!$M$1,J206,E206))","v":""},"",{"$f":"IF(H206=\"\",\"\",VLOOKUP(H206,'Otras referencias'!$A$24:$E$48,2,FALSE))","v":""},null,null,null,{"$f":"IF(H206=\"\",\"\",VLOOKUP(H206,'Otras referencias'!$A$24:$E$48,5,FALSE))","v":""},null,null,null,null,null,null,"",{"$f":"IF(AND(P206<>\"\",O206<>\"\"),IF(N206=\"A\",VLOOKUP(P206,'Otras referencias'!$J$24:$K$35,2,FALSE),IF(N206=\"B\",VLOOKUP(P206,'Otras referencias'!$N$24:$O$35,2,),IF(N206=\"C\",VLOOKUP(P206,'Otras referencias'!$R$24:$S$35,2,FALSE)))),\"\")","v":""},{"$f":"IF(S206=\"\",\"\",INDEX(referentes!$G$2:$H$5,MATCH(S206,referentes!$H$2:$H$5,0),1))","v":""},null,null,{"$f":"IF(T206=\"\",\"\",VLOOKUP(T206,referentes!$Q$2:$X$209,2,FALSE))","v":""},null,null,null,null,"",null,null,null,"",null,null,{"$f":"IF(AF206<>\"\",VLOOKUP(AF206,'Otras referencias'!$H$19:$I$20,2,FALSE),\"\")","v":""},null,{"$f":"IF(AH206<>\"\",VLOOKUP(AH206,'Otras referencias'!$H$19:$I$20,2,FALSE),\"\")","v":""},null,{"$f":"IF(AJ206<>\"\",VLOOKUP(AJ206,'Otras referencias'!$H$19:$I$20,2,FALSE),\"\")","v":""},null,{"$f":"IF(AL206<>\"\",VLOOKUP(AL206,'Otras referencias'!$H$19:$I$20,2,FALSE),\"\")","v":""}]
[null,{"$f":"IF(C207=\"\",\"\",IF(COUNTIF($C$3:C207, C207)>1, \"\", C207))","v":""},{"$f":"IF(J207=\"\",\"\",CONCATENATE(DIGITADOR!$M$1,J207,E207))","v":""},"",{"$f":"IF(H207=\"\",\"\",VLOOKUP(H207,'Otras referencias'!$A$24:$E$48,2,FALSE))","v":""},null,null,null,{"$f":"IF(H207=\"\",\"\",VLOOKUP(H207,'Otras referencias'!$A$24:$E$48,5,FALSE))","v":""},null,null,null,null,null,null,"",{"$f":"IF(AND(P207<>\"\",O207<>\"\"),IF(N207=\"A\",VLOOKUP(P207,'Otras referencias'!$J$24:$K$35,2,FALSE),IF(N207=\"B\",VLOOKUP(P207,'Otras referencias'!$N$24:$O$35,2,),IF(N207=\"C\",VLOOKUP(P207,'Otras referencias'!$R$24:$S$35,2,FALSE)))),\"\")","v":""},{"$f":"IF(S207=\"\",\"\",INDEX(referentes!$G$2:$H$5,MATCH(S207,referentes!$H$2:$H$5,0),1))","v":""},null,null,{"$f":"IF(T207=\"\",\"\",VLOOKUP(T207,referentes!$Q$2:$X$209,2,FALSE))","v":""},null,null,null,null,"",null,null,null,"",null,null,{"$f":"IF(AF207<>\"\",VLOOKUP(AF207,'Otras referencias'!$H$19:$I$20,2,FALSE),\"\")","v":""},null,{"$f":"IF(AH207<>\"\",VLOOKUP(AH207,'Otras referencias'!$H$19:$I$20,2,FALSE),\"\")","v":""},null,{"$f":"IF(AJ207<>\"\",VLOOKUP(AJ207,'Otras referencias'!$H$19:$I$20,2,FALSE),\"\")","v":""},null,{"$f":"IF(AL207<>\"\",VLOOKUP(AL207,'Otras referencias'!$H$19:$I$20,2,FALSE),\"\")","v":""}]
[null,{"$f":"IF(C208=\"\",\"\",IF(COUNTIF($C$3:C208, C208)>1, \"\", C208))","v":""},{"$f":"IF(J208=\"\",\"\",CONCATENATE(DIGITADOR!$M$1,J208,E208))","v":""},"",{"$f":"IF(H208=\"\",\"\",VLOOKUP(H208,'Otras referencias'!$A$24:$E$48,2,FALSE))","v":""},null,null,null,{"$f":"IF(H208=\"\",\"\",VLOOKUP(H208,'Otras referencias'!$A$24:$E$48,5,FALSE))","v":""},null,null,null,null,null,null,"",{"$f":"IF(AND(P208<>\"\",O208<>\"\"),IF(N208=\"A\",VLOOKUP(P208,'Otras referencias'!$J$24:$K$35,2,FALSE),IF(N208=\"B\",VLOOKUP(P208,'Otras referencias'!$N$24:$O$35,2,),IF(N208=\"C\",VLOOKUP(P208,'Otras referencias'!$R$24:$S$35,2,FALSE)))),\"\")","v":""},{"$f":"IF(S208=\"\",\"\",INDEX(referentes!$G$2:$H$5,MATCH(S208,referentes!$H$2:$H$5,0),1))","v":""},null,null,{"$f":"IF(T208=\"\",\"\",VLOOKUP(T208,referentes!$Q$2:$X$209,2,FALSE))","v":""},null,null,null,null,"",null,null,null,"",null,null,{"$f":"IF(AF208<>\"\",VLOOKUP(AF208,'Otras referencias'!$H$19:$I$20,2,FALSE),\"\")","v":""},null,{"$f":"IF(AH208<>\"\",VLOOKUP(AH208,'Otras referencias'!$H$19:$I$20,2,FALSE),\"\")","v":""},null,{"$f":"IF(AJ208<>\"\",VLOOKUP(AJ208,'Otras referencias'!$H$19:$I$20,2,FALSE),\"\")","v":""},null,{"$f":"IF(AL208<>\"\",VLOOKUP(AL208,'Otras referencias'!$H$19:$I$20,2,FALSE),\"\")","v":""}]
[null,{"$f":"IF(C209=\"\",\"\",IF(COUNTIF($C$3:C209, C209)>1, \"\", C209))","v":""},{"$f":"IF(J209=\"\",\"\",CONCATENATE(DIGITADOR!$M$1,J209,E209))","v":""},"",{"$f":"IF(H209=\"\",\"\",VLOOKUP(H209,'Otras referencias'!$A$24:$E$48,2,FALSE))","v":""},null,null,null,{"$f":"IF(H209=\"\",\"\",VLOOKUP(H209,'Otras referencias'!$A$24:$E$48,5,FALSE))","v":""},null,null,null,null,null,null,"",{"$f":"IF(AND(P209<>\"\",O209<>\"\"),IF(N209=\"A\",VLOOKUP(P209,'Otras referencias'!$J$24:$K$35,2,FALSE),IF(N209=\"B\",VLOOKUP(P209,'Otras referencias'!$N$24:$O$35,2,),IF(N209=\"C\",VLOOKUP(P209,'Otras referencias'!$R$24:$S$35,2,FALSE)))),\"\")","v":""},{"$f":"IF(S209=\"\",\"\",INDEX(referentes!$G$2:$H$5,MATCH(S209,referentes!$H$2:$H$5,0),1))","v":""},null,null,{"$f":"IF(T209=\"\",\"\",VLOOKUP(T209,referentes!$Q$2:$X$209,2,FALSE))","v":""},null,null,null,null,"",null,null,null,"",null,null,{"$f":"IF(AF209<>\"\",VLOOKUP(AF209,'Otras referencias'!$H$19:$I$20,2,FALSE),\"\")","v":""},null,{"$f":"IF(AH209<>\"\",VLOOKUP(AH209,'Otras referencias'!$H$19:$I$20,2,FALSE),\"\")","v":""},null,{"$f":"IF(AJ209<>\"\",VLOOKUP(AJ209,'Otras referencias'!$H$19:$I$20,2,FALSE),\"\")","v":""},null,{"$f":"IF(AL209<>\"\",VLOOKUP(AL209,'Otras referencias'!$H$19:$I$20,2,FALSE),\"\")","v":""}]
[null,{"$f":"IF(C210=\"\",\"\",IF(COUNTIF($C$3:C210, C210)>1, \"\", C210))","v":""},{"$f":"IF(J210=\"\",\"\",CONCATENATE(DIGITADOR!$M$1,J210,E210))","v":""},"",{"$f":"IF(H210=\"\",\"\",VLOOKUP(H210,'Otras referencias'!$A$24:$E$48,2,FALSE))","v":""},null,null,null,{"$f":"IF(H210=\"\",\"\",VLOOKUP(H210,'Otras referencias'!$A$24:$E$48,5,FALSE))","v":""},null,null,null,null,null,null,"",{"$f":"IF(AND(P210<>\"\",O210<>\"\"),IF(N210=\"A\",VLOOKUP(P210,'Otras referencias'!$J$24:$K$35,2,FALSE),IF(N210=\"B\",VLOOKUP(P210,'Otras referencias'!$N$24:$O$35,2,),IF(N210=\"C\",VLOOKUP(P210,'Otras referencias'!$R$24:$S$35,2,FALSE)))),\"\")","v":""},{"$f":"IF(S210=\"\",\"\",INDEX(referentes!$G$2:$H$5,MATCH(S210,referentes!$H$2:$H$5,0),1))","v":""},null,null,{"$f":"IF(T210=\"\",\"\",VLOOKUP(T210,referentes!$Q$2:$X$209,2,FALSE))","v":""},null,null,null,null,"",null,null,null,"",null,null,{"$f":"IF(AF210<>\"\",VLOOKUP(AF210,'Otras referencias'!$H$19:$I$20,2,FALSE),\"\")","v":""},null,{"$f":"IF(AH210<>\"\",VLOOKUP(AH210,'Otras referencias'!$H$19:$I$20,2,FALSE),\"\")","v":""},null,{"$f":"IF(AJ210<>\"\",VLOOKUP(AJ210,'Otras referencias'!$H$19:$I$20,2,FALSE),\"\")","v":""},null,{"$f":"IF(AL210<>\"\",VLOOKUP(AL210,'Otras referencias'!$H$19:$I$20,2,FALSE),\"\")","v":""}]
[null,{"$f":"IF(C211=\"\",\"\",IF(COUNTIF($C$3:C211, C211)>1, \"\", C211))","v":""},{"$f":"IF(J211=\"\",\"\",CONCATENATE(DIGITADOR!$M$1,J211,E211))","v":""},"",{"$f":"IF(H211=\"\",\"\",VLOOKUP(H211,'Otras referencias'!$A$24:$E$48,2,FALSE))","v":""},null,null,null,{"$f":"IF(H211=\"\",\"\",VLOOKUP(H211,'Otras referencias'!$A$24:$E$48,5,FALSE))","v":""},null,null,null,null,null,null,"",{"$f":"IF(AND(P211<>\"\",O211<>\"\"),IF(N211=\"A\",VLOOKUP(P211,'Otras referencias'!$J$24:$K$35,2,FALSE),IF(N211=\"B\",VLOOKUP(P211,'Otras referencias'!$N$24:$O$35,2,),IF(N211=\"C\",VLOOKUP(P211,'Otras referencias'!$R$24:$S$35,2,FALSE)))),\"\")","v":""},{"$f":"IF(S211=\"\",\"\",INDEX(referentes!$G$2:$H$5,MATCH(S211,referentes!$H$2:$H$5,0),1))","v":""},null,null,{"$f":"IF(T211=\"\",\"\",VLOOKUP(T211,referentes!$Q$2:$X$209,2,FALSE))","v":""},null,null,null,null,"",null,null,null,"",null,null,{"$f":"IF(AF211<>\"\",VLOOKUP(AF211,'Otras referencias'!$H$19:$I$20,2,FALSE),\"\")","v":""},null,{"$f":"IF(AH211<>\"\",VLOOKUP(AH211,'Otras referencias'!$H$19:$I$20,2,FALSE),\"\")","v":""},null,{"$f":"IF(AJ211<>\"\",VLOOKUP(AJ211,'Otras referencias'!$H$19:$I$20,2,FALSE),\"\")","v":""},null,{"$f":"IF(AL211<>\"\",VLOOKUP(AL211,'Otras referencias'!$H$19:$I$20,2,FALSE),\"\")","v":""}]
[null,{"$f":"IF(C212=\"\",\"\",IF(COUNTIF($C$3:C212, C212)>1, \"\", C212))","v":""},{"$f":"IF(J212=\"\",\"\",CONCATENATE(DIGITADOR!$M$1,J212,E212))","v":""},"",{"$f":"IF(H212=\"\",\"\",VLOOKUP(H212,'Otras referencias'!$A$24:$E$48,2,FALSE))","v":""},null,null,null,{"$f":"IF(H212=\"\",\"\",VLOOKUP(H212,'Otras referencias'!$A$24:$E$48,5,FALSE))","v":""},null,null,null,null,null,null,"",{"$f":"IF(AND(P212<>\"\",O212<>\"\"),IF(N212=\"A\",VLOOKUP(P212,'Otras referencias'!$J$24:$K$35,2,FALSE),IF(N212=\"B\",VLOOKUP(P212,'Otras referencias'!$N$24:$O$35,2,),IF(N212=\"C\",VLOOKUP(P212,'Otras referencias'!$R$24:$S$35,2,FALSE)))),\"\")","v":""},{"$f":"IF(S212=\"\",\"\",INDEX(referentes!$G$2:$H$5,MATCH(S212,referentes!$H$2:$H$5,0),1))","v":""},null,null,{"$f":"IF(T212=\"\",\"\",VLOOKUP(T212,referentes!$Q$2:$X$209,2,FALSE))","v":""},null,null,null,null,"",null,null,null,"",null,null,{"$f":"IF(AF212<>\"\",VLOOKUP(AF212,'Otras referencias'!$H$19:$I$20,2,FALSE),\"\")","v":""},null,{"$f":"IF(AH212<>\"\",VLOOKUP(AH212,'Otras referencias'!$H$19:$I$20,2,FALSE),\"\")","v":""},null,{"$f":"IF(AJ212<>\"\",VLOOKUP(AJ212,'Otras referencias'!$H$19:$I$20,2,FALSE),\"\")","v":""},null,{"$f":"IF(AL212<>\"\",VLOOKUP(AL212,'Otras referencias'!$H$19:$I$20,2,FALSE),\"\")","v":""}]
[null,{"$f":"IF(C213=\"\",\"\",IF(COUNTIF($C$3:C213, C213)>1, \"\", C213))","v":""},{"$f":"IF(J213=\"\",\"\",CONCATENATE(DIGITADOR!$M$1,J213,E213))","v":""},"",{"$f":"IF(H213=\"\",\"\",VLOOKUP(H213,'Otras referencias'!$A$24:$E$48,2,FALSE))","v":""},null,null,null,{"$f":"IF(H213=\"\",\"\",VLOOKUP(H213,'Otras referencias'!$A$24:$E$48,5,FALSE))","v":""},null,null,null,null,null,null,"",{"$f":"IF(AND(P213<>\"\",O213<>\"\"),IF(N213=\"A\",VLOOKUP(P213,'Otras referencias'!$J$24:$K$35,2,FALSE),IF(N213=\"B\",VLOOKUP(P213,'Otras referencias'!$N$24:$O$35,2,),IF(N213=\"C\",VLOOKUP(P213,'Otras referencias'!$R$24:$S$35,2,FALSE)))),\"\")","v":""},{"$f":"IF(S213=\"\",\"\",INDEX(referentes!$G$2:$H$5,MATCH(S213,referentes!$H$2:$H$5,0),1))","v":""},null,null,{"$f":"IF(T213=\"\",\"\",VLOOKUP(T213,referentes!$Q$2:$X$209,2,FALSE))","v":""},null,null,null,null,"",null,null,null,"",null,null,{"$f":"IF(AF213<>\"\",VLOOKUP(AF213,'Otras referencias'!$H$19:$I$20,2,FALSE),\"\")","v":""},null,{"$f":"IF(AH213<>\"\",VLOOKUP(AH213,'Otras referencias'!$H$19:$I$20,2,FALSE),\"\")","v":""},null,{"$f":"IF(AJ213<>\"\",VLOOKUP(AJ213,'Otras referencias'!$H$19:$I$20,2,FALSE),\"\")","v":""},null,{"$f":"IF(AL213<>\"\",VLOOKUP(AL213,'Otras referencias'!$H$19:$I$20,2,FALSE),\"\")","v":""}]
[null,{"$f":"IF(C214=\"\",\"\",IF(COUNTIF($C$3:C214, C214)>1, \"\", C214))","v":""},{"$f":"IF(J214=\"\",\"\",CONCATENATE(DIGITADOR!$M$1,J214,E214))","v":""},"",{"$f":"IF(H214=\"\",\"\",VLOOKUP(H214,'Otras referencias'!$A$24:$E$48,2,FALSE))","v":""},null,null,null,{"$f":"IF(H214=\"\",\"\",VLOOKUP(H214,'Otras referencias'!$A$24:$E$48,5,FALSE))","v":""},null,null,null,null,null,null,"",{"$f":"IF(AND(P214<>\"\",O214<>\"\"),IF(N214=\"A\",VLOOKUP(P214,'Otras referencias'!$J$24:$K$35,2,FALSE),IF(N214=\"B\",VLOOKUP(P214,'Otras referencias'!$N$24:$O$35,2,),IF(N214=\"C\",VLOOKUP(P214,'Otras referencias'!$R$24:$S$35,2,FALSE)))),\"\")","v":""},{"$f":"IF(S214=\"\",\"\",INDEX(referentes!$G$2:$H$5,MATCH(S214,referentes!$H$2:$H$5,0),1))","v":""},null,null,{"$f":"IF(T214=\"\",\"\",VLOOKUP(T214,referentes!$Q$2:$X$209,2,FALSE))","v":""},null,null,null,null,"",null,null,null,"",null,null,{"$f":"IF(AF214<>\"\",VLOOKUP(AF214,'Otras referencias'!$H$19:$I$20,2,FALSE),\"\")","v":""},null,{"$f":"IF(AH214<>\"\",VLOOKUP(AH214,'Otras referencias'!$H$19:$I$20,2,FALSE),\"\")","v":""},null,{"$f":"IF(AJ214<>\"\",VLOOKUP(AJ214,'Otras referencias'!$H$19:$I$20,2,FALSE),\"\")","v":""},null,{"$f":"IF(AL214<>\"\",VLOOKUP(AL214,'Otras referencias'!$H$19:$I$20,2,FALSE),\"\")","v":""}]
[null,{"$f":"IF(C215=\"\",\"\",IF(COUNTIF($C$3:C215, C215)>1, \"\", C215))","v":""},{"$f":"IF(J215=\"\",\"\",CONCATENATE(DIGITADOR!$M$1,J215,E215))","v":""},"",{"$f":"IF(H215=\"\",\"\",VLOOKUP(H215,'Otras referencias'!$A$24:$E$48,2,FALSE))","v":""},null,null,null,{"$f":"IF(H215=\"\",\"\",VLOOKUP(H215,'Otras referencias'!$A$24:$E$48,5,FALSE))","v":""},null,null,null,null,null,null,"",{"$f":"IF(AND(P215<>\"\",O215<>\"\"),IF(N215=\"A\",VLOOKUP(P215,'Otras referencias'!$J$24:$K$35,2,FALSE),IF(N215=\"B\",VLOOKUP(P215,'Otras referencias'!$N$24:$O$35,2,),IF(N215=\"C\",VLOOKUP(P215,'Otras referencias'!$R$24:$S$35,2,FALSE)))),\"\")","v":""},{"$f":"IF(S215=\"\",\"\",INDEX(referentes!$G$2:$H$5,MATCH(S215,referentes!$H$2:$H$5,0),1))","v":""},null,null,{"$f":"IF(T215=\"\",\"\",VLOOKUP(T215,referentes!$Q$2:$X$209,2,FALSE))","v":""},null,null,null,null,"",null,null,null,"",null,null,{"$f":"IF(AF215<>\"\",VLOOKUP(AF215,'Otras referencias'!$H$19:$I$20,2,FALSE),\"\")","v":""},null,{"$f":"IF(AH215<>\"\",VLOOKUP(AH215,'Otras referencias'!$H$19:$I$20,2,FALSE),\"\")","v":""},null,{"$f":"IF(AJ215<>\"\",VLOOKUP(AJ215,'Otras referencias'!$H$19:$I$20,2,FALSE),\"\")","v":""},null,{"$f":"IF(AL215<>\"\",VLOOKUP(AL215,'Otras referencias'!$H$19:$I$20,2,FALSE),\"\")","v":""}]
[null,{"$f":"IF(C216=\"\",\"\",IF(COUNTIF($C$3:C216, C216)>1, \"\", C216))","v":""},{"$f":"IF(J216=\"\",\"\",CONCATENATE(DIGITADOR!$M$1,J216,E216))","v":""},"",{"$f":"IF(H216=\"\",\"\",VLOOKUP(H216,'Otras referencias'!$A$24:$E$48,2,FALSE))","v":""},null,null,null,{"$f":"IF(H216=\"\",\"\",VLOOKUP(H216,'Otras referencias'!$A$24:$E$48,5,FALSE))","v":""},null,null,null,null,null,null,"",{"$f":"IF(AND(P216<>\"\",O216<>\"\"),IF(N216=\"A\",VLOOKUP(P216,'Otras referencias'!$J$24:$K$35,2,FALSE),IF(N216=\"B\",VLOOKUP(P216,'Otras referencias'!$N$24:$O$35,2,),IF(N216=\"C\",VLOOKUP(P216,'Otras referencias'!$R$24:$S$35,2,FALSE)))),\"\")","v":""},{"$f":"IF(S216=\"\",\"\",INDEX(referentes!$G$2:$H$5,MATCH(S216,referentes!$H$2:$H$5,0),1))","v":""},null,null,{"$f":"IF(T216=\"\",\"\",VLOOKUP(T216,referentes!$Q$2:$X$209,2,FALSE))","v":""},null,null,null,null,"",null,null,null,"",null,null,{"$f":"IF(AF216<>\"\",VLOOKUP(AF216,'Otras referencias'!$H$19:$I$20,2,FALSE),\"\")","v":""},null,{"$f":"IF(AH216<>\"\",VLOOKUP(AH216,'Otras referencias'!$H$19:$I$20,2,FALSE),\"\")","v":""},null,{"$f":"IF(AJ216<>\"\",VLOOKUP(AJ216,'Otras referencias'!$H$19:$I$20,2,FALSE),\"\")","v":""},null,{"$f":"IF(AL216<>\"\",VLOOKUP(AL216,'Otras referencias'!$H$19:$I$20,2,FALSE),\"\")","v":""}]
[null,{"$f":"IF(C217=\"\",\"\",IF(COUNTIF($C$3:C217, C217)>1, \"\", C217))","v":""},{"$f":"IF(J217=\"\",\"\",CONCATENATE(DIGITADOR!$M$1,J217,E217))","v":""},"",{"$f":"IF(H217=\"\",\"\",VLOOKUP(H217,'Otras referencias'!$A$24:$E$48,2,FALSE))","v":""},null,null,null,{"$f":"IF(H217=\"\",\"\",VLOOKUP(H217,'Otras referencias'!$A$24:$E$48,5,FALSE))","v":""},null,null,null,null,null,null,"",{"$f":"IF(AND(P217<>\"\",O217<>\"\"),IF(N217=\"A\",VLOOKUP(P217,'Otras referencias'!$J$24:$K$35,2,FALSE),IF(N217=\"B\",VLOOKUP(P217,'Otras referencias'!$N$24:$O$35,2,),IF(N217=\"C\",VLOOKUP(P217,'Otras referencias'!$R$24:$S$35,2,FALSE)))),\"\")","v":""},{"$f":"IF(S217=\"\",\"\",INDEX(referentes!$G$2:$H$5,MATCH(S217,referentes!$H$2:$H$5,0),1))","v":""},null,null,{"$f":"IF(T217=\"\",\"\",VLOOKUP(T217,referentes!$Q$2:$X$209,2,FALSE))","v":""},null,null,null,null,"",null,null,null,"",null,null,{"$f":"IF(AF217<>\"\",VLOOKUP(AF217,'Otras referencias'!$H$19:$I$20,2,FALSE),\"\")","v":""},null,{"$f":"IF(AH217<>\"\",VLOOKUP(AH217,'Otras referencias'!$H$19:$I$20,2,FALSE),\"\")","v":""},null,{"$f":"IF(AJ217<>\"\",VLOOKUP(AJ217,'Otras referencias'!$H$19:$I$20,2,FALSE),\"\")","v":""},null,{"$f":"IF(AL217<>\"\",VLOOKUP(AL217,'Otras referencias'!$H$19:$I$20,2,FALSE),\"\")","v":""}]
[null,{"$f":"IF(C218=\"\",\"\",IF(COUNTIF($C$3:C218, C218)>1, \"\", C218))","v":""},{"$f":"IF(J218=\"\",\"\",CONCATENATE(DIGITADOR!$M$1,J218,E218))","v":""},"",{"$f":"IF(H218=\"\",\"\",VLOOKUP(H218,'Otras referencias'!$A$24:$E$48,2,FALSE))","v":""},null,null,null,{"$f":"IF(H218=\"\",\"\",VLOOKUP(H218,'Otras referencias'!$A$24:$E$48,5,FALSE))","v":""},null,null,null,null,null,null,"",{"$f":"IF(AND(P218<>\"\",O218<>\"\"),IF(N218=\"A\",VLOOKUP(P218,'Otras referencias'!$J$24:$K$35,2,FALSE),IF(N218=\"B\",VLOOKUP(P218,'Otras referencias'!$N$24:$O$35,2,),IF(N218=\"C\",VLOOKUP(P218,'Otras referencias'!$R$24:$S$35,2,FALSE)))),\"\")","v":""},{"$f":"IF(S218=\"\",\"\",INDEX(referentes!$G$2:$H$5,MATCH(S218,referentes!$H$2:$H$5,0),1))","v":""},null,null,{"$f":"IF(T218=\"\",\"\",VLOOKUP(T218,referentes!$Q$2:$X$209,2,FALSE))","v":""},null,null,null,null,"",null,null,null,"",null,null,{"$f":"IF(AF218<>\"\",VLOOKUP(AF218,'Otras referencias'!$H$19:$I$20,2,FALSE),\"\")","v":""},null,{"$f":"IF(AH218<>\"\",VLOOKUP(AH218,'Otras referencias'!$H$19:$I$20,2,FALSE),\"\")","v":""},null,{"$f":"IF(AJ218<>\"\",VLOOKUP(AJ218,'Otras referencias'!$H$19:$I$20,2,FALSE),\"\")","v":""},null,{"$f":"IF(AL218<>\"\",VLOOKUP(AL218,'Otras referencias'!$H$19:$I$20,2,FALSE),\"\")","v":""}]
[null,{"$f":"IF(C219=\"\",\"\",IF(COUNTIF($C$3:C219, C219)>1, \"\", C219))","v":""},{"$f":"IF(J219=\"\",\"\",CONCATENATE(DIGITADOR!$M$1,J219,E219))","v":""},"",{"$f":"IF(H219=\"\",\"\",VLOOKUP(H219,'Otras referencias'!$A$24:$E$48,2,FALSE))","v":""},null,null,null,{"$f":"IF(H219=\"\",\"\",VLOOKUP(H219,'Otras referencias'!$A$24:$E$48,5,FALSE))","v":""},null,null,null,null,null,null,"",{"$f":"IF(AND(P219<>\"\",O219<>\"\"),IF(N219=\"A\",VLOOKUP(P219,'Otras referencias'!$J$24:$K$35,2,FALSE),IF(N219=\"B\",VLOOKUP(P219,'Otras referencias'!$N$24:$O$35,2,),IF(N219=\"C\",VLOOKUP(P219,'Otras referencias'!$R$24:$S$35,2,FALSE)))),\"\")","v":""},{"$f":"IF(S219=\"\",\"\",INDEX(referentes!$G$2:$H$5,MATCH(S219,referentes!$H$2:$H$5,0),1))","v":""},null,null,{"$f":"IF(T219=\"\",\"\",VLOOKUP(T219,referentes!$Q$2:$X$209,2,FALSE))","v":""},null,null,null,null,"",null,null,null,"",null,null,{"$f":"IF(AF219<>\"\",VLOOKUP(AF219,'Otras referencias'!$H$19:$I$20,2,FALSE),\"\")","v":""},null,{"$f":"IF(AH219<>\"\",VLOOKUP(AH219,'Otras referencias'!$H$19:$I$20,2,FALSE),\"\")","v":""},null,{"$f":"IF(AJ219<>\"\",VLOOKUP(AJ219,'Otras referencias'!$H$19:$I$20,2,FALSE),\"\")","v":""},null,{"$f":"IF(AL219<>\"\",VLOOKUP(AL219,'Otras referencias'!$H$19:$I$20,2,FALSE),\"\")","v":""}]
[null,{"$f":"IF(C220=\"\",\"\",IF(COUNTIF($C$3:C220, C220)>1, \"\", C220))","v":""},{"$f":"IF(J220=\"\",\"\",CONCATENATE(DIGITADOR!$M$1,J220,E220))","v":""},"",{"$f":"IF(H220=\"\",\"\",VLOOKUP(H220,'Otras referencias'!$A$24:$E$48,2,FALSE))","v":""},null,null,null,{"$f":"IF(H220=\"\",\"\",VLOOKUP(H220,'Otras referencias'!$A$24:$E$48,5,FALSE))","v":""},null,null,null,null,null,null,"",{"$f":"IF(AND(P220<>\"\",O220<>\"\"),IF(N220=\"A\",VLOOKUP(P220,'Otras referencias'!$J$24:$K$35,2,FALSE),IF(N220=\"B\",VLOOKUP(P220,'Otras referencias'!$N$24:$O$35,2,),IF(N220=\"C\",VLOOKUP(P220,'Otras referencias'!$R$24:$S$35,2,FALSE)))),\"\")","v":""},{"$f":"IF(S220=\"\",\"\",INDEX(referentes!$G$2:$H$5,MATCH(S220,referentes!$H$2:$H$5,0),1))","v":""},null,null,{"$f":"IF(T220=\"\",\"\",VLOOKUP(T220,referentes!$Q$2:$X$209,2,FALSE))","v":""},null,null,null,null,"",null,null,null,"",null,null,{"$f":"IF(AF220<>\"\",VLOOKUP(AF220,'Otras referencias'!$H$19:$I$20,2,FALSE),\"\")","v":""},null,{"$f":"IF(AH220<>\"\",VLOOKUP(AH220,'Otras referencias'!$H$19:$I$20,2,FALSE),\"\")","v":""},null,{"$f":"IF(AJ220<>\"\",VLOOKUP(AJ220,'Otras referencias'!$H$19:$I$20,2,FALSE),\"\")","v":""},null,{"$f":"IF(AL220<>\"\",VLOOKUP(AL220,'Otras referencias'!$H$19:$I$20,2,FALSE),\"\")","v":""}]
[null,{"$f":"IF(C221=\"\",\"\",IF(COUNTIF($C$3:C221, C221)>1, \"\", C221))","v":""},{"$f":"IF(J221=\"\",\"\",CONCATENATE(DIGITADOR!$M$1,J221,E221))","v":""},"",{"$f":"IF(H221=\"\",\"\",VLOOKUP(H221,'Otras referencias'!$A$24:$E$48,2,FALSE))","v":""},null,null,null,{"$f":"IF(H221=\"\",\"\",VLOOKUP(H221,'Otras referencias'!$A$24:$E$48,5,FALSE))","v":""},null,null,null,null,null,null,"",{"$f":"IF(AND(P221<>\"\",O221<>\"\"),IF(N221=\"A\",VLOOKUP(P221,'Otras referencias'!$J$24:$K$35,2,FALSE),IF(N221=\"B\",VLOOKUP(P221,'Otras referencias'!$N$24:$O$35,2,),IF(N221=\"C\",VLOOKUP(P221,'Otras referencias'!$R$24:$S$35,2,FALSE)))),\"\")","v":""},{"$f":"IF(S221=\"\",\"\",INDEX(referentes!$G$2:$H$5,MATCH(S221,referentes!$H$2:$H$5,0),1))","v":""},null,null,{"$f":"IF(T221=\"\",\"\",VLOOKUP(T221,referentes!$Q$2:$X$209,2,FALSE))","v":""},null,null,null,null,"",null,null,null,"",null,null,{"$f":"IF(AF221<>\"\",VLOOKUP(AF221,'Otras referencias'!$H$19:$I$20,2,FALSE),\"\")","v":""},null,{"$f":"IF(AH221<>\"\",VLOOKUP(AH221,'Otras referencias'!$H$19:$I$20,2,FALSE),\"\")","v":""},null,{"$f":"IF(AJ221<>\"\",VLOOKUP(AJ221,'Otras referencias'!$H$19:$I$20,2,FALSE),\"\")","v":""},null,{"$f":"IF(AL221<>\"\",VLOOKUP(AL221,'Otras referencias'!$H$19:$I$20,2,FALSE),\"\")","v":""}]
[null,{"$f":"IF(C222=\"\",\"\",IF(COUNTIF($C$3:C222, C222)>1, \"\", C222))","v":""},{"$f":"IF(J222=\"\",\"\",CONCATENATE(DIGITADOR!$M$1,J222,E222))","v":""},"",{"$f":"IF(H222=\"\",\"\",VLOOKUP(H222,'Otras referencias'!$A$24:$E$48,2,FALSE))","v":""},null,null,null,{"$f":"IF(H222=\"\",\"\",VLOOKUP(H222,'Otras referencias'!$A$24:$E$48,5,FALSE))","v":""},null,null,null,null,null,null,"",{"$f":"IF(AND(P222<>\"\",O222<>\"\"),IF(N222=\"A\",VLOOKUP(P222,'Otras referencias'!$J$24:$K$35,2,FALSE),IF(N222=\"B\",VLOOKUP(P222,'Otras referencias'!$N$24:$O$35,2,),IF(N222=\"C\",VLOOKUP(P222,'Otras referencias'!$R$24:$S$35,2,FALSE)))),\"\")","v":""},{"$f":"IF(S222=\"\",\"\",INDEX(referentes!$G$2:$H$5,MATCH(S222,referentes!$H$2:$H$5,0),1))","v":""},null,null,{"$f":"IF(T222=\"\",\"\",VLOOKUP(T222,referentes!$Q$2:$X$209,2,FALSE))","v":""},null,null,null,null,"",null,null,null,"",null,null,{"$f":"IF(AF222<>\"\",VLOOKUP(AF222,'Otras referencias'!$H$19:$I$20,2,FALSE),\"\")","v":""},null,{"$f":"IF(AH222<>\"\",VLOOKUP(AH222,'Otras referencias'!$H$19:$I$20,2,FALSE),\"\")","v":""},null,{"$f":"IF(AJ222<>\"\",VLOOKUP(AJ222,'Otras referencias'!$H$19:$I$20,2,FALSE),\"\")","v":""},null,{"$f":"IF(AL222<>\"\",VLOOKUP(AL222,'Otras referencias'!$H$19:$I$20,2,FALSE),\"\")","v":""}]
[null,{"$f":"IF(C223=\"\",\"\",IF(COUNTIF($C$3:C223, C223)>1, \"\", C223))","v":""},{"$f":"IF(J223=\"\",\"\",CONCATENATE(DIGITADOR!$M$1,J223,E223))","v":""},"",{"$f":"IF(H223=\"\",\"\",VLOOKUP(H223,'Otras referencias'!$A$24:$E$48,2,FALSE))","v":""},null,null,null,{"$f":"IF(H223=\"\",\"\",VLOOKUP(H223,'Otras referencias'!$A$24:$E$48,5,FALSE))","v":""},null,null,null,null,null,null,"",{"$f":"IF(AND(P223<>\"\",O223<>\"\"),IF(N223=\"A\",VLOOKUP(P223,'Otras referencias'!$J$24:$K$35,2,FALSE),IF(N223=\"B\",VLOOKUP(P223,'Otras referencias'!$N$24:$O$35,2,),IF(N223=\"C\",VLOOKUP(P223,'Otras referencias'!$R$24:$S$35,2,FALSE)))),\"\")","v":""},{"$f":"IF(S223=\"\",\"\",INDEX(referentes!$G$2:$H$5,MATCH(S223,referentes!$H$2:$H$5,0),1))","v":""},null,null,{"$f":"IF(T223=\"\",\"\",VLOOKUP(T223,referentes!$Q$2:$X$209,2,FALSE))","v":""},null,null,null,null,"",null,null,null,"",null,null,{"$f":"IF(AF223<>\"\",VLOOKUP(AF223,'Otras referencias'!$H$19:$I$20,2,FALSE),\"\")","v":""},null,{"$f":"IF(AH223<>\"\",VLOOKUP(AH223,'Otras referencias'!$H$19:$I$20,2,FALSE),\"\")","v":""},null,{"$f":"IF(AJ223<>\"\",VLOOKUP(AJ223,'Otras referencias'!$H$19:$I$20,2,FALSE),\"\")","v":""},null,{"$f":"IF(AL223<>\"\",VLOOKUP(AL223,'Otras referencias'!$H$19:$I$20,2,FALSE),\"\")","v":""}]
[null,{"$f":"IF(C224=\"\",\"\",IF(COUNTIF($C$3:C224, C224)>1, \"\", C224))","v":""},{"$f":"IF(J224=\"\",\"\",CONCATENATE(DIGITADOR!$M$1,J224,E224))","v":""},"",{"$f":"IF(H224=\"\",\"\",VLOOKUP(H224,'Otras referencias'!$A$24:$E$48,2,FALSE))","v":""},null,null,null,{"$f":"IF(H224=\"\",\"\",VLOOKUP(H224,'Otras referencias'!$A$24:$E$48,5,FALSE))","v":""},null,null,null,null,null,null,"",{"$f":"IF(AND(P224<>\"\",O224<>\"\"),IF(N224=\"A\",VLOOKUP(P224,'Otras referencias'!$J$24:$K$35,2,FALSE),IF(N224=\"B\",VLOOKUP(P224,'Otras referencias'!$N$24:$O$35,2,),IF(N224=\"C\",VLOOKUP(P224,'Otras referencias'!$R$24:$S$35,2,FALSE)))),\"\")","v":""},{"$f":"IF(S224=\"\",\"\",INDEX(referentes!$G$2:$H$5,MATCH(S224,referentes!$H$2:$H$5,0),1))","v":""},null,null,{"$f":"IF(T224=\"\",\"\",VLOOKUP(T224,referentes!$Q$2:$X$209,2,FALSE))","v":""},null,null,null,null,"",null,null,null,"",null,null,{"$f":"IF(AF224<>\"\",VLOOKUP(AF224,'Otras referencias'!$H$19:$I$20,2,FALSE),\"\")","v":""},null,{"$f":"IF(AH224<>\"\",VLOOKUP(AH224,'Otras referencias'!$H$19:$I$20,2,FALSE),\"\")","v":""},null,{"$f":"IF(AJ224<>\"\",VLOOKUP(AJ224,'Otras referencias'!$H$19:$I$20,2,FALSE),\"\")","v":""},null,{"$f":"IF(AL224<>\"\",VLOOKUP(AL224,'Otras referencias'!$H$19:$I$20,2,FALSE),\"\")","v":""}]
[null,{"$f":"IF(C225=\"\",\"\",IF(COUNTIF($C$3:C225, C225)>1, \"\", C225))","v":""},{"$f":"IF(J225=\"\",\"\",CONCATENATE(DIGITADOR!$M$1,J225,E225))","v":""},"",{"$f":"IF(H225=\"\",\"\",VLOOKUP(H225,'Otras referencias'!$A$24:$E$48,2,FALSE))","v":""},null,null,null,{"$f":"IF(H225=\"\",\"\",VLOOKUP(H225,'Otras referencias'!$A$24:$E$48,5,FALSE))","v":""},null,null,null,null,null,null,"",{"$f":"IF(AND(P225<>\"\",O225<>\"\"),IF(N225=\"A\",VLOOKUP(P225,'Otras referencias'!$J$24:$K$35,2,FALSE),IF(N225=\"B\",VLOOKUP(P225,'Otras referencias'!$N$24:$O$35,2,),IF(N225=\"C\",VLOOKUP(P225,'Otras referencias'!$R$24:$S$35,2,FALSE)))),\"\")","v":""},{"$f":"IF(S225=\"\",\"\",INDEX(referentes!$G$2:$H$5,MATCH(S225,referentes!$H$2:$H$5,0),1))","v":""},null,null,{"$f":"IF(T225=\"\",\"\",VLOOKUP(T225,referentes!$Q$2:$X$209,2,FALSE))","v":""},null,null,null,null,"",null,null,null,"",null,null,{"$f":"IF(AF225<>\"\",VLOOKUP(AF225,'Otras referencias'!$H$19:$I$20,2,FALSE),\"\")","v":""},null,{"$f":"IF(AH225<>\"\",VLOOKUP(AH225,'Otras referencias'!$H$19:$I$20,2,FALSE),\"\")","v":""},null,{"$f":"IF(AJ225<>\"\",VLOOKUP(AJ225,'Otras referencias'!$H$19:$I$20,2,FALSE),\"\")","v":""},null,{"$f":"IF(AL225<>\"\",VLOOKUP(AL225,'Otras referencias'!$H$19:$I$20,2,FALSE),\"\")","v":""}]
[null,{"$f":"IF(C226=\"\",\"\",IF(COUNTIF($C$3:C226, C226)>1, \"\", C226))","v":""},{"$f":"IF(J226=\"\",\"\",CONCATENATE(DIGITADOR!$M$1,J226,E226))","v":""},"",{"$f":"IF(H226=\"\",\"\",VLOOKUP(H226,'Otras referencias'!$A$24:$E$48,2,FALSE))","v":""},null,null,null,{"$f":"IF(H226=\"\",\"\",VLOOKUP(H226,'Otras referencias'!$A$24:$E$48,5,FALSE))","v":""},null,null,null,null,null,null,"",{"$f":"IF(AND(P226<>\"\",O226<>\"\"),IF(N226=\"A\",VLOOKUP(P226,'Otras referencias'!$J$24:$K$35,2,FALSE),IF(N226=\"B\",VLOOKUP(P226,'Otras referencias'!$N$24:$O$35,2,),IF(N226=\"C\",VLOOKUP(P226,'Otras referencias'!$R$24:$S$35,2,FALSE)))),\"\")","v":""},{"$f":"IF(S226=\"\",\"\",INDEX(referentes!$G$2:$H$5,MATCH(S226,referentes!$H$2:$H$5,0),1))","v":""},null,null,{"$f":"IF(T226=\"\",\"\",VLOOKUP(T226,referentes!$Q$2:$X$209,2,FALSE))","v":""},null,null,null,null,"",null,null,null,"",null,null,{"$f":"IF(AF226<>\"\",VLOOKUP(AF226,'Otras referencias'!$H$19:$I$20,2,FALSE),\"\")","v":""},null,{"$f":"IF(AH226<>\"\",VLOOKUP(AH226,'Otras referencias'!$H$19:$I$20,2,FALSE),\"\")","v":""},null,{"$f":"IF(AJ226<>\"\",VLOOKUP(AJ226,'Otras referencias'!$H$19:$I$20,2,FALSE),\"\")","v":""},null,{"$f":"IF(AL226<>\"\",VLOOKUP(AL226,'Otras referencias'!$H$19:$I$20,2,FALSE),\"\")","v":""}]
[null,{"$f":"IF(C227=\"\",\"\",IF(COUNTIF($C$3:C227, C227)>1, \"\", C227))","v":""},{"$f":"IF(J227=\"\",\"\",CONCATENATE(DIGITADOR!$M$1,J227,E227))","v":""},"",{"$f":"IF(H227=\"\",\"\",VLOOKUP(H227,'Otras referencias'!$A$24:$E$48,2,FALSE))","v":""},null,null,null,{"$f":"IF(H227=\"\",\"\",VLOOKUP(H227,'Otras referencias'!$A$24:$E$48,5,FALSE))","v":""},null,null,null,null,null,null,"",{"$f":"IF(AND(P227<>\"\",O227<>\"\"),IF(N227=\"A\",VLOOKUP(P227,'Otras referencias'!$J$24:$K$35,2,FALSE),IF(N227=\"B\",VLOOKUP(P227,'Otras referencias'!$N$24:$O$35,2,),IF(N227=\"C\",VLOOKUP(P227,'Otras referencias'!$R$24:$S$35,2,FALSE)))),\"\")","v":""},{"$f":"IF(S227=\"\",\"\",INDEX(referentes!$G$2:$H$5,MATCH(S227,referentes!$H$2:$H$5,0),1))","v":""},null,null,{"$f":"IF(T227=\"\",\"\",VLOOKUP(T227,referentes!$Q$2:$X$209,2,FALSE))","v":""},null,null,null,null,"",null,null,null,"",null,null,{"$f":"IF(AF227<>\"\",VLOOKUP(AF227,'Otras referencias'!$H$19:$I$20,2,FALSE),\"\")","v":""},null,{"$f":"IF(AH227<>\"\",VLOOKUP(AH227,'Otras referencias'!$H$19:$I$20,2,FALSE),\"\")","v":""},null,{"$f":"IF(AJ227<>\"\",VLOOKUP(AJ227,'Otras referencias'!$H$19:$I$20,2,FALSE),\"\")","v":""},null,{"$f":"IF(AL227<>\"\",VLOOKUP(AL227,'Otras referencias'!$H$19:$I$20,2,FALSE),\"\")","v":""}]
[null,{"$f":"IF(C228=\"\",\"\",IF(COUNTIF($C$3:C228, C228)>1, \"\", C228))","v":""},{"$f":"IF(J228=\"\",\"\",CONCATENATE(DIGITADOR!$M$1,J228,E228))","v":""},"",{"$f":"IF(H228=\"\",\"\",VLOOKUP(H228,'Otras referencias'!$A$24:$E$48,2,FALSE))","v":""},null,null,null,{"$f":"IF(H228=\"\",\"\",VLOOKUP(H228,'Otras referencias'!$A$24:$E$48,5,FALSE))","v":""},null,null,null,null,null,null,"",{"$f":"IF(AND(P228<>\"\",O228<>\"\"),IF(N228=\"A\",VLOOKUP(P228,'Otras referencias'!$J$24:$K$35,2,FALSE),IF(N228=\"B\",VLOOKUP(P228,'Otras referencias'!$N$24:$O$35,2,),IF(N228=\"C\",VLOOKUP(P228,'Otras referencias'!$R$24:$S$35,2,FALSE)))),\"\")","v":""},{"$f":"IF(S228=\"\",\"\",INDEX(referentes!$G$2:$H$5,MATCH(S228,referentes!$H$2:$H$5,0),1))","v":""},null,null,{"$f":"IF(T228=\"\",\"\",VLOOKUP(T228,referentes!$Q$2:$X$209,2,FALSE))","v":""},null,null,null,null,"",null,null,null,"",null,null,{"$f":"IF(AF228<>\"\",VLOOKUP(AF228,'Otras referencias'!$H$19:$I$20,2,FALSE),\"\")","v":""},null,{"$f":"IF(AH228<>\"\",VLOOKUP(AH228,'Otras referencias'!$H$19:$I$20,2,FALSE),\"\")","v":""},null,{"$f":"IF(AJ228<>\"\",VLOOKUP(AJ228,'Otras referencias'!$H$19:$I$20,2,FALSE),\"\")","v":""},null,{"$f":"IF(AL228<>\"\",VLOOKUP(AL228,'Otras referencias'!$H$19:$I$20,2,FALSE),\"\")","v":""}]
[null,{"$f":"IF(C229=\"\",\"\",IF(COUNTIF($C$3:C229, C229)>1, \"\", C229))","v":""},{"$f":"IF(J229=\"\",\"\",CONCATENATE(DIGITADOR!$M$1,J229,E229))","v":""},"",{"$f":"IF(H229=\"\",\"\",VLOOKUP(H229,'Otras referencias'!$A$24:$E$48,2,FALSE))","v":""},null,null,null,{"$f":"IF(H229=\"\",\"\",VLOOKUP(H229,'Otras referencias'!$A$24:$E$48,5,FALSE))","v":""},null,null,null,null,null,null,"",{"$f":"IF(AND(P229<>\"\",O229<>\"\"),IF(N229=\"A\",VLOOKUP(P229,'Otras referencias'!$J$24:$K$35,2,FALSE),IF(N229=\"B\",VLOOKUP(P229,'Otras referencias'!$N$24:$O$35,2,),IF(N229=\"C\",VLOOKUP(P229,'Otras referencias'!$R$24:$S$35,2,FALSE)))),\"\")","v":""},{"$f":"IF(S229=\"\",\"\",INDEX(referentes!$G$2:$H$5,MATCH(S229,referentes!$H$2:$H$5,0),1))","v":""},null,null,{"$f":"IF(T229=\"\",\"\",VLOOKUP(T229,referentes!$Q$2:$X$209,2,FALSE))","v":""},null,null,null,null,"",null,null,null,"",null,null,{"$f":"IF(AF229<>\"\",VLOOKUP(AF229,'Otras referencias'!$H$19:$I$20,2,FALSE),\"\")","v":""},null,{"$f":"IF(AH229<>\"\",VLOOKUP(AH229,'Otras referencias'!$H$19:$I$20,2,FALSE),\"\")","v":""},null,{"$f":"IF(AJ229<>\"\",VLOOKUP(AJ229,'Otras referencias'!$H$19:$I$20,2,FALSE),\"\")","v":""},null,{"$f":"IF(AL229<>\"\",VLOOKUP(AL229,'Otras referencias'!$H$19:$I$20,2,FALSE),\"\")","v":""}]
[null,{"$f":"IF(C230=\"\",\"\",IF(COUNTIF($C$3:C230, C230)>1, \"\", C230))","v":""},{"$f":"IF(J230=\"\",\"\",CONCATENATE(DIGITADOR!$M$1,J230,E230))","v":""},"",{"$f":"IF(H230=\"\",\"\",VLOOKUP(H230,'Otras referencias'!$A$24:$E$48,2,FALSE))","v":""},null,null,null,{"$f":"IF(H230=\"\",\"\",VLOOKUP(H230,'Otras referencias'!$A$24:$E$48,5,FALSE))","v":""},null,null,null,null,null,null,"",{"$f":"IF(AND(P230<>\"\",O230<>\"\"),IF(N230=\"A\",VLOOKUP(P230,'Otras referencias'!$J$24:$K$35,2,FALSE),IF(N230=\"B\",VLOOKUP(P230,'Otras referencias'!$N$24:$O$35,2,),IF(N230=\"C\",VLOOKUP(P230,'Otras referencias'!$R$24:$S$35,2,FALSE)))),\"\")","v":""},{"$f":"IF(S230=\"\",\"\",INDEX(referentes!$G$2:$H$5,MATCH(S230,referentes!$H$2:$H$5,0),1))","v":""},null,null,{"$f":"IF(T230=\"\",\"\",VLOOKUP(T230,referentes!$Q$2:$X$209,2,FALSE))","v":""},null,null,null,null,"",null,null,null,"",null,null,{"$f":"IF(AF230<>\"\",VLOOKUP(AF230,'Otras referencias'!$H$19:$I$20,2,FALSE),\"\")","v":""},null,{"$f":"IF(AH230<>\"\",VLOOKUP(AH230,'Otras referencias'!$H$19:$I$20,2,FALSE),\"\")","v":""},null,{"$f":"IF(AJ230<>\"\",VLOOKUP(AJ230,'Otras referencias'!$H$19:$I$20,2,FALSE),\"\")","v":""},null,{"$f":"IF(AL230<>\"\",VLOOKUP(AL230,'Otras referencias'!$H$19:$I$20,2,FALSE),\"\")","v":""}]
[null,{"$f":"IF(C231=\"\",\"\",IF(COUNTIF($C$3:C231, C231)>1, \"\", C231))","v":""},{"$f":"IF(J231=\"\",\"\",CONCATENATE(DIGITADOR!$M$1,J231,E231))","v":""},"",{"$f":"IF(H231=\"\",\"\",VLOOKUP(H231,'Otras referencias'!$A$24:$E$48,2,FALSE))","v":""},null,null,null,{"$f":"IF(H231=\"\",\"\",VLOOKUP(H231,'Otras referencias'!$A$24:$E$48,5,FALSE))","v":""},null,null,null,null,null,null,"",{"$f":"IF(AND(P231<>\"\",O231<>\"\"),IF(N231=\"A\",VLOOKUP(P231,'Otras referencias'!$J$24:$K$35,2,FALSE),IF(N231=\"B\",VLOOKUP(P231,'Otras referencias'!$N$24:$O$35,2,),IF(N231=\"C\",VLOOKUP(P231,'Otras referencias'!$R$24:$S$35,2,FALSE)))),\"\")","v":""},{"$f":"IF(S231=\"\",\"\",INDEX(referentes!$G$2:$H$5,MATCH(S231,referentes!$H$2:$H$5,0),1))","v":""},null,null,{"$f":"IF(T231=\"\",\"\",VLOOKUP(T231,referentes!$Q$2:$X$209,2,FALSE))","v":""},null,null,null,null,"",null,null,null,"",null,null,{"$f":"IF(AF231<>\"\",VLOOKUP(AF231,'Otras referencias'!$H$19:$I$20,2,FALSE),\"\")","v":""},null,{"$f":"IF(AH231<>\"\",VLOOKUP(AH231,'Otras referencias'!$H$19:$I$20,2,FALSE),\"\")","v":""},null,{"$f":"IF(AJ231<>\"\",VLOOKUP(AJ231,'Otras referencias'!$H$19:$I$20,2,FALSE),\"\")","v":""},null,{"$f":"IF(AL231<>\"\",VLOOKUP(AL231,'Otras referencias'!$H$19:$I$20,2,FALSE),\"\")","v":""}]
[null,{"$f":"IF(C232=\"\",\"\",IF(COUNTIF($C$3:C232, C232)>1, \"\", C232))","v":""},{"$f":"IF(J232=\"\",\"\",CONCATENATE(DIGITADOR!$M$1,J232,E232))","v":""},"",{"$f":"IF(H232=\"\",\"\",VLOOKUP(H232,'Otras referencias'!$A$24:$E$48,2,FALSE))","v":""},null,null,null,{"$f":"IF(H232=\"\",\"\",VLOOKUP(H232,'Otras referencias'!$A$24:$E$48,5,FALSE))","v":""},null,null,null,null,null,null,"",{"$f":"IF(AND(P232<>\"\",O232<>\"\"),IF(N232=\"A\",VLOOKUP(P232,'Otras referencias'!$J$24:$K$35,2,FALSE),IF(N232=\"B\",VLOOKUP(P232,'Otras referencias'!$N$24:$O$35,2,),IF(N232=\"C\",VLOOKUP(P232,'Otras referencias'!$R$24:$S$35,2,FALSE)))),\"\")","v":""},{"$f":"IF(S232=\"\",\"\",INDEX(referentes!$G$2:$H$5,MATCH(S232,referentes!$H$2:$H$5,0),1))","v":""},null,null,{"$f":"IF(T232=\"\",\"\",VLOOKUP(T232,referentes!$Q$2:$X$209,2,FALSE))","v":""},null,null,null,null,"",null,null,null,"",null,null,{"$f":"IF(AF232<>\"\",VLOOKUP(AF232,'Otras referencias'!$H$19:$I$20,2,FALSE),\"\")","v":""},null,{"$f":"IF(AH232<>\"\",VLOOKUP(AH232,'Otras referencias'!$H$19:$I$20,2,FALSE),\"\")","v":""},null,{"$f":"IF(AJ232<>\"\",VLOOKUP(AJ232,'Otras referencias'!$H$19:$I$20,2,FALSE),\"\")","v":""},null,{"$f":"IF(AL232<>\"\",VLOOKUP(AL232,'Otras referencias'!$H$19:$I$20,2,FALSE),\"\")","v":""}]
[null,{"$f":"IF(C233=\"\",\"\",IF(COUNTIF($C$3:C233, C233)>1, \"\", C233))","v":""},{"$f":"IF(J233=\"\",\"\",CONCATENATE(DIGITADOR!$M$1,J233,E233))","v":""},"",{"$f":"IF(H233=\"\",\"\",VLOOKUP(H233,'Otras referencias'!$A$24:$E$48,2,FALSE))","v":""},null,null,null,{"$f":"IF(H233=\"\",\"\",VLOOKUP(H233,'Otras referencias'!$A$24:$E$48,5,FALSE))","v":""},null,null,null,null,null,null,"",{"$f":"IF(AND(P233<>\"\",O233<>\"\"),IF(N233=\"A\",VLOOKUP(P233,'Otras referencias'!$J$24:$K$35,2,FALSE),IF(N233=\"B\",VLOOKUP(P233,'Otras referencias'!$N$24:$O$35,2,),IF(N233=\"C\",VLOOKUP(P233,'Otras referencias'!$R$24:$S$35,2,FALSE)))),\"\")","v":""},{"$f":"IF(S233=\"\",\"\",INDEX(referentes!$G$2:$H$5,MATCH(S233,referentes!$H$2:$H$5,0),1))","v":""},null,null,{"$f":"IF(T233=\"\",\"\",VLOOKUP(T233,referentes!$Q$2:$X$209,2,FALSE))","v":""},null,null,null,null,"",null,null,null,"",null,null,{"$f":"IF(AF233<>\"\",VLOOKUP(AF233,'Otras referencias'!$H$19:$I$20,2,FALSE),\"\")","v":""},null,{"$f":"IF(AH233<>\"\",VLOOKUP(AH233,'Otras referencias'!$H$19:$I$20,2,FALSE),\"\")","v":""},null,{"$f":"IF(AJ233<>\"\",VLOOKUP(AJ233,'Otras referencias'!$H$19:$I$20,2,FALSE),\"\")","v":""},null,{"$f":"IF(AL233<>\"\",VLOOKUP(AL233,'Otras referencias'!$H$19:$I$20,2,FALSE),\"\")","v":""}]
[null,{"$f":"IF(C234=\"\",\"\",IF(COUNTIF($C$3:C234, C234)>1, \"\", C234))","v":""},{"$f":"IF(J234=\"\",\"\",CONCATENATE(DIGITADOR!$M$1,J234,E234))","v":""},"",{"$f":"IF(H234=\"\",\"\",VLOOKUP(H234,'Otras referencias'!$A$24:$E$48,2,FALSE))","v":""},null,null,null,{"$f":"IF(H234=\"\",\"\",VLOOKUP(H234,'Otras referencias'!$A$24:$E$48,5,FALSE))","v":""},null,null,null,null,null,null,"",{"$f":"IF(AND(P234<>\"\",O234<>\"\"),IF(N234=\"A\",VLOOKUP(P234,'Otras referencias'!$J$24:$K$35,2,FALSE),IF(N234=\"B\",VLOOKUP(P234,'Otras referencias'!$N$24:$O$35,2,),IF(N234=\"C\",VLOOKUP(P234,'Otras referencias'!$R$24:$S$35,2,FALSE)))),\"\")","v":""},{"$f":"IF(S234=\"\",\"\",INDEX(referentes!$G$2:$H$5,MATCH(S234,referentes!$H$2:$H$5,0),1))","v":""},null,null,{"$f":"IF(T234=\"\",\"\",VLOOKUP(T234,referentes!$Q$2:$X$209,2,FALSE))","v":""},null,null,null,null,"",null,null,null,"",null,null,{"$f":"IF(AF234<>\"\",VLOOKUP(AF234,'Otras referencias'!$H$19:$I$20,2,FALSE),\"\")","v":""},null,{"$f":"IF(AH234<>\"\",VLOOKUP(AH234,'Otras referencias'!$H$19:$I$20,2,FALSE),\"\")","v":""},null,{"$f":"IF(AJ234<>\"\",VLOOKUP(AJ234,'Otras referencias'!$H$19:$I$20,2,FALSE),\"\")","v":""},null,{"$f":"IF(AL234<>\"\",VLOOKUP(AL234,'Otras referencias'!$H$19:$I$20,2,FALSE),\"\")","v":""}]
[null,{"$f":"IF(C235=\"\",\"\",IF(COUNTIF($C$3:C235, C235)>1, \"\", C235))","v":""},{"$f":"IF(J235=\"\",\"\",CONCATENATE(DIGITADOR!$M$1,J235,E235))","v":""},"",{"$f":"IF(H235=\"\",\"\",VLOOKUP(H235,'Otras referencias'!$A$24:$E$48,2,FALSE))","v":""},null,null,null,{"$f":"IF(H235=\"\",\"\",VLOOKUP(H235,'Otras referencias'!$A$24:$E$48,5,FALSE))","v":""},null,null,null,null,null,null,"",{"$f":"IF(AND(P235<>\"\",O235<>\"\"),IF(N235=\"A\",VLOOKUP(P235,'Otras referencias'!$J$24:$K$35,2,FALSE),IF(N235=\"B\",VLOOKUP(P235,'Otras referencias'!$N$24:$O$35,2,),IF(N235=\"C\",VLOOKUP(P235,'Otras referencias'!$R$24:$S$35,2,FALSE)))),\"\")","v":""},{"$f":"IF(S235=\"\",\"\",INDEX(referentes!$G$2:$H$5,MATCH(S235,referentes!$H$2:$H$5,0),1))","v":""},null,null,{"$f":"IF(T235=\"\",\"\",VLOOKUP(T235,referentes!$Q$2:$X$209,2,FALSE))","v":""},null,null,null,null,"",null,null,null,"",null,null,{"$f":"IF(AF235<>\"\",VLOOKUP(AF235,'Otras referencias'!$H$19:$I$20,2,FALSE),\"\")","v":""},null,{"$f":"IF(AH235<>\"\",VLOOKUP(AH235,'Otras referencias'!$H$19:$I$20,2,FALSE),\"\")","v":""},null,{"$f":"IF(AJ235<>\"\",VLOOKUP(AJ235,'Otras referencias'!$H$19:$I$20,2,FALSE),\"\")","v":""},null,{"$f":"IF(AL235<>\"\",VLOOKUP(AL235,'Otras referencias'!$H$19:$I$20,2,FALSE),\"\")","v":""}]
[null,{"$f":"IF(C236=\"\",\"\",IF(COUNTIF($C$3:C236, C236)>1, \"\", C236))","v":""},{"$f":"IF(J236=\"\",\"\",CONCATENATE(DIGITADOR!$M$1,J236,E236))","v":""},"",{"$f":"IF(H236=\"\",\"\",VLOOKUP(H236,'Otras referencias'!$A$24:$E$48,2,FALSE))","v":""},null,null,null,{"$f":"IF(H236=\"\",\"\",VLOOKUP(H236,'Otras referencias'!$A$24:$E$48,5,FALSE))","v":""},null,null,null,null,null,null,"",{"$f":"IF(AND(P236<>\"\",O236<>\"\"),IF(N236=\"A\",VLOOKUP(P236,'Otras referencias'!$J$24:$K$35,2,FALSE),IF(N236=\"B\",VLOOKUP(P236,'Otras referencias'!$N$24:$O$35,2,),IF(N236=\"C\",VLOOKUP(P236,'Otras referencias'!$R$24:$S$35,2,FALSE)))),\"\")","v":""},{"$f":"IF(S236=\"\",\"\",INDEX(referentes!$G$2:$H$5,MATCH(S236,referentes!$H$2:$H$5,0),1))","v":""},null,null,{"$f":"IF(T236=\"\",\"\",VLOOKUP(T236,referentes!$Q$2:$X$209,2,FALSE))","v":""},null,null,null,null,"",null,null,null,"",null,null,{"$f":"IF(AF236<>\"\",VLOOKUP(AF236,'Otras referencias'!$H$19:$I$20,2,FALSE),\"\")","v":""},null,{"$f":"IF(AH236<>\"\",VLOOKUP(AH236,'Otras referencias'!$H$19:$I$20,2,FALSE),\"\")","v":""},null,{"$f":"IF(AJ236<>\"\",VLOOKUP(AJ236,'Otras referencias'!$H$19:$I$20,2,FALSE),\"\")","v":""},null,{"$f":"IF(AL236<>\"\",VLOOKUP(AL236,'Otras referencias'!$H$19:$I$20,2,FALSE),\"\")","v":""}]
[null,{"$f":"IF(C237=\"\",\"\",IF(COUNTIF($C$3:C237, C237)>1, \"\", C237))","v":""},{"$f":"IF(J237=\"\",\"\",CONCATENATE(DIGITADOR!$M$1,J237,E237))","v":""},"",{"$f":"IF(H237=\"\",\"\",VLOOKUP(H237,'Otras referencias'!$A$24:$E$48,2,FALSE))","v":""},null,null,null,{"$f":"IF(H237=\"\",\"\",VLOOKUP(H237,'Otras referencias'!$A$24:$E$48,5,FALSE))","v":""},null,null,null,null,null,null,"",{"$f":"IF(AND(P237<>\"\",O237<>\"\"),IF(N237=\"A\",VLOOKUP(P237,'Otras referencias'!$J$24:$K$35,2,FALSE),IF(N237=\"B\",VLOOKUP(P237,'Otras referencias'!$N$24:$O$35,2,),IF(N237=\"C\",VLOOKUP(P237,'Otras referencias'!$R$24:$S$35,2,FALSE)))),\"\")","v":""},{"$f":"IF(S237=\"\",\"\",INDEX(referentes!$G$2:$H$5,MATCH(S237,referentes!$H$2:$H$5,0),1))","v":""},null,null,{"$f":"IF(T237=\"\",\"\",VLOOKUP(T237,referentes!$Q$2:$X$209,2,FALSE))","v":""},null,null,null,null,"",null,null,null,"",null,null,{"$f":"IF(AF237<>\"\",VLOOKUP(AF237,'Otras referencias'!$H$19:$I$20,2,FALSE),\"\")","v":""},null,{"$f":"IF(AH237<>\"\",VLOOKUP(AH237,'Otras referencias'!$H$19:$I$20,2,FALSE),\"\")","v":""},null,{"$f":"IF(AJ237<>\"\",VLOOKUP(AJ237,'Otras referencias'!$H$19:$I$20,2,FALSE),\"\")","v":""},null,{"$f":"IF(AL237<>\"\",VLOOKUP(AL237,'Otras referencias'!$H$19:$I$20,2,FALSE),\"\")","v":""}]
[null,{"$f":"IF(C238=\"\",\"\",IF(COUNTIF($C$3:C238, C238)>1, \"\", C238))","v":""},{"$f":"IF(J238=\"\",\"\",CONCATENATE(DIGITADOR!$M$1,J238,E238))","v":""},"",{"$f":"IF(H238=\"\",\"\",VLOOKUP(H238,'Otras referencias'!$A$24:$E$48,2,FALSE))","v":""},null,null,null,{"$f":"IF(H238=\"\",\"\",VLOOKUP(H238,'Otras referencias'!$A$24:$E$48,5,FALSE))","v":""},null,null,null,null,null,null,"",{"$f":"IF(AND(P238<>\"\",O238<>\"\"),IF(N238=\"A\",VLOOKUP(P238,'Otras referencias'!$J$24:$K$35,2,FALSE),IF(N238=\"B\",VLOOKUP(P238,'Otras referencias'!$N$24:$O$35,2,),IF(N238=\"C\",VLOOKUP(P238,'Otras referencias'!$R$24:$S$35,2,FALSE)))),\"\")","v":""},{"$f":"IF(S238=\"\",\"\",INDEX(referentes!$G$2:$H$5,MATCH(S238,referentes!$H$2:$H$5,0),1))","v":""},null,null,{"$f":"IF(T238=\"\",\"\",VLOOKUP(T238,referentes!$Q$2:$X$209,2,FALSE))","v":""},null,null,null,null,"",null,null,null,"",null,null,{"$f":"IF(AF238<>\"\",VLOOKUP(AF238,'Otras referencias'!$H$19:$I$20,2,FALSE),\"\")","v":""},null,{"$f":"IF(AH238<>\"\",VLOOKUP(AH238,'Otras referencias'!$H$19:$I$20,2,FALSE),\"\")","v":""},null,{"$f":"IF(AJ238<>\"\",VLOOKUP(AJ238,'Otras referencias'!$H$19:$I$20,2,FALSE),\"\")","v":""},null,{"$f":"IF(AL238<>\"\",VLOOKUP(AL238,'Otras referencias'!$H$19:$I$20,2,FALSE),\"\")","v":""}]
[null,{"$f":"IF(C239=\"\",\"\",IF(COUNTIF($C$3:C239, C239)>1, \"\", C239))","v":""},{"$f":"IF(J239=\"\",\"\",CONCATENATE(DIGITADOR!$M$1,J239,E239))","v":""},"",{"$f":"IF(H239=\"\",\"\",VLOOKUP(H239,'Otras referencias'!$A$24:$E$48,2,FALSE))","v":""},null,null,null,{"$f":"IF(H239=\"\",\"\",VLOOKUP(H239,'Otras referencias'!$A$24:$E$48,5,FALSE))","v":""},null,null,null,null,null,null,"",{"$f":"IF(AND(P239<>\"\",O239<>\"\"),IF(N239=\"A\",VLOOKUP(P239,'Otras referencias'!$J$24:$K$35,2,FALSE),IF(N239=\"B\",VLOOKUP(P239,'Otras referencias'!$N$24:$O$35,2,),IF(N239=\"C\",VLOOKUP(P239,'Otras referencias'!$R$24:$S$35,2,FALSE)))),\"\")","v":""},{"$f":"IF(S239=\"\",\"\",INDEX(referentes!$G$2:$H$5,MATCH(S239,referentes!$H$2:$H$5,0),1))","v":""},null,null,{"$f":"IF(T239=\"\",\"\",VLOOKUP(T239,referentes!$Q$2:$X$209,2,FALSE))","v":""},null,null,null,null,"",null,null,null,"",null,null,{"$f":"IF(AF239<>\"\",VLOOKUP(AF239,'Otras referencias'!$H$19:$I$20,2,FALSE),\"\")","v":""},null,{"$f":"IF(AH239<>\"\",VLOOKUP(AH239,'Otras referencias'!$H$19:$I$20,2,FALSE),\"\")","v":""},null,{"$f":"IF(AJ239<>\"\",VLOOKUP(AJ239,'Otras referencias'!$H$19:$I$20,2,FALSE),\"\")","v":""},null,{"$f":"IF(AL239<>\"\",VLOOKUP(AL239,'Otras referencias'!$H$19:$I$20,2,FALSE),\"\")","v":""}]
[null,{"$f":"IF(C240=\"\",\"\",IF(COUNTIF($C$3:C240, C240)>1, \"\", C240))","v":""},{"$f":"IF(J240=\"\",\"\",CONCATENATE(DIGITADOR!$M$1,J240,E240))","v":""},"",{"$f":"IF(H240=\"\",\"\",VLOOKUP(H240,'Otras referencias'!$A$24:$E$48,2,FALSE))","v":""},null,null,null,{"$f":"IF(H240=\"\",\"\",VLOOKUP(H240,'Otras referencias'!$A$24:$E$48,5,FALSE))","v":""},null,null,null,null,null,null,"",{"$f":"IF(AND(P240<>\"\",O240<>\"\"),IF(N240=\"A\",VLOOKUP(P240,'Otras referencias'!$J$24:$K$35,2,FALSE),IF(N240=\"B\",VLOOKUP(P240,'Otras referencias'!$N$24:$O$35,2,),IF(N240=\"C\",VLOOKUP(P240,'Otras referencias'!$R$24:$S$35,2,FALSE)))),\"\")","v":""},{"$f":"IF(S240=\"\",\"\",INDEX(referentes!$G$2:$H$5,MATCH(S240,referentes!$H$2:$H$5,0),1))","v":""},null,null,{"$f":"IF(T240=\"\",\"\",VLOOKUP(T240,referentes!$Q$2:$X$209,2,FALSE))","v":""},null,null,null,null,"",null,null,null,"",null,null,{"$f":"IF(AF240<>\"\",VLOOKUP(AF240,'Otras referencias'!$H$19:$I$20,2,FALSE),\"\")","v":""},null,{"$f":"IF(AH240<>\"\",VLOOKUP(AH240,'Otras referencias'!$H$19:$I$20,2,FALSE),\"\")","v":""},null,{"$f":"IF(AJ240<>\"\",VLOOKUP(AJ240,'Otras referencias'!$H$19:$I$20,2,FALSE),\"\")","v":""},null,{"$f":"IF(AL240<>\"\",VLOOKUP(AL240,'Otras referencias'!$H$19:$I$20,2,FALSE),\"\")","v":""}]
[null,{"$f":"IF(C241=\"\",\"\",IF(COUNTIF($C$3:C241, C241)>1, \"\", C241))","v":""},{"$f":"IF(J241=\"\",\"\",CONCATENATE(DIGITADOR!$M$1,J241,E241))","v":""},"",{"$f":"IF(H241=\"\",\"\",VLOOKUP(H241,'Otras referencias'!$A$24:$E$48,2,FALSE))","v":""},null,null,null,{"$f":"IF(H241=\"\",\"\",VLOOKUP(H241,'Otras referencias'!$A$24:$E$48,5,FALSE))","v":""},null,null,null,null,null,null,"",{"$f":"IF(AND(P241<>\"\",O241<>\"\"),IF(N241=\"A\",VLOOKUP(P241,'Otras referencias'!$J$24:$K$35,2,FALSE),IF(N241=\"B\",VLOOKUP(P241,'Otras referencias'!$N$24:$O$35,2,),IF(N241=\"C\",VLOOKUP(P241,'Otras referencias'!$R$24:$S$35,2,FALSE)))),\"\")","v":""},{"$f":"IF(S241=\"\",\"\",INDEX(referentes!$G$2:$H$5,MATCH(S241,referentes!$H$2:$H$5,0),1))","v":""},null,null,{"$f":"IF(T241=\"\",\"\",VLOOKUP(T241,referentes!$Q$2:$X$209,2,FALSE))","v":""},null,null,null,null,"",null,null,null,"",null,null,{"$f":"IF(AF241<>\"\",VLOOKUP(AF241,'Otras referencias'!$H$19:$I$20,2,FALSE),\"\")","v":""},null,{"$f":"IF(AH241<>\"\",VLOOKUP(AH241,'Otras referencias'!$H$19:$I$20,2,FALSE),\"\")","v":""},null,{"$f":"IF(AJ241<>\"\",VLOOKUP(AJ241,'Otras referencias'!$H$19:$I$20,2,FALSE),\"\")","v":""},null,{"$f":"IF(AL241<>\"\",VLOOKUP(AL241,'Otras referencias'!$H$19:$I$20,2,FALSE),\"\")","v":""}]
[null,{"$f":"IF(C242=\"\",\"\",IF(COUNTIF($C$3:C242, C242)>1, \"\", C242))","v":""},{"$f":"IF(J242=\"\",\"\",CONCATENATE(DIGITADOR!$M$1,J242,E242))","v":""},"",{"$f":"IF(H242=\"\",\"\",VLOOKUP(H242,'Otras referencias'!$A$24:$E$48,2,FALSE))","v":""},null,null,null,{"$f":"IF(H242=\"\",\"\",VLOOKUP(H242,'Otras referencias'!$A$24:$E$48,5,FALSE))","v":""},null,null,null,null,null,null,"",{"$f":"IF(AND(P242<>\"\",O242<>\"\"),IF(N242=\"A\",VLOOKUP(P242,'Otras referencias'!$J$24:$K$35,2,FALSE),IF(N242=\"B\",VLOOKUP(P242,'Otras referencias'!$N$24:$O$35,2,),IF(N242=\"C\",VLOOKUP(P242,'Otras referencias'!$R$24:$S$35,2,FALSE)))),\"\")","v":""},{"$f":"IF(S242=\"\",\"\",INDEX(referentes!$G$2:$H$5,MATCH(S242,referentes!$H$2:$H$5,0),1))","v":""},null,null,{"$f":"IF(T242=\"\",\"\",VLOOKUP(T242,referentes!$Q$2:$X$209,2,FALSE))","v":""},null,null,null,null,"",null,null,null,"",null,null,{"$f":"IF(AF242<>\"\",VLOOKUP(AF242,'Otras referencias'!$H$19:$I$20,2,FALSE),\"\")","v":""},null,{"$f":"IF(AH242<>\"\",VLOOKUP(AH242,'Otras referencias'!$H$19:$I$20,2,FALSE),\"\")","v":""},null,{"$f":"IF(AJ242<>\"\",VLOOKUP(AJ242,'Otras referencias'!$H$19:$I$20,2,FALSE),\"\")","v":""},null,{"$f":"IF(AL242<>\"\",VLOOKUP(AL242,'Otras referencias'!$H$19:$I$20,2,FALSE),\"\")","v":""}]
[null,{"$f":"IF(C243=\"\",\"\",IF(COUNTIF($C$3:C243, C243)>1, \"\", C243))","v":""},{"$f":"IF(J243=\"\",\"\",CONCATENATE(DIGITADOR!$M$1,J243,E243))","v":""},"",{"$f":"IF(H243=\"\",\"\",VLOOKUP(H243,'Otras referencias'!$A$24:$E$48,2,FALSE))","v":""},null,null,null,{"$f":"IF(H243=\"\",\"\",VLOOKUP(H243,'Otras referencias'!$A$24:$E$48,5,FALSE))","v":""},null,null,null,null,null,null,"",{"$f":"IF(AND(P243<>\"\",O243<>\"\"),IF(N243=\"A\",VLOOKUP(P243,'Otras referencias'!$J$24:$K$35,2,FALSE),IF(N243=\"B\",VLOOKUP(P243,'Otras referencias'!$N$24:$O$35,2,),IF(N243=\"C\",VLOOKUP(P243,'Otras referencias'!$R$24:$S$35,2,FALSE)))),\"\")","v":""},{"$f":"IF(S243=\"\",\"\",INDEX(referentes!$G$2:$H$5,MATCH(S243,referentes!$H$2:$H$5,0),1))","v":""},null,null,{"$f":"IF(T243=\"\",\"\",VLOOKUP(T243,referentes!$Q$2:$X$209,2,FALSE))","v":""},null,null,null,null,"",null,null,null,"",null,null,{"$f":"IF(AF243<>\"\",VLOOKUP(AF243,'Otras referencias'!$H$19:$I$20,2,FALSE),\"\")","v":""},null,{"$f":"IF(AH243<>\"\",VLOOKUP(AH243,'Otras referencias'!$H$19:$I$20,2,FALSE),\"\")","v":""},null,{"$f":"IF(AJ243<>\"\",VLOOKUP(AJ243,'Otras referencias'!$H$19:$I$20,2,FALSE),\"\")","v":""},null,{"$f":"IF(AL243<>\"\",VLOOKUP(AL243,'Otras referencias'!$H$19:$I$20,2,FALSE),\"\")","v":""}]
[null,{"$f":"IF(C244=\"\",\"\",IF(COUNTIF($C$3:C244, C244)>1, \"\", C244))","v":""},{"$f":"IF(J244=\"\",\"\",CONCATENATE(DIGITADOR!$M$1,J244,E244))","v":""},"",{"$f":"IF(H244=\"\",\"\",VLOOKUP(H244,'Otras referencias'!$A$24:$E$48,2,FALSE))","v":""},null,null,null,{"$f":"IF(H244=\"\",\"\",VLOOKUP(H244,'Otras referencias'!$A$24:$E$48,5,FALSE))","v":""},null,null,null,null,null,null,"",{"$f":"IF(AND(P244<>\"\",O244<>\"\"),IF(N244=\"A\",VLOOKUP(P244,'Otras referencias'!$J$24:$K$35,2,FALSE),IF(N244=\"B\",VLOOKUP(P244,'Otras referencias'!$N$24:$O$35,2,),IF(N244=\"C\",VLOOKUP(P244,'Otras referencias'!$R$24:$S$35,2,FALSE)))),\"\")","v":""},{"$f":"IF(S244=\"\",\"\",INDEX(referentes!$G$2:$H$5,MATCH(S244,referentes!$H$2:$H$5,0),1))","v":""},null,null,{"$f":"IF(T244=\"\",\"\",VLOOKUP(T244,referentes!$Q$2:$X$209,2,FALSE))","v":""},null,null,null,null,"",null,null,null,"",null,null,{"$f":"IF(AF244<>\"\",VLOOKUP(AF244,'Otras referencias'!$H$19:$I$20,2,FALSE),\"\")","v":""},null,{"$f":"IF(AH244<>\"\",VLOOKUP(AH244,'Otras referencias'!$H$19:$I$20,2,FALSE),\"\")","v":""},null,{"$f":"IF(AJ244<>\"\",VLOOKUP(AJ244,'Otras referencias'!$H$19:$I$20,2,FALSE),\"\")","v":""},null,{"$f":"IF(AL244<>\"\",VLOOKUP(AL244,'Otras referencias'!$H$19:$I$20,2,FALSE),\"\")","v":""}]
[null,{"$f":"IF(C245=\"\",\"\",IF(COUNTIF($C$3:C245, C245)>1, \"\", C245))","v":""},{"$f":"IF(J245=\"\",\"\",CONCATENATE(DIGITADOR!$M$1,J245,E245))","v":""},"",{"$f":"IF(H245=\"\",\"\",VLOOKUP(H245,'Otras referencias'!$A$24:$E$48,2,FALSE))","v":""},null,null,null,{"$f":"IF(H245=\"\",\"\",VLOOKUP(H245,'Otras referencias'!$A$24:$E$48,5,FALSE))","v":""},null,null,null,null,null,null,"",{"$f":"IF(AND(P245<>\"\",O245<>\"\"),IF(N245=\"A\",VLOOKUP(P245,'Otras referencias'!$J$24:$K$35,2,FALSE),IF(N245=\"B\",VLOOKUP(P245,'Otras referencias'!$N$24:$O$35,2,),IF(N245=\"C\",VLOOKUP(P245,'Otras referencias'!$R$24:$S$35,2,FALSE)))),\"\")","v":""},{"$f":"IF(S245=\"\",\"\",INDEX(referentes!$G$2:$H$5,MATCH(S245,referentes!$H$2:$H$5,0),1))","v":""},null,null,{"$f":"IF(T245=\"\",\"\",VLOOKUP(T245,referentes!$Q$2:$X$209,2,FALSE))","v":""},null,null,null,null,"",null,null,null,"",null,null,{"$f":"IF(AF245<>\"\",VLOOKUP(AF245,'Otras referencias'!$H$19:$I$20,2,FALSE),\"\")","v":""},null,{"$f":"IF(AH245<>\"\",VLOOKUP(AH245,'Otras referencias'!$H$19:$I$20,2,FALSE),\"\")","v":""},null,{"$f":"IF(AJ245<>\"\",VLOOKUP(AJ245,'Otras referencias'!$H$19:$I$20,2,FALSE),\"\")","v":""},null,{"$f":"IF(AL245<>\"\",VLOOKUP(AL245,'Otras referencias'!$H$19:$I$20,2,FALSE),\"\")","v":""}]
[null,{"$f":"IF(C246=\"\",\"\",IF(COUNTIF($C$3:C246, C246)>1, \"\", C246))","v":""},{"$f":"IF(J246=\"\",\"\",CONCATENATE(DIGITADOR!$M$1,J246,E246))","v":""},"",{"$f":"IF(H246=\"\",\"\",VLOOKUP(H246,'Otras referencias'!$A$24:$E$48,2,FALSE))","v":""},null,null,null,{"$f":"IF(H246=\"\",\"\",VLOOKUP(H246,'Otras referencias'!$A$24:$E$48,5,FALSE))","v":""},null,null,null,null,null,null,"",{"$f":"IF(AND(P246<>\"\",O246<>\"\"),IF(N246=\"A\",VLOOKUP(P246,'Otras referencias'!$J$24:$K$35,2,FALSE),IF(N246=\"B\",VLOOKUP(P246,'Otras referencias'!$N$24:$O$35,2,),IF(N246=\"C\",VLOOKUP(P246,'Otras referencias'!$R$24:$S$35,2,FALSE)))),\"\")","v":""},{"$f":"IF(S246=\"\",\"\",INDEX(referentes!$G$2:$H$5,MATCH(S246,referentes!$H$2:$H$5,0),1))","v":""},null,null,{"$f":"IF(T246=\"\",\"\",VLOOKUP(T246,referentes!$Q$2:$X$209,2,FALSE))","v":""},null,null,null,null,"",null,null,null,"",null,null,{"$f":"IF(AF246<>\"\",VLOOKUP(AF246,'Otras referencias'!$H$19:$I$20,2,FALSE),\"\")","v":""},null,{"$f":"IF(AH246<>\"\",VLOOKUP(AH246,'Otras referencias'!$H$19:$I$20,2,FALSE),\"\")","v":""},null,{"$f":"IF(AJ246<>\"\",VLOOKUP(AJ246,'Otras referencias'!$H$19:$I$20,2,FALSE),\"\")","v":""},null,{"$f":"IF(AL246<>\"\",VLOOKUP(AL246,'Otras referencias'!$H$19:$I$20,2,FALSE),\"\")","v":""}]
[null,{"$f":"IF(C247=\"\",\"\",IF(COUNTIF($C$3:C247, C247)>1, \"\", C247))","v":""},{"$f":"IF(J247=\"\",\"\",CONCATENATE(DIGITADOR!$M$1,J247,E247))","v":""},"",{"$f":"IF(H247=\"\",\"\",VLOOKUP(H247,'Otras referencias'!$A$24:$E$48,2,FALSE))","v":""},null,null,null,{"$f":"IF(H247=\"\",\"\",VLOOKUP(H247,'Otras referencias'!$A$24:$E$48,5,FALSE))","v":""},null,null,null,null,null,null,"",{"$f":"IF(AND(P247<>\"\",O247<>\"\"),IF(N247=\"A\",VLOOKUP(P247,'Otras referencias'!$J$24:$K$35,2,FALSE),IF(N247=\"B\",VLOOKUP(P247,'Otras referencias'!$N$24:$O$35,2,),IF(N247=\"C\",VLOOKUP(P247,'Otras referencias'!$R$24:$S$35,2,FALSE)))),\"\")","v":""},{"$f":"IF(S247=\"\",\"\",INDEX(referentes!$G$2:$H$5,MATCH(S247,referentes!$H$2:$H$5,0),1))","v":""},null,null,{"$f":"IF(T247=\"\",\"\",VLOOKUP(T247,referentes!$Q$2:$X$209,2,FALSE))","v":""},null,null,null,null,"",null,null,null,"",null,null,{"$f":"IF(AF247<>\"\",VLOOKUP(AF247,'Otras referencias'!$H$19:$I$20,2,FALSE),\"\")","v":""},null,{"$f":"IF(AH247<>\"\",VLOOKUP(AH247,'Otras referencias'!$H$19:$I$20,2,FALSE),\"\")","v":""},null,{"$f":"IF(AJ247<>\"\",VLOOKUP(AJ247,'Otras referencias'!$H$19:$I$20,2,FALSE),\"\")","v":""},null,{"$f":"IF(AL247<>\"\",VLOOKUP(AL247,'Otras referencias'!$H$19:$I$20,2,FALSE),\"\")","v":""}]
[null,{"$f":"IF(C248=\"\",\"\",IF(COUNTIF($C$3:C248, C248)>1, \"\", C248))","v":""},{"$f":"IF(J248=\"\",\"\",CONCATENATE(DIGITADOR!$M$1,J248,E248))","v":""},"",{"$f":"IF(H248=\"\",\"\",VLOOKUP(H248,'Otras referencias'!$A$24:$E$48,2,FALSE))","v":""},null,null,null,{"$f":"IF(H248=\"\",\"\",VLOOKUP(H248,'Otras referencias'!$A$24:$E$48,5,FALSE))","v":""},null,null,null,null,null,null,"",{"$f":"IF(AND(P248<>\"\",O248<>\"\"),IF(N248=\"A\",VLOOKUP(P248,'Otras referencias'!$J$24:$K$35,2,FALSE),IF(N248=\"B\",VLOOKUP(P248,'Otras referencias'!$N$24:$O$35,2,),IF(N248=\"C\",VLOOKUP(P248,'Otras referencias'!$R$24:$S$35,2,FALSE)))),\"\")","v":""},{"$f":"IF(S248=\"\",\"\",INDEX(referentes!$G$2:$H$5,MATCH(S248,referentes!$H$2:$H$5,0),1))","v":""},null,null,{"$f":"IF(T248=\"\",\"\",VLOOKUP(T248,referentes!$Q$2:$X$209,2,FALSE))","v":""},null,null,null,null,"",null,null,null,"",null,null,{"$f":"IF(AF248<>\"\",VLOOKUP(AF248,'Otras referencias'!$H$19:$I$20,2,FALSE),\"\")","v":""},null,{"$f":"IF(AH248<>\"\",VLOOKUP(AH248,'Otras referencias'!$H$19:$I$20,2,FALSE),\"\")","v":""},null,{"$f":"IF(AJ248<>\"\",VLOOKUP(AJ248,'Otras referencias'!$H$19:$I$20,2,FALSE),\"\")","v":""},null,{"$f":"IF(AL248<>\"\",VLOOKUP(AL248,'Otras referencias'!$H$19:$I$20,2,FALSE),\"\")","v":""}]
[null,{"$f":"IF(C249=\"\",\"\",IF(COUNTIF($C$3:C249, C249)>1, \"\", C249))","v":""},{"$f":"IF(J249=\"\",\"\",CONCATENATE(DIGITADOR!$M$1,J249,E249))","v":""},"",{"$f":"IF(H249=\"\",\"\",VLOOKUP(H249,'Otras referencias'!$A$24:$E$48,2,FALSE))","v":""},null,null,null,{"$f":"IF(H249=\"\",\"\",VLOOKUP(H249,'Otras referencias'!$A$24:$E$48,5,FALSE))","v":""},null,null,null,null,null,null,"",{"$f":"IF(AND(P249<>\"\",O249<>\"\"),IF(N249=\"A\",VLOOKUP(P249,'Otras referencias'!$J$24:$K$35,2,FALSE),IF(N249=\"B\",VLOOKUP(P249,'Otras referencias'!$N$24:$O$35,2,),IF(N249=\"C\",VLOOKUP(P249,'Otras referencias'!$R$24:$S$35,2,FALSE)))),\"\")","v":""},{"$f":"IF(S249=\"\",\"\",INDEX(referentes!$G$2:$H$5,MATCH(S249,referentes!$H$2:$H$5,0),1))","v":""},null,null,{"$f":"IF(T249=\"\",\"\",VLOOKUP(T249,referentes!$Q$2:$X$209,2,FALSE))","v":""},null,null,null,null,"",null,null,null,"",null,null,{"$f":"IF(AF249<>\"\",VLOOKUP(AF249,'Otras referencias'!$H$19:$I$20,2,FALSE),\"\")","v":""},null,{"$f":"IF(AH249<>\"\",VLOOKUP(AH249,'Otras referencias'!$H$19:$I$20,2,FALSE),\"\")","v":""},null,{"$f":"IF(AJ249<>\"\",VLOOKUP(AJ249,'Otras referencias'!$H$19:$I$20,2,FALSE),\"\")","v":""},null,{"$f":"IF(AL249<>\"\",VLOOKUP(AL249,'Otras referencias'!$H$19:$I$20,2,FALSE),\"\")","v":""}]
[null,{"$f":"IF(C250=\"\",\"\",IF(COUNTIF($C$3:C250, C250)>1, \"\", C250))","v":""},{"$f":"IF(J250=\"\",\"\",CONCATENATE(DIGITADOR!$M$1,J250,E250))","v":""},"",{"$f":"IF(H250=\"\",\"\",VLOOKUP(H250,'Otras referencias'!$A$24:$E$48,2,FALSE))","v":""},null,null,null,{"$f":"IF(H250=\"\",\"\",VLOOKUP(H250,'Otras referencias'!$A$24:$E$48,5,FALSE))","v":""},null,null,null,null,null,null,"",{"$f":"IF(AND(P250<>\"\",O250<>\"\"),IF(N250=\"A\",VLOOKUP(P250,'Otras referencias'!$J$24:$K$35,2,FALSE),IF(N250=\"B\",VLOOKUP(P250,'Otras referencias'!$N$24:$O$35,2,),IF(N250=\"C\",VLOOKUP(P250,'Otras referencias'!$R$24:$S$35,2,FALSE)))),\"\")","v":""},{"$f":"IF(S250=\"\",\"\",INDEX(referentes!$G$2:$H$5,MATCH(S250,referentes!$H$2:$H$5,0),1))","v":""},null,null,{"$f":"IF(T250=\"\",\"\",VLOOKUP(T250,referentes!$Q$2:$X$209,2,FALSE))","v":""},null,null,null,null,"",null,null,null,"",null,null,{"$f":"IF(AF250<>\"\",VLOOKUP(AF250,'Otras referencias'!$H$19:$I$20,2,FALSE),\"\")","v":""},null,{"$f":"IF(AH250<>\"\",VLOOKUP(AH250,'Otras referencias'!$H$19:$I$20,2,FALSE),\"\")","v":""},null,{"$f":"IF(AJ250<>\"\",VLOOKUP(AJ250,'Otras referencias'!$H$19:$I$20,2,FALSE),\"\")","v":""},null,{"$f":"IF(AL250<>\"\",VLOOKUP(AL250,'Otras referencias'!$H$19:$I$20,2,FALSE),\"\")","v":""}]
[null,{"$f":"IF(C251=\"\",\"\",IF(COUNTIF($C$3:C251, C251)>1, \"\", C251))","v":""},{"$f":"IF(J251=\"\",\"\",CONCATENATE(DIGITADOR!$M$1,J251,E251))","v":""},"",{"$f":"IF(H251=\"\",\"\",VLOOKUP(H251,'Otras referencias'!$A$24:$E$48,2,FALSE))","v":""},null,null,null,{"$f":"IF(H251=\"\",\"\",VLOOKUP(H251,'Otras referencias'!$A$24:$E$48,5,FALSE))","v":""},null,null,null,null,null,null,"",{"$f":"IF(AND(P251<>\"\",O251<>\"\"),IF(N251=\"A\",VLOOKUP(P251,'Otras referencias'!$J$24:$K$35,2,FALSE),IF(N251=\"B\",VLOOKUP(P251,'Otras referencias'!$N$24:$O$35,2,),IF(N251=\"C\",VLOOKUP(P251,'Otras referencias'!$R$24:$S$35,2,FALSE)))),\"\")","v":""},{"$f":"IF(S251=\"\",\"\",INDEX(referentes!$G$2:$H$5,MATCH(S251,referentes!$H$2:$H$5,0),1))","v":""},null,null,{"$f":"IF(T251=\"\",\"\",VLOOKUP(T251,referentes!$Q$2:$X$209,2,FALSE))","v":""},null,null,null,null,"",null,null,null,"",null,null,{"$f":"IF(AF251<>\"\",VLOOKUP(AF251,'Otras referencias'!$H$19:$I$20,2,FALSE),\"\")","v":""},null,{"$f":"IF(AH251<>\"\",VLOOKUP(AH251,'Otras referencias'!$H$19:$I$20,2,FALSE),\"\")","v":""},null,{"$f":"IF(AJ251<>\"\",VLOOKUP(AJ251,'Otras referencias'!$H$19:$I$20,2,FALSE),\"\")","v":""},null,{"$f":"IF(AL251<>\"\",VLOOKUP(AL251,'Otras referencias'!$H$19:$I$20,2,FALSE),\"\")","v":""}]
[null,{"$f":"IF(C252=\"\",\"\",IF(COUNTIF($C$3:C252, C252)>1, \"\", C252))","v":""},{"$f":"IF(J252=\"\",\"\",CONCATENATE(DIGITADOR!$M$1,J252,E252))","v":""},"",{"$f":"IF(H252=\"\",\"\",VLOOKUP(H252,'Otras referencias'!$A$24:$E$48,2,FALSE))","v":""},null,null,null,{"$f":"IF(H252=\"\",\"\",VLOOKUP(H252,'Otras referencias'!$A$24:$E$48,5,FALSE))","v":""},null,null,null,null,null,null,"",{"$f":"IF(AND(P252<>\"\",O252<>\"\"),IF(N252=\"A\",VLOOKUP(P252,'Otras referencias'!$J$24:$K$35,2,FALSE),IF(N252=\"B\",VLOOKUP(P252,'Otras referencias'!$N$24:$O$35,2,),IF(N252=\"C\",VLOOKUP(P252,'Otras referencias'!$R$24:$S$35,2,FALSE)))),\"\")","v":""},{"$f":"IF(S252=\"\",\"\",INDEX(referentes!$G$2:$H$5,MATCH(S252,referentes!$H$2:$H$5,0),1))","v":""},null,null,{"$f":"IF(T252=\"\",\"\",VLOOKUP(T252,referentes!$Q$2:$X$209,2,FALSE))","v":""},null,null,null,null,"",null,null,null,"",null,null,{"$f":"IF(AF252<>\"\",VLOOKUP(AF252,'Otras referencias'!$H$19:$I$20,2,FALSE),\"\")","v":""},null,{"$f":"IF(AH252<>\"\",VLOOKUP(AH252,'Otras referencias'!$H$19:$I$20,2,FALSE),\"\")","v":""},null,{"$f":"IF(AJ252<>\"\",VLOOKUP(AJ252,'Otras referencias'!$H$19:$I$20,2,FALSE),\"\")","v":""},null,{"$f":"IF(AL252<>\"\",VLOOKUP(AL252,'Otras referencias'!$H$19:$I$20,2,FALSE),\"\")","v":""}]
[null,{"$f":"IF(C253=\"\",\"\",IF(COUNTIF($C$3:C253, C253)>1, \"\", C253))","v":""},{"$f":"IF(J253=\"\",\"\",CONCATENATE(DIGITADOR!$M$1,J253,E253))","v":""},"",{"$f":"IF(H253=\"\",\"\",VLOOKUP(H253,'Otras referencias'!$A$24:$E$48,2,FALSE))","v":""},null,null,null,{"$f":"IF(H253=\"\",\"\",VLOOKUP(H253,'Otras referencias'!$A$24:$E$48,5,FALSE))","v":""},null,null,null,null,null,null,"",{"$f":"IF(AND(P253<>\"\",O253<>\"\"),IF(N253=\"A\",VLOOKUP(P253,'Otras referencias'!$J$24:$K$35,2,FALSE),IF(N253=\"B\",VLOOKUP(P253,'Otras referencias'!$N$24:$O$35,2,),IF(N253=\"C\",VLOOKUP(P253,'Otras referencias'!$R$24:$S$35,2,FALSE)))),\"\")","v":""},{"$f":"IF(S253=\"\",\"\",INDEX(referentes!$G$2:$H$5,MATCH(S253,referentes!$H$2:$H$5,0),1))","v":""},null,null,{"$f":"IF(T253=\"\",\"\",VLOOKUP(T253,referentes!$Q$2:$X$209,2,FALSE))","v":""},null,null,null,null,"",null,null,null,"",null,null,{"$f":"IF(AF253<>\"\",VLOOKUP(AF253,'Otras referencias'!$H$19:$I$20,2,FALSE),\"\")","v":""},null,{"$f":"IF(AH253<>\"\",VLOOKUP(AH253,'Otras referencias'!$H$19:$I$20,2,FALSE),\"\")","v":""},null,{"$f":"IF(AJ253<>\"\",VLOOKUP(AJ253,'Otras referencias'!$H$19:$I$20,2,FALSE),\"\")","v":""},null,{"$f":"IF(AL253<>\"\",VLOOKUP(AL253,'Otras referencias'!$H$19:$I$20,2,FALSE),\"\")","v":""}]
[null,{"$f":"IF(C254=\"\",\"\",IF(COUNTIF($C$3:C254, C254)>1, \"\", C254))","v":""},{"$f":"IF(J254=\"\",\"\",CONCATENATE(DIGITADOR!$M$1,J254,E254))","v":""},"",{"$f":"IF(H254=\"\",\"\",VLOOKUP(H254,'Otras referencias'!$A$24:$E$48,2,FALSE))","v":""},null,null,null,{"$f":"IF(H254=\"\",\"\",VLOOKUP(H254,'Otras referencias'!$A$24:$E$48,5,FALSE))","v":""},null,null,null,null,null,null,"",{"$f":"IF(AND(P254<>\"\",O254<>\"\"),IF(N254=\"A\",VLOOKUP(P254,'Otras referencias'!$J$24:$K$35,2,FALSE),IF(N254=\"B\",VLOOKUP(P254,'Otras referencias'!$N$24:$O$35,2,),IF(N254=\"C\",VLOOKUP(P254,'Otras referencias'!$R$24:$S$35,2,FALSE)))),\"\")","v":""},{"$f":"IF(S254=\"\",\"\",INDEX(referentes!$G$2:$H$5,MATCH(S254,referentes!$H$2:$H$5,0),1))","v":""},null,null,{"$f":"IF(T254=\"\",\"\",VLOOKUP(T254,referentes!$Q$2:$X$209,2,FALSE))","v":""},null,null,null,null,"",null,null,null,"",null,null,{"$f":"IF(AF254<>\"\",VLOOKUP(AF254,'Otras referencias'!$H$19:$I$20,2,FALSE),\"\")","v":""},null,{"$f":"IF(AH254<>\"\",VLOOKUP(AH254,'Otras referencias'!$H$19:$I$20,2,FALSE),\"\")","v":""},null,{"$f":"IF(AJ254<>\"\",VLOOKUP(AJ254,'Otras referencias'!$H$19:$I$20,2,FALSE),\"\")","v":""},null,{"$f":"IF(AL254<>\"\",VLOOKUP(AL254,'Otras referencias'!$H$19:$I$20,2,FALSE),\"\")","v":""}]
[null,{"$f":"IF(C255=\"\",\"\",IF(COUNTIF($C$3:C255, C255)>1, \"\", C255))","v":""},{"$f":"IF(J255=\"\",\"\",CONCATENATE(DIGITADOR!$M$1,J255,E255))","v":""},"",{"$f":"IF(H255=\"\",\"\",VLOOKUP(H255,'Otras referencias'!$A$24:$E$48,2,FALSE))","v":""},null,null,null,{"$f":"IF(H255=\"\",\"\",VLOOKUP(H255,'Otras referencias'!$A$24:$E$48,5,FALSE))","v":""},null,null,null,null,null,null,"",{"$f":"IF(AND(P255<>\"\",O255<>\"\"),IF(N255=\"A\",VLOOKUP(P255,'Otras referencias'!$J$24:$K$35,2,FALSE),IF(N255=\"B\",VLOOKUP(P255,'Otras referencias'!$N$24:$O$35,2,),IF(N255=\"C\",VLOOKUP(P255,'Otras referencias'!$R$24:$S$35,2,FALSE)))),\"\")","v":""},{"$f":"IF(S255=\"\",\"\",INDEX(referentes!$G$2:$H$5,MATCH(S255,referentes!$H$2:$H$5,0),1))","v":""},null,null,{"$f":"IF(T255=\"\",\"\",VLOOKUP(T255,referentes!$Q$2:$X$209,2,FALSE))","v":""},null,null,null,null,"",null,null,null,"",null,null,{"$f":"IF(AF255<>\"\",VLOOKUP(AF255,'Otras referencias'!$H$19:$I$20,2,FALSE),\"\")","v":""},null,{"$f":"IF(AH255<>\"\",VLOOKUP(AH255,'Otras referencias'!$H$19:$I$20,2,FALSE),\"\")","v":""},null,{"$f":"IF(AJ255<>\"\",VLOOKUP(AJ255,'Otras referencias'!$H$19:$I$20,2,FALSE),\"\")","v":""},null,{"$f":"IF(AL255<>\"\",VLOOKUP(AL255,'Otras referencias'!$H$19:$I$20,2,FALSE),\"\")","v":""}]
[null,{"$f":"IF(C256=\"\",\"\",IF(COUNTIF($C$3:C256, C256)>1, \"\", C256))","v":""},{"$f":"IF(J256=\"\",\"\",CONCATENATE(DIGITADOR!$M$1,J256,E256))","v":""},"",{"$f":"IF(H256=\"\",\"\",VLOOKUP(H256,'Otras referencias'!$A$24:$E$48,2,FALSE))","v":""},null,null,null,{"$f":"IF(H256=\"\",\"\",VLOOKUP(H256,'Otras referencias'!$A$24:$E$48,5,FALSE))","v":""},null,null,null,null,null,null,"",{"$f":"IF(AND(P256<>\"\",O256<>\"\"),IF(N256=\"A\",VLOOKUP(P256,'Otras referencias'!$J$24:$K$35,2,FALSE),IF(N256=\"B\",VLOOKUP(P256,'Otras referencias'!$N$24:$O$35,2,),IF(N256=\"C\",VLOOKUP(P256,'Otras referencias'!$R$24:$S$35,2,FALSE)))),\"\")","v":""},{"$f":"IF(S256=\"\",\"\",INDEX(referentes!$G$2:$H$5,MATCH(S256,referentes!$H$2:$H$5,0),1))","v":""},null,null,{"$f":"IF(T256=\"\",\"\",VLOOKUP(T256,referentes!$Q$2:$X$209,2,FALSE))","v":""},null,null,null,null,"",null,null,null,"",null,null,{"$f":"IF(AF256<>\"\",VLOOKUP(AF256,'Otras referencias'!$H$19:$I$20,2,FALSE),\"\")","v":""},null,{"$f":"IF(AH256<>\"\",VLOOKUP(AH256,'Otras referencias'!$H$19:$I$20,2,FALSE),\"\")","v":""},null,{"$f":"IF(AJ256<>\"\",VLOOKUP(AJ256,'Otras referencias'!$H$19:$I$20,2,FALSE),\"\")","v":""},null,{"$f":"IF(AL256<>\"\",VLOOKUP(AL256,'Otras referencias'!$H$19:$I$20,2,FALSE),\"\")","v":""}]
[null,{"$f":"IF(C257=\"\",\"\",IF(COUNTIF($C$3:C257, C257)>1, \"\", C257))","v":""},{"$f":"IF(J257=\"\",\"\",CONCATENATE(DIGITADOR!$M$1,J257,E257))","v":""},"",{"$f":"IF(H257=\"\",\"\",VLOOKUP(H257,'Otras referencias'!$A$24:$E$48,2,FALSE))","v":""},null,null,null,{"$f":"IF(H257=\"\",\"\",VLOOKUP(H257,'Otras referencias'!$A$24:$E$48,5,FALSE))","v":""},null,null,null,null,null,null,"",{"$f":"IF(AND(P257<>\"\",O257<>\"\"),IF(N257=\"A\",VLOOKUP(P257,'Otras referencias'!$J$24:$K$35,2,FALSE),IF(N257=\"B\",VLOOKUP(P257,'Otras referencias'!$N$24:$O$35,2,),IF(N257=\"C\",VLOOKUP(P257,'Otras referencias'!$R$24:$S$35,2,FALSE)))),\"\")","v":""},{"$f":"IF(S257=\"\",\"\",INDEX(referentes!$G$2:$H$5,MATCH(S257,referentes!$H$2:$H$5,0),1))","v":""},null,null,{"$f":"IF(T257=\"\",\"\",VLOOKUP(T257,referentes!$Q$2:$X$209,2,FALSE))","v":""},null,null,null,null,"",null,null,null,"",null,null,{"$f":"IF(AF257<>\"\",VLOOKUP(AF257,'Otras referencias'!$H$19:$I$20,2,FALSE),\"\")","v":""},null,{"$f":"IF(AH257<>\"\",VLOOKUP(AH257,'Otras referencias'!$H$19:$I$20,2,FALSE),\"\")","v":""},null,{"$f":"IF(AJ257<>\"\",VLOOKUP(AJ257,'Otras referencias'!$H$19:$I$20,2,FALSE),\"\")","v":""},null,{"$f":"IF(AL257<>\"\",VLOOKUP(AL257,'Otras referencias'!$H$19:$I$20,2,FALSE),\"\")","v":""}]
[null,{"$f":"IF(C258=\"\",\"\",IF(COUNTIF($C$3:C258, C258)>1, \"\", C258))","v":""},{"$f":"IF(J258=\"\",\"\",CONCATENATE(DIGITADOR!$M$1,J258,E258))","v":""},"",{"$f":"IF(H258=\"\",\"\",VLOOKUP(H258,'Otras referencias'!$A$24:$E$48,2,FALSE))","v":""},null,null,null,{"$f":"IF(H258=\"\",\"\",VLOOKUP(H258,'Otras referencias'!$A$24:$E$48,5,FALSE))","v":""},null,null,null,null,null,null,"",{"$f":"IF(AND(P258<>\"\",O258<>\"\"),IF(N258=\"A\",VLOOKUP(P258,'Otras referencias'!$J$24:$K$35,2,FALSE),IF(N258=\"B\",VLOOKUP(P258,'Otras referencias'!$N$24:$O$35,2,),IF(N258=\"C\",VLOOKUP(P258,'Otras referencias'!$R$24:$S$35,2,FALSE)))),\"\")","v":""},{"$f":"IF(S258=\"\",\"\",INDEX(referentes!$G$2:$H$5,MATCH(S258,referentes!$H$2:$H$5,0),1))","v":""},null,null,{"$f":"IF(T258=\"\",\"\",VLOOKUP(T258,referentes!$Q$2:$X$209,2,FALSE))","v":""},null,null,null,null,"",null,null,null,"",null,null,{"$f":"IF(AF258<>\"\",VLOOKUP(AF258,'Otras referencias'!$H$19:$I$20,2,FALSE),\"\")","v":""},null,{"$f":"IF(AH258<>\"\",VLOOKUP(AH258,'Otras referencias'!$H$19:$I$20,2,FALSE),\"\")","v":""},null,{"$f":"IF(AJ258<>\"\",VLOOKUP(AJ258,'Otras referencias'!$H$19:$I$20,2,FALSE),\"\")","v":""},null,{"$f":"IF(AL258<>\"\",VLOOKUP(AL258,'Otras referencias'!$H$19:$I$20,2,FALSE),\"\")","v":""}]
[null,{"$f":"IF(C259=\"\",\"\",IF(COUNTIF($C$3:C259, C259)>1, \"\", C259))","v":""},{"$f":"IF(J259=\"\",\"\",CONCATENATE(DIGITADOR!$M$1,J259,E259))","v":""},"",{"$f":"IF(H259=\"\",\"\",VLOOKUP(H259,'Otras referencias'!$A$24:$E$48,2,FALSE))","v":""},null,null,null,{"$f":"IF(H259=\"\",\"\",VLOOKUP(H259,'Otras referencias'!$A$24:$E$48,5,FALSE))","v":""},null,null,null,null,null,null,"",{"$f":"IF(AND(P259<>\"\",O259<>\"\"),IF(N259=\"A\",VLOOKUP(P259,'Otras referencias'!$J$24:$K$35,2,FALSE),IF(N259=\"B\",VLOOKUP(P259,'Otras referencias'!$N$24:$O$35,2,),IF(N259=\"C\",VLOOKUP(P259,'Otras referencias'!$R$24:$S$35,2,FALSE)))),\"\")","v":""},{"$f":"IF(S259=\"\",\"\",INDEX(referentes!$G$2:$H$5,MATCH(S259,referentes!$H$2:$H$5,0),1))","v":""},null,null,{"$f":"IF(T259=\"\",\"\",VLOOKUP(T259,referentes!$Q$2:$X$209,2,FALSE))","v":""},null,null,null,null,"",null,null,null,"",null,null,{"$f":"IF(AF259<>\"\",VLOOKUP(AF259,'Otras referencias'!$H$19:$I$20,2,FALSE),\"\")","v":""},null,{"$f":"IF(AH259<>\"\",VLOOKUP(AH259,'Otras referencias'!$H$19:$I$20,2,FALSE),\"\")","v":""},null,{"$f":"IF(AJ259<>\"\",VLOOKUP(AJ259,'Otras referencias'!$H$19:$I$20,2,FALSE),\"\")","v":""},null,{"$f":"IF(AL259<>\"\",VLOOKUP(AL259,'Otras referencias'!$H$19:$I$20,2,FALSE),\"\")","v":""}]
[null,{"$f":"IF(C260=\"\",\"\",IF(COUNTIF($C$3:C260, C260)>1, \"\", C260))","v":""},{"$f":"IF(J260=\"\",\"\",CONCATENATE(DIGITADOR!$M$1,J260,E260))","v":""},{"$f":"IF(C260=\"\",\"\",CONCATENATE(C260,ROW()-2))","v":""},{"$f":"IF(H260=\"\",\"\",VLOOKUP(H260,'Otras referencias'!$A$24:$E$48,2,FALSE))","v":""},null,null,null,{"$f":"IF(H260=\"\",\"\",VLOOKUP(H260,'Otras referencias'!$A$24:$E$48,5,FALSE))","v":""},null,null,null,null,null,null,{"$f":"CONCATENATE(N260,O260)","v":""},{"$f":"IF(AND(P260<>\"\",O260<>\"\"),IF(N260=\"A\",VLOOKUP(P260,'Otras referencias'!$J$24:$K$35,2,FALSE),IF(N260=\"B\",VLOOKUP(P260,'Otras referencias'!$N$24:$O$35,2,),IF(N260=\"C\",VLOOKUP(P260,'Otras referencias'!$R$24:$S$35,2,FALSE)))),\"\")","v":""},{"$f":"IF(S260=\"\",\"\",INDEX(referentes!$G$2:$H$5,MATCH(S260,referentes!$H$2:$H$5,0),1))","v":""},null,null,{"$f":"IF(T260=\"\",\"\",VLOOKUP(T260,referentes!$Q$2:$X$209,2,FALSE))","v":""},null,null,null,null,{"$f":"IF(OR(W260=\"\",X260=\"\",Y260=\"\"),\"\",AVERAGE(W260,X260,Y260))","v":""},null,null,null,{"$f":"IF(OR(AA260=\"\",AB260=\"\",AC260=\"\"),\"\",AVERAGE(AA260,AB260,AC260))","v":""},null,null,{"$f":"IF(AF260<>\"\",VLOOKUP(AF260,'Otras referencias'!$H$19:$I$20,2,FALSE),\"\")","v":""},null,{"$f":"IF(AH260<>\"\",VLOOKUP(AH260,'Otras referencias'!$H$19:$I$20,2,FALSE),\"\")","v":""},null,{"$f":"IF(AJ260<>\"\",VLOOKUP(AJ260,'Otras referencias'!$H$19:$I$20,2,FALSE),\"\")","v":""},null,{"$f":"IF(AL260<>\"\",VLOOKUP(AL260,'Otras referencias'!$H$19:$I$20,2,FALSE),\"\")","v":""}]
[null,{"$f":"IF(C261=\"\",\"\",IF(COUNTIF($C$3:C261, C261)>1, \"\", C261))","v":""},{"$f":"IF(J261=\"\",\"\",CONCATENATE(DIGITADOR!$M$1,J261,E261))","v":""},"",{"$f":"IF(H261=\"\",\"\",VLOOKUP(H261,'Otras referencias'!$A$24:$E$48,2,FALSE))","v":""},null,null,null,{"$f":"IF(H261=\"\",\"\",VLOOKUP(H261,'Otras referencias'!$A$24:$E$48,5,FALSE))","v":""},null,null,null,null,null,null,"",{"$f":"IF(AND(P261<>\"\",O261<>\"\"),IF(N261=\"A\",VLOOKUP(P261,'Otras referencias'!$J$24:$K$35,2,FALSE),IF(N261=\"B\",VLOOKUP(P261,'Otras referencias'!$N$24:$O$35,2,),IF(N261=\"C\",VLOOKUP(P261,'Otras referencias'!$R$24:$S$35,2,FALSE)))),\"\")","v":""},{"$f":"IF(S261=\"\",\"\",INDEX(referentes!$G$2:$H$5,MATCH(S261,referentes!$H$2:$H$5,0),1))","v":""},null,null,{"$f":"IF(T261=\"\",\"\",VLOOKUP(T261,referentes!$Q$2:$X$209,2,FALSE))","v":""},null,null,null,null,"",null,null,null,"",null,null,{"$f":"IF(AF261<>\"\",VLOOKUP(AF261,'Otras referencias'!$H$19:$I$20,2,FALSE),\"\")","v":""},null,{"$f":"IF(AH261<>\"\",VLOOKUP(AH261,'Otras referencias'!$H$19:$I$20,2,FALSE),\"\")","v":""},null,{"$f":"IF(AJ261<>\"\",VLOOKUP(AJ261,'Otras referencias'!$H$19:$I$20,2,FALSE),\"\")","v":""},null,{"$f":"IF(AL261<>\"\",VLOOKUP(AL261,'Otras referencias'!$H$19:$I$20,2,FALSE),\"\")","v":""}]
[null,{"$f":"IF(C262=\"\",\"\",IF(COUNTIF($C$3:C262, C262)>1, \"\", C262))","v":""},{"$f":"IF(J262=\"\",\"\",CONCATENATE(DIGITADOR!$M$1,J262,E262))","v":""},"",{"$f":"IF(H262=\"\",\"\",VLOOKUP(H262,'Otras referencias'!$A$24:$E$48,2,FALSE))","v":""},null,null,null,{"$f":"IF(H262=\"\",\"\",VLOOKUP(H262,'Otras referencias'!$A$24:$E$48,5,FALSE))","v":""},null,null,null,null,null,null,"",{"$f":"IF(AND(P262<>\"\",O262<>\"\"),IF(N262=\"A\",VLOOKUP(P262,'Otras referencias'!$J$24:$K$35,2,FALSE),IF(N262=\"B\",VLOOKUP(P262,'Otras referencias'!$N$24:$O$35,2,),IF(N262=\"C\",VLOOKUP(P262,'Otras referencias'!$R$24:$S$35,2,FALSE)))),\"\")","v":""},{"$f":"IF(S262=\"\",\"\",INDEX(referentes!$G$2:$H$5,MATCH(S262,referentes!$H$2:$H$5,0),1))","v":""},null,null,{"$f":"IF(T262=\"\",\"\",VLOOKUP(T262,referentes!$Q$2:$X$209,2,FALSE))","v":""},null,null,null,null,"",null,null,null,"",null,null,{"$f":"IF(AF262<>\"\",VLOOKUP(AF262,'Otras referencias'!$H$19:$I$20,2,FALSE),\"\")","v":""},null,{"$f":"IF(AH262<>\"\",VLOOKUP(AH262,'Otras referencias'!$H$19:$I$20,2,FALSE),\"\")","v":""},null,{"$f":"IF(AJ262<>\"\",VLOOKUP(AJ262,'Otras referencias'!$H$19:$I$20,2,FALSE),\"\")","v":""},null,{"$f":"IF(AL262<>\"\",VLOOKUP(AL262,'Otras referencias'!$H$19:$I$20,2,FALSE),\"\")","v":""}]
[null,{"$f":"IF(C263=\"\",\"\",IF(COUNTIF($C$3:C263, C263)>1, \"\", C263))","v":""},{"$f":"IF(J263=\"\",\"\",CONCATENATE(DIGITADOR!$M$1,J263,E263))","v":""},"",{"$f":"IF(H263=\"\",\"\",VLOOKUP(H263,'Otras referencias'!$A$24:$E$48,2,FALSE))","v":""},null,null,null,{"$f":"IF(H263=\"\",\"\",VLOOKUP(H263,'Otras referencias'!$A$24:$E$48,5,FALSE))","v":""},null,null,null,null,null,null,"",{"$f":"IF(AND(P263<>\"\",O263<>\"\"),IF(N263=\"A\",VLOOKUP(P263,'Otras referencias'!$J$24:$K$35,2,FALSE),IF(N263=\"B\",VLOOKUP(P263,'Otras referencias'!$N$24:$O$35,2,),IF(N263=\"C\",VLOOKUP(P263,'Otras referencias'!$R$24:$S$35,2,FALSE)))),\"\")","v":""},{"$f":"IF(S263=\"\",\"\",INDEX(referentes!$G$2:$H$5,MATCH(S263,referentes!$H$2:$H$5,0),1))","v":""},null,null,{"$f":"IF(T263=\"\",\"\",VLOOKUP(T263,referentes!$Q$2:$X$209,2,FALSE))","v":""},null,null,null,null,"",null,null,null,"",null,null,{"$f":"IF(AF263<>\"\",VLOOKUP(AF263,'Otras referencias'!$H$19:$I$20,2,FALSE),\"\")","v":""},null,{"$f":"IF(AH263<>\"\",VLOOKUP(AH263,'Otras referencias'!$H$19:$I$20,2,FALSE),\"\")","v":""},null,{"$f":"IF(AJ263<>\"\",VLOOKUP(AJ263,'Otras referencias'!$H$19:$I$20,2,FALSE),\"\")","v":""},null,{"$f":"IF(AL263<>\"\",VLOOKUP(AL263,'Otras referencias'!$H$19:$I$20,2,FALSE),\"\")","v":""}]
[null,{"$f":"IF(C264=\"\",\"\",IF(COUNTIF($C$3:C264, C264)>1, \"\", C264))","v":""},{"$f":"IF(J264=\"\",\"\",CONCATENATE(DIGITADOR!$M$1,J264,E264))","v":""},"",{"$f":"IF(H264=\"\",\"\",VLOOKUP(H264,'Otras referencias'!$A$24:$E$48,2,FALSE))","v":""},null,null,null,{"$f":"IF(H264=\"\",\"\",VLOOKUP(H264,'Otras referencias'!$A$24:$E$48,5,FALSE))","v":""},null,null,null,null,null,null,"",{"$f":"IF(AND(P264<>\"\",O264<>\"\"),IF(N264=\"A\",VLOOKUP(P264,'Otras referencias'!$J$24:$K$35,2,FALSE),IF(N264=\"B\",VLOOKUP(P264,'Otras referencias'!$N$24:$O$35,2,),IF(N264=\"C\",VLOOKUP(P264,'Otras referencias'!$R$24:$S$35,2,FALSE)))),\"\")","v":""},{"$f":"IF(S264=\"\",\"\",INDEX(referentes!$G$2:$H$5,MATCH(S264,referentes!$H$2:$H$5,0),1))","v":""},null,null,{"$f":"IF(T264=\"\",\"\",VLOOKUP(T264,referentes!$Q$2:$X$209,2,FALSE))","v":""},null,null,null,null,"",null,null,null,"",null,null,{"$f":"IF(AF264<>\"\",VLOOKUP(AF264,'Otras referencias'!$H$19:$I$20,2,FALSE),\"\")","v":""},null,{"$f":"IF(AH264<>\"\",VLOOKUP(AH264,'Otras referencias'!$H$19:$I$20,2,FALSE),\"\")","v":""},null,{"$f":"IF(AJ264<>\"\",VLOOKUP(AJ264,'Otras referencias'!$H$19:$I$20,2,FALSE),\"\")","v":""},null,{"$f":"IF(AL264<>\"\",VLOOKUP(AL264,'Otras referencias'!$H$19:$I$20,2,FALSE),\"\")","v":""}]
[null,{"$f":"IF(C265=\"\",\"\",IF(COUNTIF($C$3:C265, C265)>1, \"\", C265))","v":""},{"$f":"IF(J265=\"\",\"\",CONCATENATE(DIGITADOR!$M$1,J265,E265))","v":""},"",{"$f":"IF(H265=\"\",\"\",VLOOKUP(H265,'Otras referencias'!$A$24:$E$48,2,FALSE))","v":""},null,null,null,{"$f":"IF(H265=\"\",\"\",VLOOKUP(H265,'Otras referencias'!$A$24:$E$48,5,FALSE))","v":""},null,null,null,null,null,null,"",{"$f":"IF(AND(P265<>\"\",O265<>\"\"),IF(N265=\"A\",VLOOKUP(P265,'Otras referencias'!$J$24:$K$35,2,FALSE),IF(N265=\"B\",VLOOKUP(P265,'Otras referencias'!$N$24:$O$35,2,),IF(N265=\"C\",VLOOKUP(P265,'Otras referencias'!$R$24:$S$35,2,FALSE)))),\"\")","v":""},{"$f":"IF(S265=\"\",\"\",INDEX(referentes!$G$2:$H$5,MATCH(S265,referentes!$H$2:$H$5,0),1))","v":""},null,null,{"$f":"IF(T265=\"\",\"\",VLOOKUP(T265,referentes!$Q$2:$X$209,2,FALSE))","v":""},null,null,null,null,"",null,null,null,"",null,null,{"$f":"IF(AF265<>\"\",VLOOKUP(AF265,'Otras referencias'!$H$19:$I$20,2,FALSE),\"\")","v":""},null,{"$f":"IF(AH265<>\"\",VLOOKUP(AH265,'Otras referencias'!$H$19:$I$20,2,FALSE),\"\")","v":""},null,{"$f":"IF(AJ265<>\"\",VLOOKUP(AJ265,'Otras referencias'!$H$19:$I$20,2,FALSE),\"\")","v":""},null,{"$f":"IF(AL265<>\"\",VLOOKUP(AL265,'Otras referencias'!$H$19:$I$20,2,FALSE),\"\")","v":""}]
[null,{"$f":"IF(C266=\"\",\"\",IF(COUNTIF($C$3:C266, C266)>1, \"\", C266))","v":""},{"$f":"IF(J266=\"\",\"\",CONCATENATE(DIGITADOR!$M$1,J266,E266))","v":""},"",{"$f":"IF(H266=\"\",\"\",VLOOKUP(H266,'Otras referencias'!$A$24:$E$48,2,FALSE))","v":""},null,null,null,{"$f":"IF(H266=\"\",\"\",VLOOKUP(H266,'Otras referencias'!$A$24:$E$48,5,FALSE))","v":""},null,null,null,null,null,null,"",{"$f":"IF(AND(P266<>\"\",O266<>\"\"),IF(N266=\"A\",VLOOKUP(P266,'Otras referencias'!$J$24:$K$35,2,FALSE),IF(N266=\"B\",VLOOKUP(P266,'Otras referencias'!$N$24:$O$35,2,),IF(N266=\"C\",VLOOKUP(P266,'Otras referencias'!$R$24:$S$35,2,FALSE)))),\"\")","v":""},{"$f":"IF(S266=\"\",\"\",INDEX(referentes!$G$2:$H$5,MATCH(S266,referentes!$H$2:$H$5,0),1))","v":""},null,null,{"$f":"IF(T266=\"\",\"\",VLOOKUP(T266,referentes!$Q$2:$X$209,2,FALSE))","v":""},null,null,null,null,"",null,null,null,"",null,null,{"$f":"IF(AF266<>\"\",VLOOKUP(AF266,'Otras referencias'!$H$19:$I$20,2,FALSE),\"\")","v":""},null,{"$f":"IF(AH266<>\"\",VLOOKUP(AH266,'Otras referencias'!$H$19:$I$20,2,FALSE),\"\")","v":""},null,{"$f":"IF(AJ266<>\"\",VLOOKUP(AJ266,'Otras referencias'!$H$19:$I$20,2,FALSE),\"\")","v":""},null,{"$f":"IF(AL266<>\"\",VLOOKUP(AL266,'Otras referencias'!$H$19:$I$20,2,FALSE),\"\")","v":""}]
[null,{"$f":"IF(C267=\"\",\"\",IF(COUNTIF($C$3:C267, C267)>1, \"\", C267))","v":""},{"$f":"IF(J267=\"\",\"\",CONCATENATE(DIGITADOR!$M$1,J267,E267))","v":""},"",{"$f":"IF(H267=\"\",\"\",VLOOKUP(H267,'Otras referencias'!$A$24:$E$48,2,FALSE))","v":""},null,null,null,{"$f":"IF(H267=\"\",\"\",VLOOKUP(H267,'Otras referencias'!$A$24:$E$48,5,FALSE))","v":""},null,null,null,null,null,null,"",{"$f":"IF(AND(P267<>\"\",O267<>\"\"),IF(N267=\"A\",VLOOKUP(P267,'Otras referencias'!$J$24:$K$35,2,FALSE),IF(N267=\"B\",VLOOKUP(P267,'Otras referencias'!$N$24:$O$35,2,),IF(N267=\"C\",VLOOKUP(P267,'Otras referencias'!$R$24:$S$35,2,FALSE)))),\"\")","v":""},{"$f":"IF(S267=\"\",\"\",INDEX(referentes!$G$2:$H$5,MATCH(S267,referentes!$H$2:$H$5,0),1))","v":""},null,null,{"$f":"IF(T267=\"\",\"\",VLOOKUP(T267,referentes!$Q$2:$X$209,2,FALSE))","v":""},null,null,null,null,"",null,null,null,"",null,null,{"$f":"IF(AF267<>\"\",VLOOKUP(AF267,'Otras referencias'!$H$19:$I$20,2,FALSE),\"\")","v":""},null,{"$f":"IF(AH267<>\"\",VLOOKUP(AH267,'Otras referencias'!$H$19:$I$20,2,FALSE),\"\")","v":""},null,{"$f":"IF(AJ267<>\"\",VLOOKUP(AJ267,'Otras referencias'!$H$19:$I$20,2,FALSE),\"\")","v":""},null,{"$f":"IF(AL267<>\"\",VLOOKUP(AL267,'Otras referencias'!$H$19:$I$20,2,FALSE),\"\")","v":""}]
[null,{"$f":"IF(C268=\"\",\"\",IF(COUNTIF($C$3:C268, C268)>1, \"\", C268))","v":""},{"$f":"IF(J268=\"\",\"\",CONCATENATE(DIGITADOR!$M$1,J268,E268))","v":""},"",{"$f":"IF(H268=\"\",\"\",VLOOKUP(H268,'Otras referencias'!$A$24:$E$48,2,FALSE))","v":""},null,null,null,{"$f":"IF(H268=\"\",\"\",VLOOKUP(H268,'Otras referencias'!$A$24:$E$48,5,FALSE))","v":""},null,null,null,null,null,null,"",{"$f":"IF(AND(P268<>\"\",O268<>\"\"),IF(N268=\"A\",VLOOKUP(P268,'Otras referencias'!$J$24:$K$35,2,FALSE),IF(N268=\"B\",VLOOKUP(P268,'Otras referencias'!$N$24:$O$35,2,),IF(N268=\"C\",VLOOKUP(P268,'Otras referencias'!$R$24:$S$35,2,FALSE)))),\"\")","v":""},{"$f":"IF(S268=\"\",\"\",INDEX(referentes!$G$2:$H$5,MATCH(S268,referentes!$H$2:$H$5,0),1))","v":""},null,null,{"$f":"IF(T268=\"\",\"\",VLOOKUP(T268,referentes!$Q$2:$X$209,2,FALSE))","v":""},null,null,null,null,"",null,null,null,"",null,null,{"$f":"IF(AF268<>\"\",VLOOKUP(AF268,'Otras referencias'!$H$19:$I$20,2,FALSE),\"\")","v":""},null,{"$f":"IF(AH268<>\"\",VLOOKUP(AH268,'Otras referencias'!$H$19:$I$20,2,FALSE),\"\")","v":""},null,{"$f":"IF(AJ268<>\"\",VLOOKUP(AJ268,'Otras referencias'!$H$19:$I$20,2,FALSE),\"\")","v":""},null,{"$f":"IF(AL268<>\"\",VLOOKUP(AL268,'Otras referencias'!$H$19:$I$20,2,FALSE),\"\")","v":""}]
[null,{"$f":"IF(C269=\"\",\"\",IF(COUNTIF($C$3:C269, C269)>1, \"\", C269))","v":""},{"$f":"IF(J269=\"\",\"\",CONCATENATE(DIGITADOR!$M$1,J269,E269))","v":""},"",{"$f":"IF(H269=\"\",\"\",VLOOKUP(H269,'Otras referencias'!$A$24:$E$48,2,FALSE))","v":""},null,null,null,{"$f":"IF(H269=\"\",\"\",VLOOKUP(H269,'Otras referencias'!$A$24:$E$48,5,FALSE))","v":""},null,null,null,null,null,null,"",{"$f":"IF(AND(P269<>\"\",O269<>\"\"),IF(N269=\"A\",VLOOKUP(P269,'Otras referencias'!$J$24:$K$35,2,FALSE),IF(N269=\"B\",VLOOKUP(P269,'Otras referencias'!$N$24:$O$35,2,),IF(N269=\"C\",VLOOKUP(P269,'Otras referencias'!$R$24:$S$35,2,FALSE)))),\"\")","v":""},{"$f":"IF(S269=\"\",\"\",INDEX(referentes!$G$2:$H$5,MATCH(S269,referentes!$H$2:$H$5,0),1))","v":""},null,null,{"$f":"IF(T269=\"\",\"\",VLOOKUP(T269,referentes!$Q$2:$X$209,2,FALSE))","v":""},null,null,null,null,"",null,null,null,"",null,null,{"$f":"IF(AF269<>\"\",VLOOKUP(AF269,'Otras referencias'!$H$19:$I$20,2,FALSE),\"\")","v":""},null,{"$f":"IF(AH269<>\"\",VLOOKUP(AH269,'Otras referencias'!$H$19:$I$20,2,FALSE),\"\")","v":""},null,{"$f":"IF(AJ269<>\"\",VLOOKUP(AJ269,'Otras referencias'!$H$19:$I$20,2,FALSE),\"\")","v":""},null,{"$f":"IF(AL269<>\"\",VLOOKUP(AL269,'Otras referencias'!$H$19:$I$20,2,FALSE),\"\")","v":""}]
[null,{"$f":"IF(C270=\"\",\"\",IF(COUNTIF($C$3:C270, C270)>1, \"\", C270))","v":""},{"$f":"IF(J270=\"\",\"\",CONCATENATE(DIGITADOR!$M$1,J270,E270))","v":""},"",{"$f":"IF(H270=\"\",\"\",VLOOKUP(H270,'Otras referencias'!$A$24:$E$48,2,FALSE))","v":""},null,null,null,{"$f":"IF(H270=\"\",\"\",VLOOKUP(H270,'Otras referencias'!$A$24:$E$48,5,FALSE))","v":""},null,null,null,null,null,null,"",{"$f":"IF(AND(P270<>\"\",O270<>\"\"),IF(N270=\"A\",VLOOKUP(P270,'Otras referencias'!$J$24:$K$35,2,FALSE),IF(N270=\"B\",VLOOKUP(P270,'Otras referencias'!$N$24:$O$35,2,),IF(N270=\"C\",VLOOKUP(P270,'Otras referencias'!$R$24:$S$35,2,FALSE)))),\"\")","v":""},{"$f":"IF(S270=\"\",\"\",INDEX(referentes!$G$2:$H$5,MATCH(S270,referentes!$H$2:$H$5,0),1))","v":""},null,null,{"$f":"IF(T270=\"\",\"\",VLOOKUP(T270,referentes!$Q$2:$X$209,2,FALSE))","v":""},null,null,null,null,"",null,null,null,"",null,null,{"$f":"IF(AF270<>\"\",VLOOKUP(AF270,'Otras referencias'!$H$19:$I$20,2,FALSE),\"\")","v":""},null,{"$f":"IF(AH270<>\"\",VLOOKUP(AH270,'Otras referencias'!$H$19:$I$20,2,FALSE),\"\")","v":""},null,{"$f":"IF(AJ270<>\"\",VLOOKUP(AJ270,'Otras referencias'!$H$19:$I$20,2,FALSE),\"\")","v":""},null,{"$f":"IF(AL270<>\"\",VLOOKUP(AL270,'Otras referencias'!$H$19:$I$20,2,FALSE),\"\")","v":""}]
[null,{"$f":"IF(C271=\"\",\"\",IF(COUNTIF($C$3:C271, C271)>1, \"\", C271))","v":""},{"$f":"IF(J271=\"\",\"\",CONCATENATE(DIGITADOR!$M$1,J271,E271))","v":""},"",{"$f":"IF(H271=\"\",\"\",VLOOKUP(H271,'Otras referencias'!$A$24:$E$48,2,FALSE))","v":""},null,null,null,{"$f":"IF(H271=\"\",\"\",VLOOKUP(H271,'Otras referencias'!$A$24:$E$48,5,FALSE))","v":""},null,null,null,null,null,null,"",{"$f":"IF(AND(P271<>\"\",O271<>\"\"),IF(N271=\"A\",VLOOKUP(P271,'Otras referencias'!$J$24:$K$35,2,FALSE),IF(N271=\"B\",VLOOKUP(P271,'Otras referencias'!$N$24:$O$35,2,),IF(N271=\"C\",VLOOKUP(P271,'Otras referencias'!$R$24:$S$35,2,FALSE)))),\"\")","v":""},{"$f":"IF(S271=\"\",\"\",INDEX(referentes!$G$2:$H$5,MATCH(S271,referentes!$H$2:$H$5,0),1))","v":""},null,null,{"$f":"IF(T271=\"\",\"\",VLOOKUP(T271,referentes!$Q$2:$X$209,2,FALSE))","v":""},null,null,null,null,"",null,null,null,"",null,null,{"$f":"IF(AF271<>\"\",VLOOKUP(AF271,'Otras referencias'!$H$19:$I$20,2,FALSE),\"\")","v":""},null,{"$f":"IF(AH271<>\"\",VLOOKUP(AH271,'Otras referencias'!$H$19:$I$20,2,FALSE),\"\")","v":""},null,{"$f":"IF(AJ271<>\"\",VLOOKUP(AJ271,'Otras referencias'!$H$19:$I$20,2,FALSE),\"\")","v":""},null,{"$f":"IF(AL271<>\"\",VLOOKUP(AL271,'Otras referencias'!$H$19:$I$20,2,FALSE),\"\")","v":""}]
[null,{"$f":"IF(C272=\"\",\"\",IF(COUNTIF($C$3:C272, C272)>1, \"\", C272))","v":""},{"$f":"IF(J272=\"\",\"\",CONCATENATE(DIGITADOR!$M$1,J272,E272))","v":""},"",{"$f":"IF(H272=\"\",\"\",VLOOKUP(H272,'Otras referencias'!$A$24:$E$48,2,FALSE))","v":""},null,null,null,{"$f":"IF(H272=\"\",\"\",VLOOKUP(H272,'Otras referencias'!$A$24:$E$48,5,FALSE))","v":""},null,null,null,null,null,null,"",{"$f":"IF(AND(P272<>\"\",O272<>\"\"),IF(N272=\"A\",VLOOKUP(P272,'Otras referencias'!$J$24:$K$35,2,FALSE),IF(N272=\"B\",VLOOKUP(P272,'Otras referencias'!$N$24:$O$35,2,),IF(N272=\"C\",VLOOKUP(P272,'Otras referencias'!$R$24:$S$35,2,FALSE)))),\"\")","v":""},{"$f":"IF(S272=\"\",\"\",INDEX(referentes!$G$2:$H$5,MATCH(S272,referentes!$H$2:$H$5,0),1))","v":""},null,null,{"$f":"IF(T272=\"\",\"\",VLOOKUP(T272,referentes!$Q$2:$X$209,2,FALSE))","v":""},null,null,null,null,"",null,null,null,"",null,null,{"$f":"IF(AF272<>\"\",VLOOKUP(AF272,'Otras referencias'!$H$19:$I$20,2,FALSE),\"\")","v":""},null,{"$f":"IF(AH272<>\"\",VLOOKUP(AH272,'Otras referencias'!$H$19:$I$20,2,FALSE),\"\")","v":""},null,{"$f":"IF(AJ272<>\"\",VLOOKUP(AJ272,'Otras referencias'!$H$19:$I$20,2,FALSE),\"\")","v":""},null,{"$f":"IF(AL272<>\"\",VLOOKUP(AL272,'Otras referencias'!$H$19:$I$20,2,FALSE),\"\")","v":""}]
[null,{"$f":"IF(C273=\"\",\"\",IF(COUNTIF($C$3:C273, C273)>1, \"\", C273))","v":""},{"$f":"IF(J273=\"\",\"\",CONCATENATE(DIGITADOR!$M$1,J273,E273))","v":""},"",{"$f":"IF(H273=\"\",\"\",VLOOKUP(H273,'Otras referencias'!$A$24:$E$48,2,FALSE))","v":""},null,null,null,{"$f":"IF(H273=\"\",\"\",VLOOKUP(H273,'Otras referencias'!$A$24:$E$48,5,FALSE))","v":""},null,null,null,null,null,null,"",{"$f":"IF(AND(P273<>\"\",O273<>\"\"),IF(N273=\"A\",VLOOKUP(P273,'Otras referencias'!$J$24:$K$35,2,FALSE),IF(N273=\"B\",VLOOKUP(P273,'Otras referencias'!$N$24:$O$35,2,),IF(N273=\"C\",VLOOKUP(P273,'Otras referencias'!$R$24:$S$35,2,FALSE)))),\"\")","v":""},{"$f":"IF(S273=\"\",\"\",INDEX(referentes!$G$2:$H$5,MATCH(S273,referentes!$H$2:$H$5,0),1))","v":""},null,null,{"$f":"IF(T273=\"\",\"\",VLOOKUP(T273,referentes!$Q$2:$X$209,2,FALSE))","v":""},null,null,null,null,"",null,null,null,"",null,null,{"$f":"IF(AF273<>\"\",VLOOKUP(AF273,'Otras referencias'!$H$19:$I$20,2,FALSE),\"\")","v":""},null,{"$f":"IF(AH273<>\"\",VLOOKUP(AH273,'Otras referencias'!$H$19:$I$20,2,FALSE),\"\")","v":""},null,{"$f":"IF(AJ273<>\"\",VLOOKUP(AJ273,'Otras referencias'!$H$19:$I$20,2,FALSE),\"\")","v":""},null,{"$f":"IF(AL273<>\"\",VLOOKUP(AL273,'Otras referencias'!$H$19:$I$20,2,FALSE),\"\")","v":""}]
[null,{"$f":"IF(C274=\"\",\"\",IF(COUNTIF($C$3:C274, C274)>1, \"\", C274))","v":""},{"$f":"IF(J274=\"\",\"\",CONCATENATE(DIGITADOR!$M$1,J274,E274))","v":""},"",{"$f":"IF(H274=\"\",\"\",VLOOKUP(H274,'Otras referencias'!$A$24:$E$48,2,FALSE))","v":""},null,null,null,{"$f":"IF(H274=\"\",\"\",VLOOKUP(H274,'Otras referencias'!$A$24:$E$48,5,FALSE))","v":""},null,null,null,null,null,null,"",{"$f":"IF(AND(P274<>\"\",O274<>\"\"),IF(N274=\"A\",VLOOKUP(P274,'Otras referencias'!$J$24:$K$35,2,FALSE),IF(N274=\"B\",VLOOKUP(P274,'Otras referencias'!$N$24:$O$35,2,),IF(N274=\"C\",VLOOKUP(P274,'Otras referencias'!$R$24:$S$35,2,FALSE)))),\"\")","v":""},{"$f":"IF(S274=\"\",\"\",INDEX(referentes!$G$2:$H$5,MATCH(S274,referentes!$H$2:$H$5,0),1))","v":""},null,null,{"$f":"IF(T274=\"\",\"\",VLOOKUP(T274,referentes!$Q$2:$X$209,2,FALSE))","v":""},null,null,null,null,"",null,null,null,"",null,null,{"$f":"IF(AF274<>\"\",VLOOKUP(AF274,'Otras referencias'!$H$19:$I$20,2,FALSE),\"\")","v":""},null,{"$f":"IF(AH274<>\"\",VLOOKUP(AH274,'Otras referencias'!$H$19:$I$20,2,FALSE),\"\")","v":""},null,{"$f":"IF(AJ274<>\"\",VLOOKUP(AJ274,'Otras referencias'!$H$19:$I$20,2,FALSE),\"\")","v":""},null,{"$f":"IF(AL274<>\"\",VLOOKUP(AL274,'Otras referencias'!$H$19:$I$20,2,FALSE),\"\")","v":""}]
[null,{"$f":"IF(C275=\"\",\"\",IF(COUNTIF($C$3:C275, C275)>1, \"\", C275))","v":""},{"$f":"IF(J275=\"\",\"\",CONCATENATE(DIGITADOR!$M$1,J275,E275))","v":""},"",{"$f":"IF(H275=\"\",\"\",VLOOKUP(H275,'Otras referencias'!$A$24:$E$48,2,FALSE))","v":""},null,null,null,{"$f":"IF(H275=\"\",\"\",VLOOKUP(H275,'Otras referencias'!$A$24:$E$48,5,FALSE))","v":""},null,null,null,null,null,null,"",{"$f":"IF(AND(P275<>\"\",O275<>\"\"),IF(N275=\"A\",VLOOKUP(P275,'Otras referencias'!$J$24:$K$35,2,FALSE),IF(N275=\"B\",VLOOKUP(P275,'Otras referencias'!$N$24:$O$35,2,),IF(N275=\"C\",VLOOKUP(P275,'Otras referencias'!$R$24:$S$35,2,FALSE)))),\"\")","v":""},{"$f":"IF(S275=\"\",\"\",INDEX(referentes!$G$2:$H$5,MATCH(S275,referentes!$H$2:$H$5,0),1))","v":""},null,null,{"$f":"IF(T275=\"\",\"\",VLOOKUP(T275,referentes!$Q$2:$X$209,2,FALSE))","v":""},null,null,null,null,"",null,null,null,"",null,null,{"$f":"IF(AF275<>\"\",VLOOKUP(AF275,'Otras referencias'!$H$19:$I$20,2,FALSE),\"\")","v":""},null,{"$f":"IF(AH275<>\"\",VLOOKUP(AH275,'Otras referencias'!$H$19:$I$20,2,FALSE),\"\")","v":""},null,{"$f":"IF(AJ275<>\"\",VLOOKUP(AJ275,'Otras referencias'!$H$19:$I$20,2,FALSE),\"\")","v":""},null,{"$f":"IF(AL275<>\"\",VLOOKUP(AL275,'Otras referencias'!$H$19:$I$20,2,FALSE),\"\")","v":""}]
[null,{"$f":"IF(C276=\"\",\"\",IF(COUNTIF($C$3:C276, C276)>1, \"\", C276))","v":""},{"$f":"IF(J276=\"\",\"\",CONCATENATE(DIGITADOR!$M$1,J276,E276))","v":""},"",{"$f":"IF(H276=\"\",\"\",VLOOKUP(H276,'Otras referencias'!$A$24:$E$48,2,FALSE))","v":""},null,null,null,{"$f":"IF(H276=\"\",\"\",VLOOKUP(H276,'Otras referencias'!$A$24:$E$48,5,FALSE))","v":""},null,null,null,null,null,null,"",{"$f":"IF(AND(P276<>\"\",O276<>\"\"),IF(N276=\"A\",VLOOKUP(P276,'Otras referencias'!$J$24:$K$35,2,FALSE),IF(N276=\"B\",VLOOKUP(P276,'Otras referencias'!$N$24:$O$35,2,),IF(N276=\"C\",VLOOKUP(P276,'Otras referencias'!$R$24:$S$35,2,FALSE)))),\"\")","v":""},{"$f":"IF(S276=\"\",\"\",INDEX(referentes!$G$2:$H$5,MATCH(S276,referentes!$H$2:$H$5,0),1))","v":""},null,null,{"$f":"IF(T276=\"\",\"\",VLOOKUP(T276,referentes!$Q$2:$X$209,2,FALSE))","v":""},null,null,null,null,"",null,null,null,"",null,null,{"$f":"IF(AF276<>\"\",VLOOKUP(AF276,'Otras referencias'!$H$19:$I$20,2,FALSE),\"\")","v":""},null,{"$f":"IF(AH276<>\"\",VLOOKUP(AH276,'Otras referencias'!$H$19:$I$20,2,FALSE),\"\")","v":""},null,{"$f":"IF(AJ276<>\"\",VLOOKUP(AJ276,'Otras referencias'!$H$19:$I$20,2,FALSE),\"\")","v":""},null,{"$f":"IF(AL276<>\"\",VLOOKUP(AL276,'Otras referencias'!$H$19:$I$20,2,FALSE),\"\")","v":""}]
[null,{"$f":"IF(C277=\"\",\"\",IF(COUNTIF($C$3:C277, C277)>1, \"\", C277))","v":""},{"$f":"IF(J277=\"\",\"\",CONCATENATE(DIGITADOR!$M$1,J277,E277))","v":""},"",{"$f":"IF(H277=\"\",\"\",VLOOKUP(H277,'Otras referencias'!$A$24:$E$48,2,FALSE))","v":""},null,null,null,{"$f":"IF(H277=\"\",\"\",VLOOKUP(H277,'Otras referencias'!$A$24:$E$48,5,FALSE))","v":""},null,null,null,null,null,null,"",{"$f":"IF(AND(P277<>\"\",O277<>\"\"),IF(N277=\"A\",VLOOKUP(P277,'Otras referencias'!$J$24:$K$35,2,FALSE),IF(N277=\"B\",VLOOKUP(P277,'Otras referencias'!$N$24:$O$35,2,),IF(N277=\"C\",VLOOKUP(P277,'Otras referencias'!$R$24:$S$35,2,FALSE)))),\"\")","v":""},{"$f":"IF(S277=\"\",\"\",INDEX(referentes!$G$2:$H$5,MATCH(S277,referentes!$H$2:$H$5,0),1))","v":""},null,null,{"$f":"IF(T277=\"\",\"\",VLOOKUP(T277,referentes!$Q$2:$X$209,2,FALSE))","v":""},null,null,null,null,"",null,null,null,"",null,null,{"$f":"IF(AF277<>\"\",VLOOKUP(AF277,'Otras referencias'!$H$19:$I$20,2,FALSE),\"\")","v":""},null,{"$f":"IF(AH277<>\"\",VLOOKUP(AH277,'Otras referencias'!$H$19:$I$20,2,FALSE),\"\")","v":""},null,{"$f":"IF(AJ277<>\"\",VLOOKUP(AJ277,'Otras referencias'!$H$19:$I$20,2,FALSE),\"\")","v":""},null,{"$f":"IF(AL277<>\"\",VLOOKUP(AL277,'Otras referencias'!$H$19:$I$20,2,FALSE),\"\")","v":""}]
[null,{"$f":"IF(C278=\"\",\"\",IF(COUNTIF($C$3:C278, C278)>1, \"\", C278))","v":""},{"$f":"IF(J278=\"\",\"\",CONCATENATE(DIGITADOR!$M$1,J278,E278))","v":""},"",{"$f":"IF(H278=\"\",\"\",VLOOKUP(H278,'Otras referencias'!$A$24:$E$48,2,FALSE))","v":""},null,null,null,{"$f":"IF(H278=\"\",\"\",VLOOKUP(H278,'Otras referencias'!$A$24:$E$48,5,FALSE))","v":""},null,null,null,null,null,null,"",{"$f":"IF(AND(P278<>\"\",O278<>\"\"),IF(N278=\"A\",VLOOKUP(P278,'Otras referencias'!$J$24:$K$35,2,FALSE),IF(N278=\"B\",VLOOKUP(P278,'Otras referencias'!$N$24:$O$35,2,),IF(N278=\"C\",VLOOKUP(P278,'Otras referencias'!$R$24:$S$35,2,FALSE)))),\"\")","v":""},{"$f":"IF(S278=\"\",\"\",INDEX(referentes!$G$2:$H$5,MATCH(S278,referentes!$H$2:$H$5,0),1))","v":""},null,null,{"$f":"IF(T278=\"\",\"\",VLOOKUP(T278,referentes!$Q$2:$X$209,2,FALSE))","v":""},null,null,null,null,"",null,null,null,"",null,null,{"$f":"IF(AF278<>\"\",VLOOKUP(AF278,'Otras referencias'!$H$19:$I$20,2,FALSE),\"\")","v":""},null,{"$f":"IF(AH278<>\"\",VLOOKUP(AH278,'Otras referencias'!$H$19:$I$20,2,FALSE),\"\")","v":""},null,{"$f":"IF(AJ278<>\"\",VLOOKUP(AJ278,'Otras referencias'!$H$19:$I$20,2,FALSE),\"\")","v":""},null,{"$f":"IF(AL278<>\"\",VLOOKUP(AL278,'Otras referencias'!$H$19:$I$20,2,FALSE),\"\")","v":""}]
[null,{"$f":"IF(C279=\"\",\"\",IF(COUNTIF($C$3:C279, C279)>1, \"\", C279))","v":""},{"$f":"IF(J279=\"\",\"\",CONCATENATE(DIGITADOR!$M$1,J279,E279))","v":""},"",{"$f":"IF(H279=\"\",\"\",VLOOKUP(H279,'Otras referencias'!$A$24:$E$48,2,FALSE))","v":""},null,null,null,{"$f":"IF(H279=\"\",\"\",VLOOKUP(H279,'Otras referencias'!$A$24:$E$48,5,FALSE))","v":""},null,null,null,null,null,null,"",{"$f":"IF(AND(P279<>\"\",O279<>\"\"),IF(N279=\"A\",VLOOKUP(P279,'Otras referencias'!$J$24:$K$35,2,FALSE),IF(N279=\"B\",VLOOKUP(P279,'Otras referencias'!$N$24:$O$35,2,),IF(N279=\"C\",VLOOKUP(P279,'Otras referencias'!$R$24:$S$35,2,FALSE)))),\"\")","v":""},{"$f":"IF(S279=\"\",\"\",INDEX(referentes!$G$2:$H$5,MATCH(S279,referentes!$H$2:$H$5,0),1))","v":""},null,null,{"$f":"IF(T279=\"\",\"\",VLOOKUP(T279,referentes!$Q$2:$X$209,2,FALSE))","v":""},null,null,null,null,"",null,null,null,"",null,null,{"$f":"IF(AF279<>\"\",VLOOKUP(AF279,'Otras referencias'!$H$19:$I$20,2,FALSE),\"\")","v":""},null,{"$f":"IF(AH279<>\"\",VLOOKUP(AH279,'Otras referencias'!$H$19:$I$20,2,FALSE),\"\")","v":""},null,{"$f":"IF(AJ279<>\"\",VLOOKUP(AJ279,'Otras referencias'!$H$19:$I$20,2,FALSE),\"\")","v":""},null,{"$f":"IF(AL279<>\"\",VLOOKUP(AL279,'Otras referencias'!$H$19:$I$20,2,FALSE),\"\")","v":""}]
[null,{"$f":"IF(C280=\"\",\"\",IF(COUNTIF($C$3:C280, C280)>1, \"\", C280))","v":""},{"$f":"IF(J280=\"\",\"\",CONCATENATE(DIGITADOR!$M$1,J280,E280))","v":""},"",{"$f":"IF(H280=\"\",\"\",VLOOKUP(H280,'Otras referencias'!$A$24:$E$48,2,FALSE))","v":""},null,null,null,{"$f":"IF(H280=\"\",\"\",VLOOKUP(H280,'Otras referencias'!$A$24:$E$48,5,FALSE))","v":""},null,null,null,null,null,null,"",{"$f":"IF(AND(P280<>\"\",O280<>\"\"),IF(N280=\"A\",VLOOKUP(P280,'Otras referencias'!$J$24:$K$35,2,FALSE),IF(N280=\"B\",VLOOKUP(P280,'Otras referencias'!$N$24:$O$35,2,),IF(N280=\"C\",VLOOKUP(P280,'Otras referencias'!$R$24:$S$35,2,FALSE)))),\"\")","v":""},{"$f":"IF(S280=\"\",\"\",INDEX(referentes!$G$2:$H$5,MATCH(S280,referentes!$H$2:$H$5,0),1))","v":""},null,null,{"$f":"IF(T280=\"\",\"\",VLOOKUP(T280,referentes!$Q$2:$X$209,2,FALSE))","v":""},null,null,null,null,"",null,null,null,"",null,null,{"$f":"IF(AF280<>\"\",VLOOKUP(AF280,'Otras referencias'!$H$19:$I$20,2,FALSE),\"\")","v":""},null,{"$f":"IF(AH280<>\"\",VLOOKUP(AH280,'Otras referencias'!$H$19:$I$20,2,FALSE),\"\")","v":""},null,{"$f":"IF(AJ280<>\"\",VLOOKUP(AJ280,'Otras referencias'!$H$19:$I$20,2,FALSE),\"\")","v":""},null,{"$f":"IF(AL280<>\"\",VLOOKUP(AL280,'Otras referencias'!$H$19:$I$20,2,FALSE),\"\")","v":""}]
[null,{"$f":"IF(C281=\"\",\"\",IF(COUNTIF($C$3:C281, C281)>1, \"\", C281))","v":""},{"$f":"IF(J281=\"\",\"\",CONCATENATE(DIGITADOR!$M$1,J281,E281))","v":""},"",{"$f":"IF(H281=\"\",\"\",VLOOKUP(H281,'Otras referencias'!$A$24:$E$48,2,FALSE))","v":""},null,null,null,{"$f":"IF(H281=\"\",\"\",VLOOKUP(H281,'Otras referencias'!$A$24:$E$48,5,FALSE))","v":""},null,null,null,null,null,null,"",{"$f":"IF(AND(P281<>\"\",O281<>\"\"),IF(N281=\"A\",VLOOKUP(P281,'Otras referencias'!$J$24:$K$35,2,FALSE),IF(N281=\"B\",VLOOKUP(P281,'Otras referencias'!$N$24:$O$35,2,),IF(N281=\"C\",VLOOKUP(P281,'Otras referencias'!$R$24:$S$35,2,FALSE)))),\"\")","v":""},{"$f":"IF(S281=\"\",\"\",INDEX(referentes!$G$2:$H$5,MATCH(S281,referentes!$H$2:$H$5,0),1))","v":""},null,null,{"$f":"IF(T281=\"\",\"\",VLOOKUP(T281,referentes!$Q$2:$X$209,2,FALSE))","v":""},null,null,null,null,"",null,null,null,"",null,null,{"$f":"IF(AF281<>\"\",VLOOKUP(AF281,'Otras referencias'!$H$19:$I$20,2,FALSE),\"\")","v":""},null,{"$f":"IF(AH281<>\"\",VLOOKUP(AH281,'Otras referencias'!$H$19:$I$20,2,FALSE),\"\")","v":""},null,{"$f":"IF(AJ281<>\"\",VLOOKUP(AJ281,'Otras referencias'!$H$19:$I$20,2,FALSE),\"\")","v":""},null,{"$f":"IF(AL281<>\"\",VLOOKUP(AL281,'Otras referencias'!$H$19:$I$20,2,FALSE),\"\")","v":""}]
[null,{"$f":"IF(C282=\"\",\"\",IF(COUNTIF($C$3:C282, C282)>1, \"\", C282))","v":""},{"$f":"IF(J282=\"\",\"\",CONCATENATE(DIGITADOR!$M$1,J282,E282))","v":""},"",{"$f":"IF(H282=\"\",\"\",VLOOKUP(H282,'Otras referencias'!$A$24:$E$48,2,FALSE))","v":""},null,null,null,{"$f":"IF(H282=\"\",\"\",VLOOKUP(H282,'Otras referencias'!$A$24:$E$48,5,FALSE))","v":""},null,null,null,null,null,null,"",{"$f":"IF(AND(P282<>\"\",O282<>\"\"),IF(N282=\"A\",VLOOKUP(P282,'Otras referencias'!$J$24:$K$35,2,FALSE),IF(N282=\"B\",VLOOKUP(P282,'Otras referencias'!$N$24:$O$35,2,),IF(N282=\"C\",VLOOKUP(P282,'Otras referencias'!$R$24:$S$35,2,FALSE)))),\"\")","v":""},{"$f":"IF(S282=\"\",\"\",INDEX(referentes!$G$2:$H$5,MATCH(S282,referentes!$H$2:$H$5,0),1))","v":""},null,null,{"$f":"IF(T282=\"\",\"\",VLOOKUP(T282,referentes!$Q$2:$X$209,2,FALSE))","v":""},null,null,null,null,"",null,null,null,"",null,null,{"$f":"IF(AF282<>\"\",VLOOKUP(AF282,'Otras referencias'!$H$19:$I$20,2,FALSE),\"\")","v":""},null,{"$f":"IF(AH282<>\"\",VLOOKUP(AH282,'Otras referencias'!$H$19:$I$20,2,FALSE),\"\")","v":""},null,{"$f":"IF(AJ282<>\"\",VLOOKUP(AJ282,'Otras referencias'!$H$19:$I$20,2,FALSE),\"\")","v":""},null,{"$f":"IF(AL282<>\"\",VLOOKUP(AL282,'Otras referencias'!$H$19:$I$20,2,FALSE),\"\")","v":""}]
[null,{"$f":"IF(C283=\"\",\"\",IF(COUNTIF($C$3:C283, C283)>1, \"\", C283))","v":""},{"$f":"IF(J283=\"\",\"\",CONCATENATE(DIGITADOR!$M$1,J283,E283))","v":""},"",{"$f":"IF(H283=\"\",\"\",VLOOKUP(H283,'Otras referencias'!$A$24:$E$48,2,FALSE))","v":""},null,null,null,{"$f":"IF(H283=\"\",\"\",VLOOKUP(H283,'Otras referencias'!$A$24:$E$48,5,FALSE))","v":""},null,null,null,null,null,null,"",{"$f":"IF(AND(P283<>\"\",O283<>\"\"),IF(N283=\"A\",VLOOKUP(P283,'Otras referencias'!$J$24:$K$35,2,FALSE),IF(N283=\"B\",VLOOKUP(P283,'Otras referencias'!$N$24:$O$35,2,),IF(N283=\"C\",VLOOKUP(P283,'Otras referencias'!$R$24:$S$35,2,FALSE)))),\"\")","v":""},{"$f":"IF(S283=\"\",\"\",INDEX(referentes!$G$2:$H$5,MATCH(S283,referentes!$H$2:$H$5,0),1))","v":""},null,null,{"$f":"IF(T283=\"\",\"\",VLOOKUP(T283,referentes!$Q$2:$X$209,2,FALSE))","v":""},null,null,null,null,"",null,null,null,"",null,null,{"$f":"IF(AF283<>\"\",VLOOKUP(AF283,'Otras referencias'!$H$19:$I$20,2,FALSE),\"\")","v":""},null,{"$f":"IF(AH283<>\"\",VLOOKUP(AH283,'Otras referencias'!$H$19:$I$20,2,FALSE),\"\")","v":""},null,{"$f":"IF(AJ283<>\"\",VLOOKUP(AJ283,'Otras referencias'!$H$19:$I$20,2,FALSE),\"\")","v":""},null,{"$f":"IF(AL283<>\"\",VLOOKUP(AL283,'Otras referencias'!$H$19:$I$20,2,FALSE),\"\")","v":""}]
[null,{"$f":"IF(C284=\"\",\"\",IF(COUNTIF($C$3:C284, C284)>1, \"\", C284))","v":""},{"$f":"IF(J284=\"\",\"\",CONCATENATE(DIGITADOR!$M$1,J284,E284))","v":""},"",{"$f":"IF(H284=\"\",\"\",VLOOKUP(H284,'Otras referencias'!$A$24:$E$48,2,FALSE))","v":""},null,null,null,{"$f":"IF(H284=\"\",\"\",VLOOKUP(H284,'Otras referencias'!$A$24:$E$48,5,FALSE))","v":""},null,null,null,null,null,null,"",{"$f":"IF(AND(P284<>\"\",O284<>\"\"),IF(N284=\"A\",VLOOKUP(P284,'Otras referencias'!$J$24:$K$35,2,FALSE),IF(N284=\"B\",VLOOKUP(P284,'Otras referencias'!$N$24:$O$35,2,),IF(N284=\"C\",VLOOKUP(P284,'Otras referencias'!$R$24:$S$35,2,FALSE)))),\"\")","v":""},{"$f":"IF(S284=\"\",\"\",INDEX(referentes!$G$2:$H$5,MATCH(S284,referentes!$H$2:$H$5,0),1))","v":""},null,null,{"$f":"IF(T284=\"\",\"\",VLOOKUP(T284,referentes!$Q$2:$X$209,2,FALSE))","v":""},null,null,null,null,"",null,null,null,"",null,null,{"$f":"IF(AF284<>\"\",VLOOKUP(AF284,'Otras referencias'!$H$19:$I$20,2,FALSE),\"\")","v":""},null,{"$f":"IF(AH284<>\"\",VLOOKUP(AH284,'Otras referencias'!$H$19:$I$20,2,FALSE),\"\")","v":""},null,{"$f":"IF(AJ284<>\"\",VLOOKUP(AJ284,'Otras referencias'!$H$19:$I$20,2,FALSE),\"\")","v":""},null,{"$f":"IF(AL284<>\"\",VLOOKUP(AL284,'Otras referencias'!$H$19:$I$20,2,FALSE),\"\")","v":""}]
[null,{"$f":"IF(C285=\"\",\"\",IF(COUNTIF($C$3:C285, C285)>1, \"\", C285))","v":""},{"$f":"IF(J285=\"\",\"\",CONCATENATE(DIGITADOR!$M$1,J285,E285))","v":""},"",{"$f":"IF(H285=\"\",\"\",VLOOKUP(H285,'Otras referencias'!$A$24:$E$48,2,FALSE))","v":""},null,null,null,{"$f":"IF(H285=\"\",\"\",VLOOKUP(H285,'Otras referencias'!$A$24:$E$48,5,FALSE))","v":""},null,null,null,null,null,null,"",{"$f":"IF(AND(P285<>\"\",O285<>\"\"),IF(N285=\"A\",VLOOKUP(P285,'Otras referencias'!$J$24:$K$35,2,FALSE),IF(N285=\"B\",VLOOKUP(P285,'Otras referencias'!$N$24:$O$35,2,),IF(N285=\"C\",VLOOKUP(P285,'Otras referencias'!$R$24:$S$35,2,FALSE)))),\"\")","v":""},{"$f":"IF(S285=\"\",\"\",INDEX(referentes!$G$2:$H$5,MATCH(S285,referentes!$H$2:$H$5,0),1))","v":""},null,null,{"$f":"IF(T285=\"\",\"\",VLOOKUP(T285,referentes!$Q$2:$X$209,2,FALSE))","v":""},null,null,null,null,"",null,null,null,"",null,null,{"$f":"IF(AF285<>\"\",VLOOKUP(AF285,'Otras referencias'!$H$19:$I$20,2,FALSE),\"\")","v":""},null,{"$f":"IF(AH285<>\"\",VLOOKUP(AH285,'Otras referencias'!$H$19:$I$20,2,FALSE),\"\")","v":""},null,{"$f":"IF(AJ285<>\"\",VLOOKUP(AJ285,'Otras referencias'!$H$19:$I$20,2,FALSE),\"\")","v":""},null,{"$f":"IF(AL285<>\"\",VLOOKUP(AL285,'Otras referencias'!$H$19:$I$20,2,FALSE),\"\")","v":""}]
[null,{"$f":"IF(C286=\"\",\"\",IF(COUNTIF($C$3:C286, C286)>1, \"\", C286))","v":""},{"$f":"IF(J286=\"\",\"\",CONCATENATE(DIGITADOR!$M$1,J286,E286))","v":""},"",{"$f":"IF(H286=\"\",\"\",VLOOKUP(H286,'Otras referencias'!$A$24:$E$48,2,FALSE))","v":""},null,null,null,{"$f":"IF(H286=\"\",\"\",VLOOKUP(H286,'Otras referencias'!$A$24:$E$48,5,FALSE))","v":""},null,null,null,null,null,null,"",{"$f":"IF(AND(P286<>\"\",O286<>\"\"),IF(N286=\"A\",VLOOKUP(P286,'Otras referencias'!$J$24:$K$35,2,FALSE),IF(N286=\"B\",VLOOKUP(P286,'Otras referencias'!$N$24:$O$35,2,),IF(N286=\"C\",VLOOKUP(P286,'Otras referencias'!$R$24:$S$35,2,FALSE)))),\"\")","v":""},{"$f":"IF(S286=\"\",\"\",INDEX(referentes!$G$2:$H$5,MATCH(S286,referentes!$H$2:$H$5,0),1))","v":""},null,null,{"$f":"IF(T286=\"\",\"\",VLOOKUP(T286,referentes!$Q$2:$X$209,2,FALSE))","v":""},null,null,null,null,"",null,null,null,"",null,null,{"$f":"IF(AF286<>\"\",VLOOKUP(AF286,'Otras referencias'!$H$19:$I$20,2,FALSE),\"\")","v":""},null,{"$f":"IF(AH286<>\"\",VLOOKUP(AH286,'Otras referencias'!$H$19:$I$20,2,FALSE),\"\")","v":""},null,{"$f":"IF(AJ286<>\"\",VLOOKUP(AJ286,'Otras referencias'!$H$19:$I$20,2,FALSE),\"\")","v":""},null,{"$f":"IF(AL286<>\"\",VLOOKUP(AL286,'Otras referencias'!$H$19:$I$20,2,FALSE),\"\")","v":""}]
[null,{"$f":"IF(C287=\"\",\"\",IF(COUNTIF($C$3:C287, C287)>1, \"\", C287))","v":""},{"$f":"IF(J287=\"\",\"\",CONCATENATE(DIGITADOR!$M$1,J287,E287))","v":""},"",{"$f":"IF(H287=\"\",\"\",VLOOKUP(H287,'Otras referencias'!$A$24:$E$48,2,FALSE))","v":""},null,null,null,{"$f":"IF(H287=\"\",\"\",VLOOKUP(H287,'Otras referencias'!$A$24:$E$48,5,FALSE))","v":""},null,null,null,null,null,null,"",{"$f":"IF(AND(P287<>\"\",O287<>\"\"),IF(N287=\"A\",VLOOKUP(P287,'Otras referencias'!$J$24:$K$35,2,FALSE),IF(N287=\"B\",VLOOKUP(P287,'Otras referencias'!$N$24:$O$35,2,),IF(N287=\"C\",VLOOKUP(P287,'Otras referencias'!$R$24:$S$35,2,FALSE)))),\"\")","v":""},{"$f":"IF(S287=\"\",\"\",INDEX(referentes!$G$2:$H$5,MATCH(S287,referentes!$H$2:$H$5,0),1))","v":""},null,null,{"$f":"IF(T287=\"\",\"\",VLOOKUP(T287,referentes!$Q$2:$X$209,2,FALSE))","v":""},null,null,null,null,"",null,null,null,"",null,null,{"$f":"IF(AF287<>\"\",VLOOKUP(AF287,'Otras referencias'!$H$19:$I$20,2,FALSE),\"\")","v":""},null,{"$f":"IF(AH287<>\"\",VLOOKUP(AH287,'Otras referencias'!$H$19:$I$20,2,FALSE),\"\")","v":""},null,{"$f":"IF(AJ287<>\"\",VLOOKUP(AJ287,'Otras referencias'!$H$19:$I$20,2,FALSE),\"\")","v":""},null,{"$f":"IF(AL287<>\"\",VLOOKUP(AL287,'Otras referencias'!$H$19:$I$20,2,FALSE),\"\")","v":""}]
[null,{"$f":"IF(C288=\"\",\"\",IF(COUNTIF($C$3:C288, C288)>1, \"\", C288))","v":""},{"$f":"IF(J288=\"\",\"\",CONCATENATE(DIGITADOR!$M$1,J288,E288))","v":""},"",{"$f":"IF(H288=\"\",\"\",VLOOKUP(H288,'Otras referencias'!$A$24:$E$48,2,FALSE))","v":""},null,null,null,{"$f":"IF(H288=\"\",\"\",VLOOKUP(H288,'Otras referencias'!$A$24:$E$48,5,FALSE))","v":""},null,null,null,null,null,null,"",{"$f":"IF(AND(P288<>\"\",O288<>\"\"),IF(N288=\"A\",VLOOKUP(P288,'Otras referencias'!$J$24:$K$35,2,FALSE),IF(N288=\"B\",VLOOKUP(P288,'Otras referencias'!$N$24:$O$35,2,),IF(N288=\"C\",VLOOKUP(P288,'Otras referencias'!$R$24:$S$35,2,FALSE)))),\"\")","v":""},{"$f":"IF(S288=\"\",\"\",INDEX(referentes!$G$2:$H$5,MATCH(S288,referentes!$H$2:$H$5,0),1))","v":""},null,null,{"$f":"IF(T288=\"\",\"\",VLOOKUP(T288,referentes!$Q$2:$X$209,2,FALSE))","v":""},null,null,null,null,"",null,null,null,"",null,null,{"$f":"IF(AF288<>\"\",VLOOKUP(AF288,'Otras referencias'!$H$19:$I$20,2,FALSE),\"\")","v":""},null,{"$f":"IF(AH288<>\"\",VLOOKUP(AH288,'Otras referencias'!$H$19:$I$20,2,FALSE),\"\")","v":""},null,{"$f":"IF(AJ288<>\"\",VLOOKUP(AJ288,'Otras referencias'!$H$19:$I$20,2,FALSE),\"\")","v":""},null,{"$f":"IF(AL288<>\"\",VLOOKUP(AL288,'Otras referencias'!$H$19:$I$20,2,FALSE),\"\")","v":""}]
[null,{"$f":"IF(C289=\"\",\"\",IF(COUNTIF($C$3:C289, C289)>1, \"\", C289))","v":""},{"$f":"IF(J289=\"\",\"\",CONCATENATE(DIGITADOR!$M$1,J289,E289))","v":""},"",{"$f":"IF(H289=\"\",\"\",VLOOKUP(H289,'Otras referencias'!$A$24:$E$48,2,FALSE))","v":""},null,null,null,{"$f":"IF(H289=\"\",\"\",VLOOKUP(H289,'Otras referencias'!$A$24:$E$48,5,FALSE))","v":""},null,null,null,null,null,null,"",{"$f":"IF(AND(P289<>\"\",O289<>\"\"),IF(N289=\"A\",VLOOKUP(P289,'Otras referencias'!$J$24:$K$35,2,FALSE),IF(N289=\"B\",VLOOKUP(P289,'Otras referencias'!$N$24:$O$35,2,),IF(N289=\"C\",VLOOKUP(P289,'Otras referencias'!$R$24:$S$35,2,FALSE)))),\"\")","v":""},{"$f":"IF(S289=\"\",\"\",INDEX(referentes!$G$2:$H$5,MATCH(S289,referentes!$H$2:$H$5,0),1))","v":""},null,null,{"$f":"IF(T289=\"\",\"\",VLOOKUP(T289,referentes!$Q$2:$X$209,2,FALSE))","v":""},null,null,null,null,"",null,null,null,"",null,null,{"$f":"IF(AF289<>\"\",VLOOKUP(AF289,'Otras referencias'!$H$19:$I$20,2,FALSE),\"\")","v":""},null,{"$f":"IF(AH289<>\"\",VLOOKUP(AH289,'Otras referencias'!$H$19:$I$20,2,FALSE),\"\")","v":""},null,{"$f":"IF(AJ289<>\"\",VLOOKUP(AJ289,'Otras referencias'!$H$19:$I$20,2,FALSE),\"\")","v":""},null,{"$f":"IF(AL289<>\"\",VLOOKUP(AL289,'Otras referencias'!$H$19:$I$20,2,FALSE),\"\")","v":""}]
[null,{"$f":"IF(C290=\"\",\"\",IF(COUNTIF($C$3:C290, C290)>1, \"\", C290))","v":""},{"$f":"IF(J290=\"\",\"\",CONCATENATE(DIGITADOR!$M$1,J290,E290))","v":""},"",{"$f":"IF(H290=\"\",\"\",VLOOKUP(H290,'Otras referencias'!$A$24:$E$48,2,FALSE))","v":""},null,null,null,{"$f":"IF(H290=\"\",\"\",VLOOKUP(H290,'Otras referencias'!$A$24:$E$48,5,FALSE))","v":""},null,null,null,null,null,null,"",{"$f":"IF(AND(P290<>\"\",O290<>\"\"),IF(N290=\"A\",VLOOKUP(P290,'Otras referencias'!$J$24:$K$35,2,FALSE),IF(N290=\"B\",VLOOKUP(P290,'Otras referencias'!$N$24:$O$35,2,),IF(N290=\"C\",VLOOKUP(P290,'Otras referencias'!$R$24:$S$35,2,FALSE)))),\"\")","v":""},{"$f":"IF(S290=\"\",\"\",INDEX(referentes!$G$2:$H$5,MATCH(S290,referentes!$H$2:$H$5,0),1))","v":""},null,null,{"$f":"IF(T290=\"\",\"\",VLOOKUP(T290,referentes!$Q$2:$X$209,2,FALSE))","v":""},null,null,null,null,"",null,null,null,"",null,null,{"$f":"IF(AF290<>\"\",VLOOKUP(AF290,'Otras referencias'!$H$19:$I$20,2,FALSE),\"\")","v":""},null,{"$f":"IF(AH290<>\"\",VLOOKUP(AH290,'Otras referencias'!$H$19:$I$20,2,FALSE),\"\")","v":""},null,{"$f":"IF(AJ290<>\"\",VLOOKUP(AJ290,'Otras referencias'!$H$19:$I$20,2,FALSE),\"\")","v":""},null,{"$f":"IF(AL290<>\"\",VLOOKUP(AL290,'Otras referencias'!$H$19:$I$20,2,FALSE),\"\")","v":""}]
[null,{"$f":"IF(C291=\"\",\"\",IF(COUNTIF($C$3:C291, C291)>1, \"\", C291))","v":""},{"$f":"IF(J291=\"\",\"\",CONCATENATE(DIGITADOR!$M$1,J291,E291))","v":""},"",{"$f":"IF(H291=\"\",\"\",VLOOKUP(H291,'Otras referencias'!$A$24:$E$48,2,FALSE))","v":""},null,null,null,{"$f":"IF(H291=\"\",\"\",VLOOKUP(H291,'Otras referencias'!$A$24:$E$48,5,FALSE))","v":""},null,null,null,null,null,null,"",{"$f":"IF(AND(P291<>\"\",O291<>\"\"),IF(N291=\"A\",VLOOKUP(P291,'Otras referencias'!$J$24:$K$35,2,FALSE),IF(N291=\"B\",VLOOKUP(P291,'Otras referencias'!$N$24:$O$35,2,),IF(N291=\"C\",VLOOKUP(P291,'Otras referencias'!$R$24:$S$35,2,FALSE)))),\"\")","v":""},{"$f":"IF(S291=\"\",\"\",INDEX(referentes!$G$2:$H$5,MATCH(S291,referentes!$H$2:$H$5,0),1))","v":""},null,null,{"$f":"IF(T291=\"\",\"\",VLOOKUP(T291,referentes!$Q$2:$X$209,2,FALSE))","v":""},null,null,null,null,"",null,null,null,"",null,null,{"$f":"IF(AF291<>\"\",VLOOKUP(AF291,'Otras referencias'!$H$19:$I$20,2,FALSE),\"\")","v":""},null,{"$f":"IF(AH291<>\"\",VLOOKUP(AH291,'Otras referencias'!$H$19:$I$20,2,FALSE),\"\")","v":""},null,{"$f":"IF(AJ291<>\"\",VLOOKUP(AJ291,'Otras referencias'!$H$19:$I$20,2,FALSE),\"\")","v":""},null,{"$f":"IF(AL291<>\"\",VLOOKUP(AL291,'Otras referencias'!$H$19:$I$20,2,FALSE),\"\")","v":""}]
[null,{"$f":"IF(C292=\"\",\"\",IF(COUNTIF($C$3:C292, C292)>1, \"\", C292))","v":""},{"$f":"IF(J292=\"\",\"\",CONCATENATE(DIGITADOR!$M$1,J292,E292))","v":""},"",{"$f":"IF(H292=\"\",\"\",VLOOKUP(H292,'Otras referencias'!$A$24:$E$48,2,FALSE))","v":""},null,null,null,{"$f":"IF(H292=\"\",\"\",VLOOKUP(H292,'Otras referencias'!$A$24:$E$48,5,FALSE))","v":""},null,null,null,null,null,null,"",{"$f":"IF(AND(P292<>\"\",O292<>\"\"),IF(N292=\"A\",VLOOKUP(P292,'Otras referencias'!$J$24:$K$35,2,FALSE),IF(N292=\"B\",VLOOKUP(P292,'Otras referencias'!$N$24:$O$35,2,),IF(N292=\"C\",VLOOKUP(P292,'Otras referencias'!$R$24:$S$35,2,FALSE)))),\"\")","v":""},{"$f":"IF(S292=\"\",\"\",INDEX(referentes!$G$2:$H$5,MATCH(S292,referentes!$H$2:$H$5,0),1))","v":""},null,null,{"$f":"IF(T292=\"\",\"\",VLOOKUP(T292,referentes!$Q$2:$X$209,2,FALSE))","v":""},null,null,null,null,"",null,null,null,"",null,null,{"$f":"IF(AF292<>\"\",VLOOKUP(AF292,'Otras referencias'!$H$19:$I$20,2,FALSE),\"\")","v":""},null,{"$f":"IF(AH292<>\"\",VLOOKUP(AH292,'Otras referencias'!$H$19:$I$20,2,FALSE),\"\")","v":""},null,{"$f":"IF(AJ292<>\"\",VLOOKUP(AJ292,'Otras referencias'!$H$19:$I$20,2,FALSE),\"\")","v":""},null,{"$f":"IF(AL292<>\"\",VLOOKUP(AL292,'Otras referencias'!$H$19:$I$20,2,FALSE),\"\")","v":""}]
[null,{"$f":"IF(C293=\"\",\"\",IF(COUNTIF($C$3:C293, C293)>1, \"\", C293))","v":""},{"$f":"IF(J293=\"\",\"\",CONCATENATE(DIGITADOR!$M$1,J293,E293))","v":""},"",{"$f":"IF(H293=\"\",\"\",VLOOKUP(H293,'Otras referencias'!$A$24:$E$48,2,FALSE))","v":""},null,null,null,{"$f":"IF(H293=\"\",\"\",VLOOKUP(H293,'Otras referencias'!$A$24:$E$48,5,FALSE))","v":""},null,null,null,null,null,null,"",{"$f":"IF(AND(P293<>\"\",O293<>\"\"),IF(N293=\"A\",VLOOKUP(P293,'Otras referencias'!$J$24:$K$35,2,FALSE),IF(N293=\"B\",VLOOKUP(P293,'Otras referencias'!$N$24:$O$35,2,),IF(N293=\"C\",VLOOKUP(P293,'Otras referencias'!$R$24:$S$35,2,FALSE)))),\"\")","v":""},{"$f":"IF(S293=\"\",\"\",INDEX(referentes!$G$2:$H$5,MATCH(S293,referentes!$H$2:$H$5,0),1))","v":""},null,null,{"$f":"IF(T293=\"\",\"\",VLOOKUP(T293,referentes!$Q$2:$X$209,2,FALSE))","v":""},null,null,null,null,"",null,null,null,"",null,null,{"$f":"IF(AF293<>\"\",VLOOKUP(AF293,'Otras referencias'!$H$19:$I$20,2,FALSE),\"\")","v":""},null,{"$f":"IF(AH293<>\"\",VLOOKUP(AH293,'Otras referencias'!$H$19:$I$20,2,FALSE),\"\")","v":""},null,{"$f":"IF(AJ293<>\"\",VLOOKUP(AJ293,'Otras referencias'!$H$19:$I$20,2,FALSE),\"\")","v":""},null,{"$f":"IF(AL293<>\"\",VLOOKUP(AL293,'Otras referencias'!$H$19:$I$20,2,FALSE),\"\")","v":""}]
[null,{"$f":"IF(C294=\"\",\"\",IF(COUNTIF($C$3:C294, C294)>1, \"\", C294))","v":""},{"$f":"IF(J294=\"\",\"\",CONCATENATE(DIGITADOR!$M$1,J294,E294))","v":""},"",{"$f":"IF(H294=\"\",\"\",VLOOKUP(H294,'Otras referencias'!$A$24:$E$48,2,FALSE))","v":""},null,null,null,{"$f":"IF(H294=\"\",\"\",VLOOKUP(H294,'Otras referencias'!$A$24:$E$48,5,FALSE))","v":""},null,null,null,null,null,null,"",{"$f":"IF(AND(P294<>\"\",O294<>\"\"),IF(N294=\"A\",VLOOKUP(P294,'Otras referencias'!$J$24:$K$35,2,FALSE),IF(N294=\"B\",VLOOKUP(P294,'Otras referencias'!$N$24:$O$35,2,),IF(N294=\"C\",VLOOKUP(P294,'Otras referencias'!$R$24:$S$35,2,FALSE)))),\"\")","v":""},{"$f":"IF(S294=\"\",\"\",INDEX(referentes!$G$2:$H$5,MATCH(S294,referentes!$H$2:$H$5,0),1))","v":""},null,null,{"$f":"IF(T294=\"\",\"\",VLOOKUP(T294,referentes!$Q$2:$X$209,2,FALSE))","v":""},null,null,null,null,"",null,null,null,"",null,null,{"$f":"IF(AF294<>\"\",VLOOKUP(AF294,'Otras referencias'!$H$19:$I$20,2,FALSE),\"\")","v":""},null,{"$f":"IF(AH294<>\"\",VLOOKUP(AH294,'Otras referencias'!$H$19:$I$20,2,FALSE),\"\")","v":""},null,{"$f":"IF(AJ294<>\"\",VLOOKUP(AJ294,'Otras referencias'!$H$19:$I$20,2,FALSE),\"\")","v":""},null,{"$f":"IF(AL294<>\"\",VLOOKUP(AL294,'Otras referencias'!$H$19:$I$20,2,FALSE),\"\")","v":""}]
[null,{"$f":"IF(C295=\"\",\"\",IF(COUNTIF($C$3:C295, C295)>1, \"\", C295))","v":""},{"$f":"IF(J295=\"\",\"\",CONCATENATE(DIGITADOR!$M$1,J295,E295))","v":""},"",{"$f":"IF(H295=\"\",\"\",VLOOKUP(H295,'Otras referencias'!$A$24:$E$48,2,FALSE))","v":""},null,null,null,{"$f":"IF(H295=\"\",\"\",VLOOKUP(H295,'Otras referencias'!$A$24:$E$48,5,FALSE))","v":""},null,null,null,null,null,null,"",{"$f":"IF(AND(P295<>\"\",O295<>\"\"),IF(N295=\"A\",VLOOKUP(P295,'Otras referencias'!$J$24:$K$35,2,FALSE),IF(N295=\"B\",VLOOKUP(P295,'Otras referencias'!$N$24:$O$35,2,),IF(N295=\"C\",VLOOKUP(P295,'Otras referencias'!$R$24:$S$35,2,FALSE)))),\"\")","v":""},{"$f":"IF(S295=\"\",\"\",INDEX(referentes!$G$2:$H$5,MATCH(S295,referentes!$H$2:$H$5,0),1))","v":""},null,null,{"$f":"IF(T295=\"\",\"\",VLOOKUP(T295,referentes!$Q$2:$X$209,2,FALSE))","v":""},null,null,null,null,"",null,null,null,"",null,null,{"$f":"IF(AF295<>\"\",VLOOKUP(AF295,'Otras referencias'!$H$19:$I$20,2,FALSE),\"\")","v":""},null,{"$f":"IF(AH295<>\"\",VLOOKUP(AH295,'Otras referencias'!$H$19:$I$20,2,FALSE),\"\")","v":""},null,{"$f":"IF(AJ295<>\"\",VLOOKUP(AJ295,'Otras referencias'!$H$19:$I$20,2,FALSE),\"\")","v":""},null,{"$f":"IF(AL295<>\"\",VLOOKUP(AL295,'Otras referencias'!$H$19:$I$20,2,FALSE),\"\")","v":""}]
[null,{"$f":"IF(C296=\"\",\"\",IF(COUNTIF($C$3:C296, C296)>1, \"\", C296))","v":""},{"$f":"IF(J296=\"\",\"\",CONCATENATE(DIGITADOR!$M$1,J296,E296))","v":""},"",{"$f":"IF(H296=\"\",\"\",VLOOKUP(H296,'Otras referencias'!$A$24:$E$48,2,FALSE))","v":""},null,null,null,{"$f":"IF(H296=\"\",\"\",VLOOKUP(H296,'Otras referencias'!$A$24:$E$48,5,FALSE))","v":""},null,null,null,null,null,null,"",{"$f":"IF(AND(P296<>\"\",O296<>\"\"),IF(N296=\"A\",VLOOKUP(P296,'Otras referencias'!$J$24:$K$35,2,FALSE),IF(N296=\"B\",VLOOKUP(P296,'Otras referencias'!$N$24:$O$35,2,),IF(N296=\"C\",VLOOKUP(P296,'Otras referencias'!$R$24:$S$35,2,FALSE)))),\"\")","v":""},{"$f":"IF(S296=\"\",\"\",INDEX(referentes!$G$2:$H$5,MATCH(S296,referentes!$H$2:$H$5,0),1))","v":""},null,null,{"$f":"IF(T296=\"\",\"\",VLOOKUP(T296,referentes!$Q$2:$X$209,2,FALSE))","v":""},null,null,null,null,"",null,null,null,"",null,null,{"$f":"IF(AF296<>\"\",VLOOKUP(AF296,'Otras referencias'!$H$19:$I$20,2,FALSE),\"\")","v":""},null,{"$f":"IF(AH296<>\"\",VLOOKUP(AH296,'Otras referencias'!$H$19:$I$20,2,FALSE),\"\")","v":""},null,{"$f":"IF(AJ296<>\"\",VLOOKUP(AJ296,'Otras referencias'!$H$19:$I$20,2,FALSE),\"\")","v":""},null,{"$f":"IF(AL296<>\"\",VLOOKUP(AL296,'Otras referencias'!$H$19:$I$20,2,FALSE),\"\")","v":""}]
[null,{"$f":"IF(C297=\"\",\"\",IF(COUNTIF($C$3:C297, C297)>1, \"\", C297))","v":""},{"$f":"IF(J297=\"\",\"\",CONCATENATE(DIGITADOR!$M$1,J297,E297))","v":""},"",{"$f":"IF(H297=\"\",\"\",VLOOKUP(H297,'Otras referencias'!$A$24:$E$48,2,FALSE))","v":""},null,null,null,{"$f":"IF(H297=\"\",\"\",VLOOKUP(H297,'Otras referencias'!$A$24:$E$48,5,FALSE))","v":""},null,null,null,null,null,null,"",{"$f":"IF(AND(P297<>\"\",O297<>\"\"),IF(N297=\"A\",VLOOKUP(P297,'Otras referencias'!$J$24:$K$35,2,FALSE),IF(N297=\"B\",VLOOKUP(P297,'Otras referencias'!$N$24:$O$35,2,),IF(N297=\"C\",VLOOKUP(P297,'Otras referencias'!$R$24:$S$35,2,FALSE)))),\"\")","v":""},{"$f":"IF(S297=\"\",\"\",INDEX(referentes!$G$2:$H$5,MATCH(S297,referentes!$H$2:$H$5,0),1))","v":""},null,null,{"$f":"IF(T297=\"\",\"\",VLOOKUP(T297,referentes!$Q$2:$X$209,2,FALSE))","v":""},null,null,null,null,"",null,null,null,"",null,null,{"$f":"IF(AF297<>\"\",VLOOKUP(AF297,'Otras referencias'!$H$19:$I$20,2,FALSE),\"\")","v":""},null,{"$f":"IF(AH297<>\"\",VLOOKUP(AH297,'Otras referencias'!$H$19:$I$20,2,FALSE),\"\")","v":""},null,{"$f":"IF(AJ297<>\"\",VLOOKUP(AJ297,'Otras referencias'!$H$19:$I$20,2,FALSE),\"\")","v":""},null,{"$f":"IF(AL297<>\"\",VLOOKUP(AL297,'Otras referencias'!$H$19:$I$20,2,FALSE),\"\")","v":""}]
[null,{"$f":"IF(C298=\"\",\"\",IF(COUNTIF($C$3:C298, C298)>1, \"\", C298))","v":""},{"$f":"IF(J298=\"\",\"\",CONCATENATE(DIGITADOR!$M$1,J298,E298))","v":""},"",{"$f":"IF(H298=\"\",\"\",VLOOKUP(H298,'Otras referencias'!$A$24:$E$48,2,FALSE))","v":""},null,null,null,{"$f":"IF(H298=\"\",\"\",VLOOKUP(H298,'Otras referencias'!$A$24:$E$48,5,FALSE))","v":""},null,null,null,null,null,null,"",{"$f":"IF(AND(P298<>\"\",O298<>\"\"),IF(N298=\"A\",VLOOKUP(P298,'Otras referencias'!$J$24:$K$35,2,FALSE),IF(N298=\"B\",VLOOKUP(P298,'Otras referencias'!$N$24:$O$35,2,),IF(N298=\"C\",VLOOKUP(P298,'Otras referencias'!$R$24:$S$35,2,FALSE)))),\"\")","v":""},{"$f":"IF(S298=\"\",\"\",INDEX(referentes!$G$2:$H$5,MATCH(S298,referentes!$H$2:$H$5,0),1))","v":""},null,null,{"$f":"IF(T298=\"\",\"\",VLOOKUP(T298,referentes!$Q$2:$X$209,2,FALSE))","v":""},null,null,null,null,"",null,null,null,"",null,null,{"$f":"IF(AF298<>\"\",VLOOKUP(AF298,'Otras referencias'!$H$19:$I$20,2,FALSE),\"\")","v":""},null,{"$f":"IF(AH298<>\"\",VLOOKUP(AH298,'Otras referencias'!$H$19:$I$20,2,FALSE),\"\")","v":""},null,{"$f":"IF(AJ298<>\"\",VLOOKUP(AJ298,'Otras referencias'!$H$19:$I$20,2,FALSE),\"\")","v":""},null,{"$f":"IF(AL298<>\"\",VLOOKUP(AL298,'Otras referencias'!$H$19:$I$20,2,FALSE),\"\")","v":""}]
[null,{"$f":"IF(C299=\"\",\"\",IF(COUNTIF($C$3:C299, C299)>1, \"\", C299))","v":""},{"$f":"IF(J299=\"\",\"\",CONCATENATE(DIGITADOR!$M$1,J299,E299))","v":""},"",{"$f":"IF(H299=\"\",\"\",VLOOKUP(H299,'Otras referencias'!$A$24:$E$48,2,FALSE))","v":""},null,null,null,{"$f":"IF(H299=\"\",\"\",VLOOKUP(H299,'Otras referencias'!$A$24:$E$48,5,FALSE))","v":""},null,null,null,null,null,null,"",{"$f":"IF(AND(P299<>\"\",O299<>\"\"),IF(N299=\"A\",VLOOKUP(P299,'Otras referencias'!$J$24:$K$35,2,FALSE),IF(N299=\"B\",VLOOKUP(P299,'Otras referencias'!$N$24:$O$35,2,),IF(N299=\"C\",VLOOKUP(P299,'Otras referencias'!$R$24:$S$35,2,FALSE)))),\"\")","v":""},{"$f":"IF(S299=\"\",\"\",INDEX(referentes!$G$2:$H$5,MATCH(S299,referentes!$H$2:$H$5,0),1))","v":""},null,null,{"$f":"IF(T299=\"\",\"\",VLOOKUP(T299,referentes!$Q$2:$X$209,2,FALSE))","v":""},null,null,null,null,"",null,null,null,"",null,null,{"$f":"IF(AF299<>\"\",VLOOKUP(AF299,'Otras referencias'!$H$19:$I$20,2,FALSE),\"\")","v":""},null,{"$f":"IF(AH299<>\"\",VLOOKUP(AH299,'Otras referencias'!$H$19:$I$20,2,FALSE),\"\")","v":""},null,{"$f":"IF(AJ299<>\"\",VLOOKUP(AJ299,'Otras referencias'!$H$19:$I$20,2,FALSE),\"\")","v":""},null,{"$f":"IF(AL299<>\"\",VLOOKUP(AL299,'Otras referencias'!$H$19:$I$20,2,FALSE),\"\")","v":""}]
[null,{"$f":"IF(C300=\"\",\"\",IF(COUNTIF($C$3:C300, C300)>1, \"\", C300))","v":""},{"$f":"IF(J300=\"\",\"\",CONCATENATE(DIGITADOR!$M$1,J300,E300))","v":""},"",{"$f":"IF(H300=\"\",\"\",VLOOKUP(H300,'Otras referencias'!$A$24:$E$48,2,FALSE))","v":""},null,null,null,{"$f":"IF(H300=\"\",\"\",VLOOKUP(H300,'Otras referencias'!$A$24:$E$48,5,FALSE))","v":""},null,null,null,null,null,null,"",{"$f":"IF(AND(P300<>\"\",O300<>\"\"),IF(N300=\"A\",VLOOKUP(P300,'Otras referencias'!$J$24:$K$35,2,FALSE),IF(N300=\"B\",VLOOKUP(P300,'Otras referencias'!$N$24:$O$35,2,),IF(N300=\"C\",VLOOKUP(P300,'Otras referencias'!$R$24:$S$35,2,FALSE)))),\"\")","v":""},{"$f":"IF(S300=\"\",\"\",INDEX(referentes!$G$2:$H$5,MATCH(S300,referentes!$H$2:$H$5,0),1))","v":""},null,null,{"$f":"IF(T300=\"\",\"\",VLOOKUP(T300,referentes!$Q$2:$X$209,2,FALSE))","v":""},null,null,null,null,"",null,null,null,"",null,null,{"$f":"IF(AF300<>\"\",VLOOKUP(AF300,'Otras referencias'!$H$19:$I$20,2,FALSE),\"\")","v":""},null,{"$f":"IF(AH300<>\"\",VLOOKUP(AH300,'Otras referencias'!$H$19:$I$20,2,FALSE),\"\")","v":""},null,{"$f":"IF(AJ300<>\"\",VLOOKUP(AJ300,'Otras referencias'!$H$19:$I$20,2,FALSE),\"\")","v":""},null,{"$f":"IF(AL300<>\"\",VLOOKUP(AL300,'Otras referencias'!$H$19:$I$20,2,FALSE),\"\")","v":""}]
[null,{"$f":"IF(C301=\"\",\"\",IF(COUNTIF($C$3:C301, C301)>1, \"\", C301))","v":""},{"$f":"IF(J301=\"\",\"\",CONCATENATE(DIGITADOR!$M$1,J301,E301))","v":""},"",{"$f":"IF(H301=\"\",\"\",VLOOKUP(H301,'Otras referencias'!$A$24:$E$48,2,FALSE))","v":""},null,null,null,{"$f":"IF(H301=\"\",\"\",VLOOKUP(H301,'Otras referencias'!$A$24:$E$48,5,FALSE))","v":""},null,null,null,null,null,null,"",{"$f":"IF(AND(P301<>\"\",O301<>\"\"),IF(N301=\"A\",VLOOKUP(P301,'Otras referencias'!$J$24:$K$35,2,FALSE),IF(N301=\"B\",VLOOKUP(P301,'Otras referencias'!$N$24:$O$35,2,),IF(N301=\"C\",VLOOKUP(P301,'Otras referencias'!$R$24:$S$35,2,FALSE)))),\"\")","v":""},{"$f":"IF(S301=\"\",\"\",INDEX(referentes!$G$2:$H$5,MATCH(S301,referentes!$H$2:$H$5,0),1))","v":""},null,null,{"$f":"IF(T301=\"\",\"\",VLOOKUP(T301,referentes!$Q$2:$X$209,2,FALSE))","v":""},null,null,null,null,"",null,null,null,"",null,null,{"$f":"IF(AF301<>\"\",VLOOKUP(AF301,'Otras referencias'!$H$19:$I$20,2,FALSE),\"\")","v":""},null,{"$f":"IF(AH301<>\"\",VLOOKUP(AH301,'Otras referencias'!$H$19:$I$20,2,FALSE),\"\")","v":""},null,{"$f":"IF(AJ301<>\"\",VLOOKUP(AJ301,'Otras referencias'!$H$19:$I$20,2,FALSE),\"\")","v":""},null,{"$f":"IF(AL301<>\"\",VLOOKUP(AL301,'Otras referencias'!$H$19:$I$20,2,FALSE),\"\")","v":""}]
[null,{"$f":"IF(C302=\"\",\"\",IF(COUNTIF($C$3:C302, C302)>1, \"\", C302))","v":""},{"$f":"IF(J302=\"\",\"\",CONCATENATE(DIGITADOR!$M$1,J302,E302))","v":""},"",{"$f":"IF(H302=\"\",\"\",VLOOKUP(H302,'Otras referencias'!$A$24:$E$48,2,FALSE))","v":""},null,null,null,{"$f":"IF(H302=\"\",\"\",VLOOKUP(H302,'Otras referencias'!$A$24:$E$48,5,FALSE))","v":""},null,null,null,null,null,null,"",{"$f":"IF(AND(P302<>\"\",O302<>\"\"),IF(N302=\"A\",VLOOKUP(P302,'Otras referencias'!$J$24:$K$35,2,FALSE),IF(N302=\"B\",VLOOKUP(P302,'Otras referencias'!$N$24:$O$35,2,),IF(N302=\"C\",VLOOKUP(P302,'Otras referencias'!$R$24:$S$35,2,FALSE)))),\"\")","v":""},{"$f":"IF(S302=\"\",\"\",INDEX(referentes!$G$2:$H$5,MATCH(S302,referentes!$H$2:$H$5,0),1))","v":""},null,null,{"$f":"IF(T302=\"\",\"\",VLOOKUP(T302,referentes!$Q$2:$X$209,2,FALSE))","v":""},null,null,null,null,"",null,null,null,"",null,null,{"$f":"IF(AF302<>\"\",VLOOKUP(AF302,'Otras referencias'!$H$19:$I$20,2,FALSE),\"\")","v":""},null,{"$f":"IF(AH302<>\"\",VLOOKUP(AH302,'Otras referencias'!$H$19:$I$20,2,FALSE),\"\")","v":""},null,{"$f":"IF(AJ302<>\"\",VLOOKUP(AJ302,'Otras referencias'!$H$19:$I$20,2,FALSE),\"\")","v":""},null,{"$f":"IF(AL302<>\"\",VLOOKUP(AL302,'Otras referencias'!$H$19:$I$20,2,FALSE),\"\")","v":""}]
[null,{"$f":"IF(C303=\"\",\"\",IF(COUNTIF($C$3:C303, C303)>1, \"\", C303))","v":""},{"$f":"IF(J303=\"\",\"\",CONCATENATE(DIGITADOR!$M$1,J303,E303))","v":""},"",{"$f":"IF(H303=\"\",\"\",VLOOKUP(H303,'Otras referencias'!$A$24:$E$48,2,FALSE))","v":""},null,null,null,{"$f":"IF(H303=\"\",\"\",VLOOKUP(H303,'Otras referencias'!$A$24:$E$48,5,FALSE))","v":""},null,null,null,null,null,null,"",{"$f":"IF(AND(P303<>\"\",O303<>\"\"),IF(N303=\"A\",VLOOKUP(P303,'Otras referencias'!$J$24:$K$35,2,FALSE),IF(N303=\"B\",VLOOKUP(P303,'Otras referencias'!$N$24:$O$35,2,),IF(N303=\"C\",VLOOKUP(P303,'Otras referencias'!$R$24:$S$35,2,FALSE)))),\"\")","v":""},{"$f":"IF(S303=\"\",\"\",INDEX(referentes!$G$2:$H$5,MATCH(S303,referentes!$H$2:$H$5,0),1))","v":""},null,null,{"$f":"IF(T303=\"\",\"\",VLOOKUP(T303,referentes!$Q$2:$X$209,2,FALSE))","v":""},null,null,null,null,"",null,null,null,"",null,null,{"$f":"IF(AF303<>\"\",VLOOKUP(AF303,'Otras referencias'!$H$19:$I$20,2,FALSE),\"\")","v":""},null,{"$f":"IF(AH303<>\"\",VLOOKUP(AH303,'Otras referencias'!$H$19:$I$20,2,FALSE),\"\")","v":""},null,{"$f":"IF(AJ303<>\"\",VLOOKUP(AJ303,'Otras referencias'!$H$19:$I$20,2,FALSE),\"\")","v":""},null,{"$f":"IF(AL303<>\"\",VLOOKUP(AL303,'Otras referencias'!$H$19:$I$20,2,FALSE),\"\")","v":""}]

{"sheet":"referentes","index":4,"n_rows":139,"n_cols":37,"rows_kept":139,"cut":false,"hidden":false,"merged":[]}
["codigo","descripcion",null,"codigo","descripcion",null,"codigo","descripcion",null,"codigo","descripcion",null,"codigo","descripcion",null,null,"cod_letras","descripcion","clave_sibm","phylum","clase","orden","familia","genero",null,"prefijo_cdg_est_loc","secuencia_loc","lugar","codigo_estacion_loc","descripcion_estacion_loc",null,"codigo","nombre",null,null,"NOMBRE_IN","CODIGO_IN"]
["CORALINA","CORALINA",null,3343,"ANH Pastos Guajira Choco (3343)",null,2701,"25x25",null,"HWRI","Halodule wrightii ",null,2750,"Lodo",null,null,"HBAI","Halophila baillonis","2040.55.1005","Tracheophyta","Magnoliopsida","Alismatales","Hydrocharitaceae",null,null,"AHUY",57180,"Ahuyama",1,"MN-Ahuyama",null,3907,"Ameth  Vargas Campo",null,null,null,"Administración Desarrollo Complejo Portuario  Limón Moin Costa Rica"]
["F. Malpelo","Fundacion Malpelo",null,3422,"Coralina 02 2018 (3422)",null,2702,"12,5x12,5",null,"HBAI","Halophila baillonis",null,2751,"Arena muy fina",null,null,"HDEC","Halophila decipiens","2040.55.1010","Tracheophyta","Magnoliopsida","Alismatales","Hydrocharitaceae",null,null,"BPOR",43727,"Bahía Portete",3,"MN-Bahía Portete",null,593,"Andrea Polanco",null,null,null,"Anadarko Colombia Company"]
["INVEMAR","Instituto de Investigaciones Marinas y Costeras",null,"Monitoreo Pastos - BPIN","Monitoreo Pastos - BPIN (COD_ALFABETICO anterior: 3494)",null,2703,"20x20",null,"HDEC","Halophila decipiens",null,2752,"Arena fina",null,null,"HWRI","Halodule wrightii ","2040.55.1000","Tracheophyta","Magnoliopsida","Alismatales","Cymodoceaceae",null,null,"BALL",48586,"Ballenas",1,"MN-Ballenas",null,4408,"Andres Felipe Acosta Chaparro",null,null,null,"Aquabiosfera SAS"]
["ParquesNacionales","Parques Nacionales",null,3304,"ANH Pastos Marinos. PRY-BEM-012-15_T2",null,2704,"50x50",null,"RMAR","Ruppia maritima",null,2753,"Arena media",null,null,"RMAR","Ruppia maritima","2040.55.30","Tracheophyta","Magnoliopsida","Alismatales","Lilianae",null,null,"CVEL",48584,"Cabo de la Vela",3,"MN-Cabo de la Vela",null,4109,"Angélica Rodríguez",null,null,null,"Asociación Calidris"]
["PNN_GORGONA","PNN_GORGONA",null,null,null,null,null,null,null,"SFIL","Syringodium filiforme",null,2754,"Arena mixta",null,null,"SFIL","Syringodium filiforme","2040.55.1015","Tracheophyta","Magnoliopsida","Alismatales","Cymodoceaceae",null,null,"CVNU",49303,"Cabo de la Vela",2,"MN-Cabo Nuevo",null,3956,"Carlos Aponte",null,null,null,"Asociación de Corporaciones Autónomas Regionales"]
["UJTL","UJTL",null,null,null,null,null,null,null,"TTES","Thalassia testudinum",null,2755,"Arena gruesa",null,null,"TTES","Thalassia testudinum","2040.55.1500","Tracheophyta","Magnoliopsida","Alismatales","Hydrocharitaceae",null,null,"CPLA",57179,"Cabo playa",1,"MN-Cabo playa",null,3147,"Christian Michael Díaz Sánchez",null,null,null,"Autoridad Nacional de Licencias Ambientales"]
["UNal","Universidad Nacional",null,null,null,null,null,null,null,null,null,null,2756,"Arena muy gruesa",null,null,null,null,null,null,null,null,null,null,null,"CARR",57178,"Carrizal",1,"MN-Carrizal",null,4407,"Cristian Camilo Salinas zapata",null,null,null,"Autoridad de Recursos Acuáticos de Panamá"]
["UNIVALLE","Universidad del Valle",null,null,null,null,null,null,null,null,null,null,2757,"Grava",null,null,null,null,null,null,null,null,null,null,null,"CHEN",43120,"Chengue",2,"MN-Chengue",null,3829,"Diana Carolina Ballesteros Contreras",null,null,null,"Caribbean-Wide Orca Project"]
[null,null,null,null,null,null,null,null,null,null,null,null,2758,"Bloques",null,null,null,null,null,null,null,null,null,null,null,"CINT",43121,"Cinto",3,"MN-Cinto",null,1834,"Diana Isabel Gómez López",null,null,null,"Centro de Estudios Ambientales de Cienfuegos"]
[null,null,null,null,null,null,null,null,null,null,null,null,2759,"Arena mixta con fang",null,null,null,null,null,null,null,null,null,null,null,"CCAY",48964,"Cotton Cay",1,"MN-Cotton Cay",null,3957,"Diana Vergara",null,null,null,"Centro de Estudios en Ciencias del Mar - Universidad Nacional"]
[null,null,null,null,null,null,null,null,null,null,null,null,null,null,null,null,null,null,null,null,null,null,null,null,null,"IMAN",43118,"Isla Mangle",2,"MN-Isla Mangle",null,1775,"Diego Duque",null,null,null,"Centro de Investigaciones Energéticas, Medioambientales y Tecnológicas"]
[null,null,null,null,null,null,null,null,null,null,null,null,null,null,null,null,null,null,null,null,null,null,null,null,null,"IROS",43117,"Isla Rosario",1,"MN-Isla Rosario",null,3646,"Elizabeth Galeano Galeano",null,null,null,"Centro de Investigaciones Oceanográficas e Hidrográficas"]
[null,null,null,null,null,null,null,null,null,null,null,null,null,null,null,null,null,null,null,null,null,null,null,null,null,"ISLE",48966,"Isleño",1,"MN-Isleño",null,3809,"Esteban Zarza",null,null,null,"Centro de Investigaciones Oceanográficas e Hidrográficas del Pacífico"]
[null,null,null,null,null,null,null,null,null,null,null,null,null,null,null,null,null,null,null,null,null,null,null,null,null,"KAUR",51465,"Manaure",1,"MN-Kaurrele",null,4106,"Johana Vega",null,null,null,"Centro de Investigación Educación y Recreación Islas del Rosario"]
[null,null,null,null,null,null,null,null,null,null,null,null,null,null,null,null,null,null,null,null,null,null,null,null,null,"MANA",48585,"Manaure",2,"MN-Manaure",null,3905,"Juan David González Corredor",null,null,null,"Centro de Investigación de los Recursos Acuáticos de Nicaragua (CIRA)"]
[null,null,null,null,null,null,null,null,null,null,null,null,null,null,null,null,null,null,null,null,null,null,null,null,null,"MARA",48965,"Marazul",1,"MN-Marazul",null,3505,"Juan Manuel Rodriguez Pineda",null,null,null,"Centro de Investigación en Contaminación Ambiental"]
[null,null,null,null,null,null,null,null,null,null,null,null,null,null,null,null,null,null,null,null,null,null,null,null,null,"MBAY",43123,"Mauricio Bay",1,"MN-Mauricio Bay",null,4409,"Karen Melissa Serna Rodriguez",null,null,null,"Colección de Referencia Biología Marina Universidad del Valle"]
[null,null,null,null,null,null,null,null,null,null,null,null,null,null,null,null,null,null,null,null,null,null,null,null,null,"NEGU",43119,"Neguanje",1,"MN-Neguanje",null,4107,"Kelly Gómez",null,null,null,"Colección personal"]
[null,null,null,null,null,null,null,null,null,null,null,null,null,null,null,null,null,null,null,null,null,null,null,null,null,"OCRE",43122,"Oyster Creek",2,"MN-Oyster Creek",null,8265,"Kevin Samuel Moreno",null,null,null,"Comisión Permanente del Pacífico Sur"]
[null,null,null,null,null,null,null,null,null,null,null,null,null,null,null,null,null,null,null,null,null,null,null,null,null,"PINO",48582,"Pinorroa",2,"MN-Pinorroa",null,5020,"Laura Alejandra Londoño",null,null,null,"Conservación Internacional Colombia "]
[null,null,null,null,null,null,null,null,null,null,null,null,null,null,null,null,null,null,null,null,null,null,null,null,null,"PBLA",52866,"Playa Blanca-Barú (PNN Corales del Rosario y San Bernardo)",1,"MN-Playa Blanca-Barú",null,3647,"Laura Muñoz Escobar",null,null,null,"Consultor independiente "]
[null,null,null,null,null,null,null,null,null,null,null,null,null,null,null,null,null,null,null,null,null,null,null,null,null,"TRIG",48583,"Trigana",1,"MN-Trigana",null,4227,"Laura Sanchez Valencia",null,null,null,"Consultoria y Monitoreo Ambiental"]
[null,null,null,null,null,null,null,null,null,null,null,null,null,null,null,null,null,null,null,null,null,null,null,null,null,null,null,null,null,null,null,3281,"Leonardo José Arias Alemán (2022)",null,null,null,"Corporacion  Autonoma Regional del Valle del Cauca"]
[null,null,null,null,null,null,null,null,null,null,null,null,null,null,null,null,null,null,null,null,null,null,null,null,null,null,null,null,null,null,null,287,"Marcela Cano Correa",null,null,null,"Corporacion Autonoma Regional de Nariño"]
[null,null,null,null,null,null,null,null,null,null,null,null,null,null,null,null,null,null,null,null,null,null,null,null,null,null,null,null,null,null,null,5021,"Maria Juliana Vanegas Gonzalez",null,null,null,"Corporacion Autonoma Regional de Sucre"]
[null,null,null,null,null,null,null,null,null,null,null,null,null,null,null,null,null,null,null,null,null,null,null,null,null,null,null,null,null,null,null,3810,"Maria Paula Molina",null,null,null,"Corporacion Autonoma Regional del Atlàntico"]
[null,null,null,null,null,null,null,null,null,null,null,null,null,null,null,null,null,null,null,null,null,null,null,null,null,null,null,null,null,null,null,3401,"Maria del Pilar Parrado Cortes",null,null,null,"Corporacion Autonoma Regional del Canal del Dique"]
[null,null,null,null,null,null,null,null,null,null,null,null,null,null,null,null,null,null,null,null,null,null,null,null,null,null,null,null,null,null,null,3139,"Milena Marrugo",null,null,null,"Corporacion Autonoma Regional del Cauca"]
[null,null,null,null,null,null,null,null,null,null,null,null,null,null,null,null,null,null,null,null,null,null,null,null,null,null,null,null,null,null,null,1809,"Raul Navas Camacho",null,null,null,"Corporacion para el Desarrollo Sostenible del Choco"]
[null,null,null,null,null,null,null,null,null,null,null,null,null,null,null,null,null,null,null,null,null,null,null,null,null,null,null,null,null,null,null,4754,"Sandra Torres",null,null,null,"Corporación Autónoma Regional de la Guajira"]
[null,null,null,null,null,null,null,null,null,null,null,null,null,null,null,null,null,null,null,null,null,null,null,null,null,null,null,null,null,null,null,4167,"Santiago Millan",null,null,null,"Corporación Autónoma Regional de las Islas de San Andrés, Providencia y Santa Catalina"]
[null,null,null,null,null,null,null,null,null,null,null,null,null,null,null,null,null,null,null,null,null,null,null,null,null,null,null,null,null,null,null,5749,"Shanly Carolina Coneo Gómez",null,null,null,"Corporación Autónoma Regional del Magdalena"]
[null,null,null,null,null,null,null,null,null,null,null,null,null,null,null,null,null,null,null,null,null,null,null,null,null,null,null,null,null,null,null,4995,"Simon Robledo Cardona",null,null,null,"Corporación Autónoma Regional del Uraba"]
[null,null,null,null,null,null,null,null,null,null,null,null,null,null,null,null,null,null,null,null,null,null,null,null,null,null,null,null,null,null,null,4108,"Tomás López",null,null,null,"Corporación Autónoma Regional del Valle del Cauca-Universidad del Pacifico"]
[null,null,null,null,null,null,null,null,null,null,null,null,null,null,null,null,null,null,null,null,null,null,null,null,null,null,null,null,null,null,null,6956,"Violeta Posada Riaño",null,null,null,"Corporación Coralina - Fundación Omacha"]
[null,null,null,null,null,null,null,null,null,null,null,null,null,null,null,null,null,null,null,null,null,null,null,null,null,null,null,null,null,null,null,8266,"Zulay Saudith González Herrera",null,null,null,"Corporación Corpouraba - Fundación Omacha"]
[null,null,null,null,null,null,null,null,null,null,null,null,null,null,null,null,null,null,null,null,null,null,null,null,null,null,null,null,null,null,null,null,null,null,null,null,"Corporación Regional de Valle del Sinu y San Jorge"]
[null,null,null,null,null,null,null,null,null,null,null,null,null,null,null,null,null,null,null,null,null,null,null,null,null,null,null,null,null,null,null,null,null,null,null,null,"DEPARTAMENT0 ADMiNISTRATIVO DISTRITAL DE SOSTENIBILIDAD AMBIENTAL"]
[null,null,null,null,null,null,null,null,null,null,null,null,null,null,null,null,null,null,null,null,null,null,null,null,null,null,null,null,null,null,null,null,null,null,null,null,"Departamento Administrativo del Medio Ambiente de Cartagena -  EPA Cartagena"]
[null,null,null,null,null,null,null,null,null,null,null,null,null,null,null,null,null,null,null,null,null,null,null,null,null,null,null,null,null,null,null,null,null,null,null,null,"Departamento Técnico Administrativo del Medio Ambiente Barranquilla"]
[null,null,null,null,null,null,null,null,null,null,null,null,null,null,null,null,null,null,null,null,null,null,null,null,null,null,null,null,null,null,null,null,null,null,null,null,"Dirección General Maritima"]
[null,null,null,null,null,null,null,null,null,null,null,null,null,null,null,null,null,null,null,null,null,null,null,null,null,null,null,null,null,null,null,null,null,null,null,null,"ECOREEF Colombia LTDA"]
[null,null,null,null,null,null,null,null,null,null,null,null,null,null,null,null,null,null,null,null,null,null,null,null,null,null,null,null,null,null,null,null,null,null,null,null,"EIDGENÖSSISCHE TECHNISCHE HOCHSCHULE ZÜRICH (Politécnico)\r\r\nEIDGENÖSSISCHE TECHNISCHE HOCHSCHULE ZÜRICH"]
[null,null,null,null,null,null,null,null,null,null,null,null,null,null,null,null,null,null,null,null,null,null,null,null,null,null,null,null,null,null,null,null,null,null,null,null,"Ecomar Consultoría  Ambiental S.A.S."]
[null,null,null,null,null,null,null,null,null,null,null,null,null,null,null,null,null,null,null,null,null,null,null,null,null,null,null,null,null,null,null,null,null,null,null,null,"Establecimiento Publico Ambiental Barranquilla"]
[null,null,null,null,null,null,null,null,null,null,null,null,null,null,null,null,null,null,null,null,null,null,null,null,null,null,null,null,null,null,null,null,null,null,null,null,"Establecimiento Publico Ambiental Buenaventura"]
[null,null,null,null,null,null,null,null,null,null,null,null,null,null,null,null,null,null,null,null,null,null,null,null,null,null,null,null,null,null,null,null,null,null,null,null,"Establecimiento Publico Ambiental Cartagena"]
[null,null,null,null,null,null,null,null,null,null,null,null,null,null,null,null,null,null,null,null,null,null,null,null,null,null,null,null,null,null,null,null,null,null,null,null,"FUNDACIÓN ZOOLÓGICA DE CALI"]
[null,null,null,null,null,null,null,null,null,null,null,null,null,null,null,null,null,null,null,null,null,null,null,null,null,null,null,null,null,null,null,null,null,null,null,null,"Fundacion Para El Desarrollo De La Biologia Aplicada"]
[null,null,null,null,null,null,null,null,null,null,null,null,null,null,null,null,null,null,null,null,null,null,null,null,null,null,null,null,null,null,null,null,null,null,null,null,"Fundación Bucea Colombia"]
[null,null,null,null,null,null,null,null,null,null,null,null,null,null,null,null,null,null,null,null,null,null,null,null,null,null,null,null,null,null,null,null,null,null,null,null,"Fundación Corales de Paz"]
[null,null,null,null,null,null,null,null,null,null,null,null,null,null,null,null,null,null,null,null,null,null,null,null,null,null,null,null,null,null,null,null,null,null,null,null,"Fundación Malpelo / Marviva"]
[null,null,null,null,null,null,null,null,null,null,null,null,null,null,null,null,null,null,null,null,null,null,null,null,null,null,null,null,null,null,null,null,null,null,null,null,"Fundación Omacha"]
[null,null,null,null,null,null,null,null,null,null,null,null,null,null,null,null,null,null,null,null,null,null,null,null,null,null,null,null,null,null,null,null,null,null,null,null,"Fundación Omacha - Observadores Fauna Marina"]
[null,null,null,null,null,null,null,null,null,null,null,null,null,null,null,null,null,null,null,null,null,null,null,null,null,null,null,null,null,null,null,null,null,null,null,null,"Fundación Omacha - Observadores Fauna Marina - Aquabiosfera"]
[null,null,null,null,null,null,null,null,null,null,null,null,null,null,null,null,null,null,null,null,null,null,null,null,null,null,null,null,null,null,null,null,null,null,null,null,"Fundación Sila Kangama"]
[null,null,null,null,null,null,null,null,null,null,null,null,null,null,null,null,null,null,null,null,null,null,null,null,null,null,null,null,null,null,null,null,null,null,null,null,"Fundación Universidad Jorge Tadeo Lozano - Centro de Investigaciones y Asesorías Agroindustriales,"]
[null,null,null,null,null,null,null,null,null,null,null,null,null,null,null,null,null,null,null,null,null,null,null,null,null,null,null,null,null,null,null,null,null,null,null,null,"Fundación Universidad de Bogotá Jorge Tadeo Lozano"]
[null,null,null,null,null,null,null,null,null,null,null,null,null,null,null,null,null,null,null,null,null,null,null,null,null,null,null,null,null,null,null,null,null,null,null,null,"Geochemical & Environmental Research Group"]
[null,null,null,null,null,null,null,null,null,null,null,null,null,null,null,null,null,null,null,null,null,null,null,null,null,null,null,null,null,null,null,null,null,null,null,null,"INSTITUCIÓN EDUCATIVA DEPARTAMENTAL SAN JOSÉ"]
[null,null,null,null,null,null,null,null,null,null,null,null,null,null,null,null,null,null,null,null,null,null,null,null,null,null,null,null,null,null,null,null,null,null,null,null,"Institut de Recherche pour le Developpement"]
[null,null,null,null,null,null,null,null,null,null,null,null,null,null,null,null,null,null,null,null,null,null,null,null,null,null,null,null,null,null,null,null,null,null,null,null,"Instituto Colombiano para el Desarrollo de la Ciencia y la Tecnología"]
[null,null,null,null,null,null,null,null,null,null,null,null,null,null,null,null,null,null,null,null,null,null,null,null,null,null,null,null,null,null,null,null,null,null,null,null,"Instituto Colombo Alemán de Investigaciones Científicas de Punta de Betín"]
[null,null,null,null,null,null,null,null,null,null,null,null,null,null,null,null,null,null,null,null,null,null,null,null,null,null,null,null,null,null,null,null,null,null,null,null,"Instituto INVEMAR - Fundación Omacha"]
[null,null,null,null,null,null,null,null,null,null,null,null,null,null,null,null,null,null,null,null,null,null,null,null,null,null,null,null,null,null,null,null,null,null,null,null,"Instituto Nacional de los Recursos Naturales Renovables y del Ambiente"]
[null,null,null,null,null,null,null,null,null,null,null,null,null,null,null,null,null,null,null,null,null,null,null,null,null,null,null,null,null,null,null,null,null,null,null,null,"Instituto de Ciencias del Mar y Limnología (ICML)"]
[null,null,null,null,null,null,null,null,null,null,null,null,null,null,null,null,null,null,null,null,null,null,null,null,null,null,null,null,null,null,null,null,null,null,null,null,"Instituto de Investigaciones Ambientales del Pacifico"]
[null,null,null,null,null,null,null,null,null,null,null,null,null,null,null,null,null,null,null,null,null,null,null,null,null,null,null,null,null,null,null,null,null,null,null,null,"Instituto de Investigaciones Marinas y Costeras"]
[null,null,null,null,null,null,null,null,null,null,null,null,null,null,null,null,null,null,null,null,null,null,null,null,null,null,null,null,null,null,null,null,null,null,null,null,"Instituto de Investigaciones Marinas y Costeras - AGR"]
[null,null,null,null,null,null,null,null,null,null,null,null,null,null,null,null,null,null,null,null,null,null,null,null,null,null,null,null,null,null,null,null,null,null,null,null,"Instituto de Investigaciones Marinas y Costeras - BVT"]
[null,null,null,null,null,null,null,null,null,null,null,null,null,null,null,null,null,null,null,null,null,null,null,null,null,null,null,null,null,null,null,null,null,null,null,null,"Instituto de Investigaciones Marinas y Costeras - CPT"]
[null,null,null,null,null,null,null,null,null,null,null,null,null,null,null,null,null,null,null,null,null,null,null,null,null,null,null,null,null,null,null,null,null,null,null,null,"Instituto de Investigación Recursos Biológicos Alexander von Humboldt"]
[null,null,null,null,null,null,null,null,null,null,null,null,null,null,null,null,null,null,null,null,null,null,null,null,null,null,null,null,null,null,null,null,null,null,null,null,"Instituto de Oceanologia Cuba"]
[null,null,null,null,null,null,null,null,null,null,null,null,null,null,null,null,null,null,null,null,null,null,null,null,null,null,null,null,null,null,null,null,null,null,null,null,"Inter-American Tropical Tuna Commission"]
[null,null,null,null,null,null,null,null,null,null,null,null,null,null,null,null,null,null,null,null,null,null,null,null,null,null,null,null,null,null,null,null,null,null,null,null,"Laboratorio Microbiológico Ortiz Martinez "]
[null,null,null,null,null,null,null,null,null,null,null,null,null,null,null,null,null,null,null,null,null,null,null,null,null,null,null,null,null,null,null,null,null,null,null,null,"Literature report"]
[null,null,null,null,null,null,null,null,null,null,null,null,null,null,null,null,null,null,null,null,null,null,null,null,null,null,null,null,null,null,null,null,null,null,null,null,"MCS Consultoría y Monitoreo ambiental S.A.S"]
[null,null,null,null,null,null,null,null,null,null,null,null,null,null,null,null,null,null,null,null,null,null,null,null,null,null,null,null,null,null,null,null,null,null,null,null,"Makarela S.A.S"]
[null,null,null,null,null,null,null,null,null,null,null,null,null,null,null,null,null,null,null,null,null,null,null,null,null,null,null,null,null,null,null,null,null,null,null,null,"Makuriwa - Museo de Historia Natural Marina de Colombia"]
[null,null,null,null,null,null,null,null,null,null,null,null,null,null,null,null,null,null,null,null,null,null,null,null,null,null,null,null,null,null,null,null,null,null,null,null,"Manchester Metropolitan University"]
[null,null,null,null,null,null,null,null,null,null,null,null,null,null,null,null,null,null,null,null,null,null,null,null,null,null,null,null,null,null,null,null,null,null,null,null,"Marine & Port Consultants"]
[null,null,null,null,null,null,null,null,null,null,null,null,null,null,null,null,null,null,null,null,null,null,null,null,null,null,null,null,null,null,null,null,null,null,null,null,"Marine Environment Laboratories"]
[null,null,null,null,null,null,null,null,null,null,null,null,null,null,null,null,null,null,null,null,null,null,null,null,null,null,null,null,null,null,null,null,null,null,null,null,"Ministerio de Ciencia, Tecnología e Innovación"]
[null,null,null,null,null,null,null,null,null,null,null,null,null,null,null,null,null,null,null,null,null,null,null,null,null,null,null,null,null,null,null,null,null,null,null,null,"Ministerio del Ambiente Haiti"]
[null,null,null,null,null,null,null,null,null,null,null,null,null,null,null,null,null,null,null,null,null,null,null,null,null,null,null,null,null,null,null,null,null,null,null,null,"Ministerio del Ambiente y Desarrollo Sostenible"]
[null,null,null,null,null,null,null,null,null,null,null,null,null,null,null,null,null,null,null,null,null,null,null,null,null,null,null,null,null,null,null,null,null,null,null,null,"Ministerio del Ambiente y Desarrollo Sostenible"]
[null,null,null,null,null,null,null,null,null,null,null,null,null,null,null,null,null,null,null,null,null,null,null,null,null,null,null,null,null,null,null,null,null,null,null,null,"Museo Historia Natural Universidad del Cauca"]
[null,null,null,null,null,null,null,null,null,null,null,null,null,null,null,null,null,null,null,null,null,null,null,null,null,null,null,null,null,null,null,null,null,null,null,null,"Museu de Zoologia da Universidade de São Paulo"]
[null,null,null,null,null,null,null,null,null,null,null,null,null,null,null,null,null,null,null,null,null,null,null,null,null,null,null,null,null,null,null,null,null,null,null,null,"NOAA Southwest Fisheries Science Center"]
[null,null,null,null,null,null,null,null,null,null,null,null,null,null,null,null,null,null,null,null,null,null,null,null,null,null,null,null,null,null,null,null,null,null,null,null,"National Environment and Planning Agency"]
[null,null,null,null,null,null,null,null,null,null,null,null,null,null,null,null,null,null,null,null,null,null,null,null,null,null,null,null,null,null,null,null,null,null,null,null,"National Oceanic and Atmospheric Administration"]
[null,null,null,null,null,null,null,null,null,null,null,null,null,null,null,null,null,null,null,null,null,null,null,null,null,null,null,null,null,null,null,null,null,null,null,null,"OBIMAR. Empresa Portuaria Quetzal"]
[null,null,null,null,null,null,null,null,null,null,null,null,null,null,null,null,null,null,null,null,null,null,null,null,null,null,null,null,null,null,null,null,null,null,null,null,"OBIS-SEAMAP"]
[null,null,null,null,null,null,null,null,null,null,null,null,null,null,null,null,null,null,null,null,null,null,null,null,null,null,null,null,null,null,null,null,null,null,null,null,"Ocean Biogeographic Information System"]
[null,null,null,null,null,null,null,null,null,null,null,null,null,null,null,null,null,null,null,null,null,null,null,null,null,null,null,null,null,null,null,null,null,null,null,null,"Oceanario de las Islas del Rosario - CEINER"]
[null,null,null,null,null,null,null,null,null,null,null,null,null,null,null,null,null,null,null,null,null,null,null,null,null,null,null,null,null,null,null,null,null,null,null,null,"Orgánismo Internacional de Energía Atómica"]
[null,null,null,null,null,null,null,null,null,null,null,null,null,null,null,null,null,null,null,null,null,null,null,null,null,null,null,null,null,null,null,null,null,null,null,null,"Parque Nacional Natural Gorgona"]
[null,null,null,null,null,null,null,null,null,null,null,null,null,null,null,null,null,null,null,null,null,null,null,null,null,null,null,null,null,null,null,null,null,null,null,null,"Parques Nacionales Naturales de Colombia"]
[null,null,null,null,null,null,null,null,null,null,null,null,null,null,null,null,null,null,null,null,null,null,null,null,null,null,null,null,null,null,null,null,null,null,null,null,"Parques Nacionales Naturales de Colombia "]
[null,null,null,null,null,null,null,null,null,null,null,null,null,null,null,null,null,null,null,null,null,null,null,null,null,null,null,null,null,null,null,null,null,null,null,null,"Particular"]
[null,null,null,null,null,null,null,null,null,null,null,null,null,null,null,null,null,null,null,null,null,null,null,null,null,null,null,null,null,null,null,null,null,null,null,null,"Pontificia Universidad Javeriana"]
[null,null,null,null,null,null,null,null,null,null,null,null,null,null,null,null,null,null,null,null,null,null,null,null,null,null,null,null,null,null,null,null,null,null,null,null,"RAC-CIMAB"]
[null,null,null,null,null,null,null,null,null,null,null,null,null,null,null,null,null,null,null,null,null,null,null,null,null,null,null,null,null,null,null,null,null,null,null,null,"Repsol Exploración Colombia S.A."]
[null,null,null,null,null,null,null,null,null,null,null,null,null,null,null,null,null,null,null,null,null,null,null,null,null,null,null,null,null,null,null,null,null,null,null,null,"Secretaría de Recursos Naturales y Ambiente (SERNA)/Centro de Estudios y Control de Contaminantes (CESCCO)"]
[null,null,null,null,null,null,null,null,null,null,null,null,null,null,null,null,null,null,null,null,null,null,null,null,null,null,null,null,null,null,null,null,null,null,null,null,"Servicios de Ingeniería Ambiental"]
[null,null,null,null,null,null,null,null,null,null,null,null,null,null,null,null,null,null,null,null,null,null,null,null,null,null,null,null,null,null,null,null,null,null,null,null,"Shell Exploration & Production Colombia GMBH"]
[null,null,null,null,null,null,null,null,null,null,null,null,null,null,null,null,null,null,null,null,null,null,null,null,null,null,null,null,null,null,null,null,null,null,null,null,"Smithsonian Institution"]
[null,null,null,null,null,null,null,null,null,null,null,null,null,null,null,null,null,null,null,null,null,null,null,null,null,null,null,null,null,null,null,null,null,null,null,null,"Sociedad Portuaria Rio Cordoba - Colombian Natural Resources S.A.S."]
[null,null,null,null,null,null,null,null,null,null,null,null,null,null,null,null,null,null,null,null,null,null,null,null,null,null,null,null,null,null,null,null,null,null,null,null,"Sociedad Portuaria de Santa Marta"]
[null,null,null,null,null,null,null,null,null,null,null,null,null,null,null,null,null,null,null,null,null,null,null,null,null,null,null,null,null,null,null,null,null,null,null,null,"UNIVERSIDAD DE PUERTO RICO EN HUMACAO"]
[null,null,null,null,null,null,null,null,null,null,null,null,null,null,null,null,null,null,null,null,null,null,null,null,null,null,null,null,null,null,null,null,null,null,null,null,"UR Camelia, IRD"]
[null,null,null,null,null,null,null,null,null,null,null,null,null,null,null,null,null,null,null,null,null,null,null,null,null,null,null,null,null,null,null,null,null,null,null,null,"United Nations Environment Programme - Caribbean Regional Coordinating Unit"]
[null,null,null,null,null,null,null,null,null,null,null,null,null,null,null,null,null,null,null,null,null,null,null,null,null,null,null,null,null,null,null,null,null,null,null,null,"Universidad Autónoma de Santo Domingo"]
[null,null,null,null,null,null,null,null,null,null,null,null,null,null,null,null,null,null,null,null,null,null,null,null,null,null,null,null,null,null,null,null,null,null,null,null,"Universidad Federal de Bahía"]
[null,null,null,null,null,null,null,null,null,null,null,null,null,null,null,null,null,null,null,null,null,null,null,null,null,null,null,null,null,null,null,null,null,null,null,null,"Universidad Jorje Tadeo Lozano-Museo del Mar"]
[null,null,null,null,null,null,null,null,null,null,null,null,null,null,null,null,null,null,null,null,null,null,null,null,null,null,null,null,null,null,null,null,null,null,null,null,"Universidad Nacional Mayor de San Marcos"]
[null,null,null,null,null,null,null,null,null,null,null,null,null,null,null,null,null,null,null,null,null,null,null,null,null,null,null,null,null,null,null,null,null,null,null,null,"Universidad Nacional de Colombia"]
[null,null,null,null,null,null,null,null,null,null,null,null,null,null,null,null,null,null,null,null,null,null,null,null,null,null,null,null,null,null,null,null,null,null,null,null,"Universidad Simón Bolivar"]
[null,null,null,null,null,null,null,null,null,null,null,null,null,null,null,null,null,null,null,null,null,null,null,null,null,null,null,null,null,null,null,null,null,null,null,null,"Universidad de Antioquia"]
[null,null,null,null,null,null,null,null,null,null,null,null,null,null,null,null,null,null,null,null,null,null,null,null,null,null,null,null,null,null,null,null,null,null,null,null,"Universidad de Bogotá Jorge Tadeo Lozano, Fac. de Ciencias Naturales e Ingenieria"]
[null,null,null,null,null,null,null,null,null,null,null,null,null,null,null,null,null,null,null,null,null,null,null,null,null,null,null,null,null,null,null,null,null,null,null,null,"Universidad de Cartagena"]
[null,null,null,null,null,null,null,null,null,null,null,null,null,null,null,null,null,null,null,null,null,null,null,null,null,null,null,null,null,null,null,null,null,null,null,null,"Universidad de Córdoba"]
[null,null,null,null,null,null,null,null,null,null,null,null,null,null,null,null,null,null,null,null,null,null,null,null,null,null,null,null,null,null,null,null,null,null,null,null,"Universidad de Florida"]
[null,null,null,null,null,null,null,null,null,null,null,null,null,null,null,null,null,null,null,null,null,null,null,null,null,null,null,null,null,null,null,null,null,null,null,null,"Universidad de Giessen"]
[null,null,null,null,null,null,null,null,null,null,null,null,null,null,null,null,null,null,null,null,null,null,null,null,null,null,null,null,null,null,null,null,null,null,null,null,"Universidad de Ibague"]
[null,null,null,null,null,null,null,null,null,null,null,null,null,null,null,null,null,null,null,null,null,null,null,null,null,null,null,null,null,null,null,null,null,null,null,null,"Universidad de La Sabana"]
[null,null,null,null,null,null,null,null,null,null,null,null,null,null,null,null,null,null,null,null,null,null,null,null,null,null,null,null,null,null,null,null,null,null,null,null,"Universidad de Oriente - Núcleo de Sucre"]
[null,null,null,null,null,null,null,null,null,null,null,null,null,null,null,null,null,null,null,null,null,null,null,null,null,null,null,null,null,null,null,null,null,null,null,null,"Universidad de la Guajira"]
[null,null,null,null,null,null,null,null,null,null,null,null,null,null,null,null,null,null,null,null,null,null,null,null,null,null,null,null,null,null,null,null,null,null,null,null,"Universidad del Magdalena"]
[null,null,null,null,null,null,null,null,null,null,null,null,null,null,null,null,null,null,null,null,null,null,null,null,null,null,null,null,null,null,null,null,null,null,null,null,"Universidad del Norte"]
[null,null,null,null,null,null,null,null,null,null,null,null,null,null,null,null,null,null,null,null,null,null,null,null,null,null,null,null,null,null,null,null,null,null,null,null,"Universidad del Pacífico"]
[null,null,null,null,null,null,null,null,null,null,null,null,null,null,null,null,null,null,null,null,null,null,null,null,null,null,null,null,null,null,null,null,null,null,null,null,"Universidad del Tolima"]
[null,null,null,null,null,null,null,null,null,null,null,null,null,null,null,null,null,null,null,null,null,null,null,null,null,null,null,null,null,null,null,null,null,null,null,null,"Universidad del Valle"]
[null,null,null,null,null,null,null,null,null,null,null,null,null,null,null,null,null,null,null,null,null,null,null,null,null,null,null,null,null,null,null,null,null,null,null,null,"Universidae do Cerá, Estaçao de Biologia Marinha"]
[null,null,null,null,null,null,null,null,null,null,null,null,null,null,null,null,null,null,null,null,null,null,null,null,null,null,null,null,null,null,null,null,null,null,null,null,"University of New Hampshire"]
[null,null,null,null,null,null,null,null,null,null,null,null,null,null,null,null,null,null,null,null,null,null,null,null,null,null,null,null,null,null,null,null,null,null,null,null,"Université de Montpellier"]
[null,null,null,null,null,null,null,null,null,null,null,null,null,null,null,null,null,null,null,null,null,null,null,null,null,null,null,null,null,null,null,null,null,null,null,null,"Virginia Institute of Marine Science / Smithsonian Institution"]
[null,null,null,null,null,null,null,null,null,null,null,null,null,null,null,null,null,null,null,null,null,null,null,null,null,null,null,null,null,null,null,null,null,null,null,null,"Wildlife Conservation Society"]

{"sheet":"Otras referencias","index":5,"n_rows":48,"n_cols":20,"rows_kept":48,"cut":false,"hidden":false,"merged":[[0,0,2,6],[4,0,4,1],[4,10,4,11],[21,0,21,5],[23,5,25,5],[26,5,47,5],[21,7,21,18],[4,13,4,15],[4,3,4,5],[4,7,4,8],[11,7,11,8],[17,7,17,8],[4,17,4,19]]}
["Estas son listas para variables con valores que no se encuentran codificados, pero que deben manejarse de manera estandarizada. \nSi se requiere agregar un valor nuevo hagalo debajo de la lista correspondiente"]
[]
[]
[]
["UNIDADES DE MEDIDA",null,null,"PROYECTO",null,null,null,"ROLES",null,null,"METODOLOGIAS",null,null,"TEMATICAS",null,null,null,"CODIGOS LOV"]
["CODIGO","DESCRIPCION",null,"COD","PROYECTO","PROYECTO DESC",null,4,"Captura en campo",null,"CODIGO","DESCRIPCION",null,"COD METODOLOGIA","COD TEMATICA","DESCRIPCION",null,"DESCRIPCIÓN","CÓDIGO","GRUPO"]
[10,"cm",null,3036,"Monitoreo Pastos - BPIN","Monitoreo de Pastos Marinos de Colombia",null,6,"Revisar datos",null,817,"Pastos-Estructura",null,817,221,"ESTRUCTURA",null,"Departamento",10,2]
[11,"m",null,null,null,null,null,3497,"Coordinador actividad de campo",null,null,null,null,null,null,null,null,"Sector",20,2]
[69,"g",null,null,null,null,null,4526,"Procesamiento en laboratorio",null,null,null,null,null,null,null,null,"Punto",30,2]
[142,"Ind/Estación",null,null,null,null,null,null,null,null,null,null,null,null,null,null,null,"Parcela",35,2]
[null,null,null,null,null,null,null,null,null,null,null,null,null,null,null,null,null,"Estaciones",40,2]
[null,null,null,null,null,null,null,"TRANSECTO",null,null,null,null,null,null,null,null,null,"Region",50,2]
[null,null,null,null,null,null,null,"A","Opción A",null,null,null,null,null,null,null,null,"Unidad_de_Manejo",60,2]
[null,null,null,null,null,null,null,"B","Opción B",null,null,null,null,null,null,null,null,"Unidad_Ambiental_Costera",70,2]
[null,null,null,null,null,null,null,"C","Opción C",null,null,null,null,null,null,null,null,"Localidad",80,2]
[null,null,null,null,null,null,null,null,null,null,null,null,null,null,null,null,null,"Bloque_Exploracion",85,2]
[null,null,null,null,null,null,null,null,null,null,null,null,null,null,null,null,null,"Area",90,2]
[null,null,null,null,null,null,null,"OPCIONES"]
[null,null,null,null,null,null,null,"SI",4337]
[null,null,null,null,null,null,null,"NO",4338]
[]
["ESTACIONES",null,null,null,null,null,null,"CUADRANTES TRANSECTO"]
["PrefijoCdgEstLoc","SecuenciaLoc","Lugar","CodigoEstacionLoc","DescripcionEstacionLoc","ID PROYECTO RELACIONADO",null,"TRANSECTO","#CUADRANTE","COMBINACION","CUADRANTE","TRANSECTO","#CUADRANTE","COMBINACION","CUADRANTE","TRANSECTO","#CUADRANTE","COMINACION","CUADRANTE"]
["CAMP",49089,"Camp",1,"COR-Camp","Estaciones CORALINA - ID Proyecto 3422",null,"A",1,{"$f":"CONCATENATE(H24,I24)","v":"A1"},2,"B",1,{"$f":"CONCATENATE(L24,M24)","v":"B1"},9,"C",1,{"$f":"CONCATENATE(P24,Q24)","v":"C1"},5]
["MCOR",49087,"McBean",1,"COR-McBean",null,null,"A",2,"A2",7,"B",2,"B2",10,"C",2,"C2",7]
["SFEL",49088,"San Felipe",1,"COR-San Felipe",null,null,"A",3,"A3",8,"B",3,"B3",15,"C",3,"C3",10]
[{"$f":"IF(referentes!Z2=\"\",\"\",referentes!Z2)","v":"AHUY"},{"$f":"IF(referentes!AA2=\"\",\"\",referentes!AA2)","v":57180},{"$f":"IF(referentes!AB2=\"\",\"\",referentes!AB2)","v":"Ahuyama"},{"$f":"IF(referentes!AC2=\"\",\"\",referentes!AC2)","v":1},{"$f":"IF(referentes!AD2=\"\",\"\",referentes!AD2)","v":"MN-Ahuyama"},"Estaciones PASTOS - ID PROYECTO 3036",null,"A",4,"A4",16,"B",4,"B4",17,"C",4,"C4",18]
[{"$f":"IF(referentes!Z3=\"\",\"\",referentes!Z3)","v":"BPOR"},{"$f":"IF(referentes!AA3=\"\",\"\",referentes!AA3)","v":43727},{"$f":"IF(referentes!AB3=\"\",\"\",referentes!AB3)","v":"Bahía Portete"},{"$f":"IF(referentes!AC3=\"\",\"\",referentes!AC3)","v":3},{"$f":"IF(referentes!AD3=\"\",\"\",referentes!AD3)","v":"MN-Bahía Portete"},null,null,"A",5,"A5",18,"B",5,"B5",22,"C",5,"C5",19]
[{"$f":"IF(referentes!Z4=\"\",\"\",referentes!Z4)","v":"BALL"},{"$f":"IF(referentes!AA4=\"\",\"\",referentes!AA4)","v":48586},{"$f":"IF(referentes!AB4=\"\",\"\",referentes!AB4)","v":"Ballenas"},{"$f":"IF(referentes!AC4=\"\",\"\",referentes!AC4)","v":1},{"$f":"IF(referentes!AD4=\"\",\"\",referentes!AD4)","v":"MN-Ballenas"},null,null,"A",6,"A6",25,"B",6,"B6",25,"C",6,"C6",22]
[{"$f":"IF(referentes!Z5=\"\",\"\",referentes!Z5)","v":"CVEL"},{"$f":"IF(referentes!AA5=\"\",\"\",referentes!AA5)","v":48584},{"$f":"IF(referentes!AB5=\"\",\"\",referentes!AB5)","v":"Cabo de la Vela"},{"$f":"IF(referentes!AC5=\"\",\"\",referentes!AC5)","v":3},{"$f":"IF(referentes!AD5=\"\",\"\",referentes!AD5)","v":"MN-Cabo de la Vela"},null,null,"A",7,"A7",26,"B",7,"B7",28,"C",7,"C7",26]
[{"$f":"IF(referentes!Z6=\"\",\"\",referentes!Z6)","v":"CVNU"},{"$f":"IF(referentes!AA6=\"\",\"\",referentes!AA6)","v":49303},{"$f":"IF(referentes!AB6=\"\",\"\",referentes!AB6)","v":"Cabo de la Vela"},{"$f":"IF(referentes!AC6=\"\",\"\",referentes!AC6)","v":2},{"$f":"IF(referentes!AD6=\"\",\"\",referentes!AD6)","v":"MN-Cabo Nuevo"},null,null,"A",8,"A8",33,"B",8,"B8",31,"C",8,"C8",34]
[{"$f":"IF(referentes!Z7=\"\",\"\",referentes!Z7)","v":"CPLA"},{"$f":"IF(referentes!AA7=\"\",\"\",referentes!AA7)","v":57179},{"$f":"IF(referentes!AB7=\"\",\"\",referentes!AB7)","v":"Cabo playa"},{"$f":"IF(referentes!AC7=\"\",\"\",referentes!AC7)","v":1},{"$f":"IF(referentes!AD7=\"\",\"\",referentes!AD7)","v":"MN-Cabo playa"},null,null,"A",9,"A9",38,"B",9,"B9",35,"C",9,"C9",35]
[{"$f":"IF(referentes!Z8=\"\",\"\",referentes!Z8)","v":"CARR"},{"$f":"IF(referentes!AA8=\"\",\"\",referentes!AA8)","v":57178},{"$f":"IF(referentes!AB8=\"\",\"\",referentes!AB8)","v":"Carrizal"},{"$f":"IF(referentes!AC8=\"\",\"\",referentes!AC8)","v":1},{"$f":"IF(referentes!AD8=\"\",\"\",referentes!AD8)","v":"MN-Carrizal"},null,null,"A",10,"A10",40,"B",10,"B10",37,"C",10,"C10",38]
[{"$f":"IF(referentes!Z9=\"\",\"\",referentes!Z9)","v":"CHEN"},{"$f":"IF(referentes!AA9=\"\",\"\",referentes!AA9)","v":43120},{"$f":"IF(referentes!AB9=\"\",\"\",referentes!AB9)","v":"Chengue"},{"$f":"IF(referentes!AC9=\"\",\"\",referentes!AC9)","v":2},{"$f":"IF(referentes!AD9=\"\",\"\",referentes!AD9)","v":"MN-Chengue"},null,null,"A",11,"A11",44,"B",11,"B11",39,"C",11,"C11",43]
[{"$f":"IF(referentes!Z10=\"\",\"\",referentes!Z10)","v":"CINT"},{"$f":"IF(referentes!AA10=\"\",\"\",referentes!AA10)","v":43121},{"$f":"IF(referentes!AB10=\"\",\"\",referentes!AB10)","v":"Cinto"},{"$f":"IF(referentes!AC10=\"\",\"\",referentes!AC10)","v":3},{"$f":"IF(referentes!AD10=\"\",\"\",referentes!AD10)","v":"MN-Cinto"},null,null,"A",12,"A12",46,"B",12,"B12",45,"C",12,"C12",44]
[{"$f":"IF(referentes!Z11=\"\",\"\",referentes!Z11)","v":"CCAY"},{"$f":"IF(referentes!AA11=\"\",\"\",referentes!AA11)","v":48964},{"$f":"IF(referentes!AB11=\"\",\"\",referentes!AB11)","v":"Cotton Cay"},{"$f":"IF(referentes!AC11=\"\",\"\",referentes!AC11)","v":1},{"$f":"IF(referentes!AD11=\"\",\"\",referentes!AD11)","v":"MN-Cotton Cay"}]
[{"$f":"IF(referentes!Z12=\"\",\"\",referentes!Z12)","v":"IMAN"},{"$f":"IF(referentes!AA12=\"\",\"\",referentes!AA12)","v":43118},{"$f":"IF(referentes!AB12=\"\",\"\",referentes!AB12)","v":"Isla Mangle"},{"$f":"IF(referentes!AC12=\"\",\"\",referentes!AC12)","v":2},{"$f":"IF(referentes!AD12=\"\",\"\",referentes!AD12)","v":"MN-Isla Mangle"}]
[{"$f":"IF(referentes!Z13=\"\",\"\",referentes!Z13)","v":"IROS"},{"$f":"IF(referentes!AA13=\"\",\"\",referentes!AA13)","v":43117},{"$f":"IF(referentes!AB13=\"\",\"\",referentes!AB13)","v":"Isla Rosario"},{"$f":"IF(referentes!AC13=\"\",\"\",referentes!AC13)","v":1},{"$f":"IF(referentes!AD13=\"\",\"\",referentes!AD13)","v":"MN-Isla Rosario"}]
[{"$f":"IF(referentes!Z14=\"\",\"\",referentes!Z14)","v":"ISLE"},{"$f":"IF(referentes!AA14=\"\",\"\",referentes!AA14)","v":48966},{"$f":"IF(referentes!AB14=\"\",\"\",referentes!AB14)","v":"Isleño"},{"$f":"IF(referentes!AC14=\"\",\"\",referentes!AC14)","v":1},{"$f":"IF(referentes!AD14=\"\",\"\",referentes!AD14)","v":"MN-Isleño"}]
[{"$f":"IF(referentes!Z15=\"\",\"\",referentes!Z15)","v":"KAUR"},{"$f":"IF(referentes!AA15=\"\",\"\",referentes!AA15)","v":51465},{"$f":"IF(referentes!AB15=\"\",\"\",referentes!AB15)","v":"Manaure"},{"$f":"IF(referentes!AC15=\"\",\"\",referentes!AC15)","v":1},{"$f":"IF(referentes!AD15=\"\",\"\",referentes!AD15)","v":"MN-Kaurrele"}]
[{"$f":"IF(referentes!Z16=\"\",\"\",referentes!Z16)","v":"MANA"},{"$f":"IF(referentes!AA16=\"\",\"\",referentes!AA16)","v":48585},{"$f":"IF(referentes!AB16=\"\",\"\",referentes!AB16)","v":"Manaure"},{"$f":"IF(referentes!AC16=\"\",\"\",referentes!AC16)","v":2},{"$f":"IF(referentes!AD16=\"\",\"\",referentes!AD16)","v":"MN-Manaure"}]
[{"$f":"IF(referentes!Z17=\"\",\"\",referentes!Z17)","v":"MARA"},{"$f":"IF(referentes!AA17=\"\",\"\",referentes!AA17)","v":48965},{"$f":"IF(referentes!AB17=\"\",\"\",referentes!AB17)","v":"Marazul"},{"$f":"IF(referentes!AC17=\"\",\"\",referentes!AC17)","v":1},{"$f":"IF(referentes!AD17=\"\",\"\",referentes!AD17)","v":"MN-Marazul"}]
[{"$f":"IF(referentes!Z18=\"\",\"\",referentes!Z18)","v":"MBAY"},{"$f":"IF(referentes!AA18=\"\",\"\",referentes!AA18)","v":43123},{"$f":"IF(referentes!AB18=\"\",\"\",referentes!AB18)","v":"Mauricio Bay"},{"$f":"IF(referentes!AC18=\"\",\"\",referentes!AC18)","v":1},{"$f":"IF(referentes!AD18=\"\",\"\",referentes!AD18)","v":"MN-Mauricio Bay"}]
[{"$f":"IF(referentes!Z19=\"\",\"\",referentes!Z19)","v":"NEGU"},{"$f":"IF(referentes!AA19=\"\",\"\",referentes!AA19)","v":43119},{"$f":"IF(referentes!AB19=\"\",\"\",referentes!AB19)","v":"Neguanje"},{"$f":"IF(referentes!AC19=\"\",\"\",referentes!AC19)","v":1},{"$f":"IF(referentes!AD19=\"\",\"\",referentes!AD19)","v":"MN-Neguanje"}]
[{"$f":"IF(referentes!Z20=\"\",\"\",referentes!Z20)","v":"OCRE"},{"$f":"IF(referentes!AA20=\"\",\"\",referentes!AA20)","v":43122},{"$f":"IF(referentes!AB20=\"\",\"\",referentes!AB20)","v":"Oyster Creek"},{"$f":"IF(referentes!AC20=\"\",\"\",referentes!AC20)","v":2},{"$f":"IF(referentes!AD20=\"\",\"\",referentes!AD20)","v":"MN-Oyster Creek"}]
[{"$f":"IF(referentes!Z21=\"\",\"\",referentes!Z21)","v":"PINO"},{"$f":"IF(referentes!AA21=\"\",\"\",referentes!AA21)","v":48582},{"$f":"IF(referentes!AB21=\"\",\"\",referentes!AB21)","v":"Pinorroa"},{"$f":"IF(referentes!AC21=\"\",\"\",referentes!AC21)","v":2},{"$f":"IF(referentes!AD21=\"\",\"\",referentes!AD21)","v":"MN-Pinorroa"}]
[{"$f":"IF(referentes!Z22=\"\",\"\",referentes!Z22)","v":"PBLA"},{"$f":"IF(referentes!AA22=\"\",\"\",referentes!AA22)","v":52866},{"$f":"IF(referentes!AB22=\"\",\"\",referentes!AB22)","v":"Playa Blanca-Barú (PNN Corales del Rosario y San Bernardo)"},{"$f":"IF(referentes!AC22=\"\",\"\",referentes!AC22)","v":1},{"$f":"IF(referentes!AD22=\"\",\"\",referentes!AD22)","v":"MN-Playa Blanca-Barú"}]
[{"$f":"IF(referentes!Z23=\"\",\"\",referentes!Z23)","v":"TRIG"},{"$f":"IF(referentes!AA23=\"\",\"\",referentes!AA23)","v":48583},{"$f":"IF(referentes!AB23=\"\",\"\",referentes!AB23)","v":"Trigana"},{"$f":"IF(referentes!AC23=\"\",\"\",referentes!AC23)","v":1},{"$f":"IF(referentes!AD23=\"\",\"\",referentes!AD23)","v":"MN-Trigana"}]

{"sheet":"AGD_MUESTREOS","index":6,"n_rows":0,"n_cols":0,"rows_kept":0,"cut":false,"hidden":true,"merged":[]}

{"sheet":"AGD_PARAMETRO","index":7,"n_rows":0,"n_cols":0,"rows_kept":0,"cut":false,"hidden":true,"merged":[]}

{"sheet":"AGD_MUESTRAS","index":8,"n_rows":0,"n_cols":0,"rows_kept":0,"cut":false,"hidden":true,"merged":[]}

{"sheet":"AGD_MUESTRAS_VARIABLES","index":9,"n_rows":0,"n_cols":0,"rows_kept":0,"cut":false,"hidden":true,"merged":[]}

{"sheet":"AGD_AUTORIAS","index":10,"n_rows":0,"n_cols":0,"rows_kept":0,"cut":false,"hidden":true,"merged":[]}