{"text_format":"1","workbook":"xlsx","n_sheets":11,"sheets":["Registro de cambios","configuracion","DIGITADOR","DATOS","referentes","Otras referencias","AGD_MUESTREOS","AGD_PARAMETRO","AGD_MUESTRAS","AGD_MUESTRAS_VARIABLES","AGD_AUTORIAS"],"not_rendered":{"charts":0,"images":0,"macros":1,"external_links":1,"defined_names":21,"comments":2,"pivot_tables":0},"unopened":[],"bounds":{"document_bytes":16777216,"sheet_cells":100000,"rows_first":2000,"rows_last":500,"rows_between":2000,"halvings":0,"cell_chars":16384,"cell_head_chars":4096},"cells_cut":0,"cells_raw":0,"read":"whole","date_system":"1900"}

{"sheet":"Registro de cambios","index":0,"n_rows":6,"n_cols":7,"rows_kept":6,"cut":false,"hidden":true,"merged":[[2,3,2,6]]}
[]
[]
[null,null,null,"REGISTRO DE CAMBIOS"]
[null,null,null,"VERSIÓN No.","CAMBIO REALIZADO","AUTOR","VIGENTE DESDE\n(DD/MM/AAAA)"]
[null,null,null,"20240521i","Actualización del código de la macro.\n\nSe eliminó la URL de la antigua API de portete:\n       http://portete.invemar.org.co:7003/ArgosWebServices-RESTWebService-context-root/rest/1.0\n\nFue reemplazada por la URL de la API de ARGOS:\n       https://argos.invemar.org.co/api/\n\nLa API contiene End Points que permiten tener mayor control, facilitan la descarga de referentes (listas de usuarios, estaciones, especies, etc.) que corresponden a criterios específicos como el proyecto usado en la plantilla para evitar descargar data innecesaria.\n\nDel mismo modo, también permite la carga de información a la BDD del INVEMAR.\n\nLa macro toma los Endpoints desde la hoja configuracion de una tabla llamada \"Configuración referentes\", a la que se le puede modificar las rutas de la API o agregar nuevas. cabe resaltar que se puede \"quemar\" directamente en la macro los Endpoints que lo requieran.","Kevin Moreno","21/05/2024"]
[null,null,null,"20230813i","Se creó la plantilla de cero (0), los elementos que componen la plantilla funcionan para la temática de PASTOS - Abundancia.\n\nSe modificó la hoja de DIGITADOR añadiendo listas de valores como el responsable de la entrega de datos y atributos adicionales como 'Observaciones generales'.\n\nSe crearon todas las columnas que componente la hoja de DATOS, se obtienen valores como la fecha, estación, censo errante, especie, cantidad de peces, etc .\n\nSe mapeó toda la hoja de CONFIGURACIÓN para tomar los valores de los muestreos y muestras. De ese modo, se generan las tablas que sirven para subir la información al sistema.\n","Kevin Moreno","13/8/2023"]

{"sheet":"configuracion","index":1,"n_rows":71,"n_cols":8,"rows_kept":71,"cut":false,"hidden":true,"merged":[[61,0,61,2],[23,0,26,0],[0,0,2,0],[3,0,5,0],[7,0,8,0],[9,0,15,0],[17,0,21,0],[28,0,35,0],[37,0,42,0],[45,0,45,1],[45,5,45,7]]}
["general","urlServicio","https://argos.invemar.org.co/api/"]
[null,"fila de inicio",3]
[null,"fila de fin",303]
["metodologias","Metodologias",{"$f":"DIGITADOR!B4","v":818}]
[null,"Referentes",300]
[null,"Cantidad maxima de referentes ",300]
["estaciones/investigadores","proyectos",3036]
["Lista especies","metodologias",818]
[null,"proyectos",3036]
["MUESTREOS","ID_MUESTREO","DATOS,B"]
[null,"ID_ESTACION","DATOS,E"]
[null,"ID_PROYECTO",{"$f":"DIGITADOR!B11","v":3036}]
[null,"ID_METODOLOGIA",{"$f":"DIGITADOR!B4","v":818}]
[null,"ID_TEMATICAS",{"$f":"IF(C4=\"\",\"\",VLOOKUP(C4,'Otras referencias'!N7:P9,2,FALSE))","v":222}]
[null,"FECHA","DATOS,H"]
[null,"NOTAS","DIGITADOR,B,28"]
[null,"cantidad",303]
["MUESTREOS PARAMETROS","ID_MUESTREO","DATOS,B","DATOS,B","DATOS,B","DATOS,B"]
[null,"ID_PARAMETRO",1169,1055,1170,127]
[null,"ID_METODOLOGIA",{"$f":"DIGITADOR!$B$4","v":818},{"$f":"DIGITADOR!$B$4","v":818},{"$f":"DIGITADOR!$B$4","v":818},{"$f":"DIGITADOR!$B$4","v":818}]
{"$rows_left_out":52}
{"sheet":"DIGITADOR","index":2,"n_rows":38,"n_cols":4,"rows_kept":38,"cut":false,"hidden":false,"merged":[[37,1,37,2],[36,1,36,2],[0,0,0,1],[15,3,15,9],[16,3,16,9],[1,3,9,9],[10,3,14,9],[7,0,8,0],[26,0,26,1],[29,0,29,1]]}
["Recolección de Datos Monitoreo Pastos Abundancia Peces"]
["Código Digitador",{"$f":"IF(B3=\"\",\"\",INDEX(referentes!$Z$2:$AA$60,MATCH(DIGITADOR!B3,referentes!$AA$2:$AA$60,0),1))","v":""},null,"Recomendaciones generales: \n¡Precaución! No inserte Filas o Columnas.\nEn los casos en que falte un valor a ingresar que provenga de la hoja de referencias, informe para que el administrador del sistema haga las adiciones necesarias.\nEsta es una plantilla programada. Las columnas de color oscuro se llenan automaticamente, principalmente a partir de los contenidos de la hoja de referencias. \nNO UTILICE PUNTO Y COMA (;) en ningun campo, por ser el separador de variables (columnas). Las unidades de medida son las especificadas en la cabecera de la hoja.\nPara el correcto funcionamiento de la hoja debe estar activa la opcion de Excel de ejecutar macros (al abrir la hoja acepte la opcion habilitar macros, mensaje de Excel que aparece en la parte superior de la hoja en un recuadro amarillo). La extensión del archivo debe ser .xlsm.. \nAl finalizar, renombre el archivo de modo que su contenido sea claro, ejemplo:\nAAAAMMDD_METODOLOGIA_TEMATICA_ESTACION.xlsm. El nombre no debe tener espacios en blanco vocales tildadas o ñ."]
["Nombre del responsable",null,{"$f":"IF(G3=\"\",\"\",CONCATENATE(DIGITADOR!$M$1,G3,E3))","v":""}]
["Código Monitoreo",{"$f":"IF(B5=\"\",\"\",INDEX('Otras referencias'!$K$7:$L$9,MATCH(DIGITADOR!B5,'Otras referencias'!$L$7:$L$9,0),1))","v":818}]
["Monitoreo","Pastos-Abundancia Peces"]
["Entidad","Instituto de Investigaciones Marinas y Costeras"]
["Versión de la plantilla",{"$f":"'Registro de cambios'!$D$5","v":"20240521i"}]
["Fecha en la que ingresa los datos en esta hoja","DD/MM/AAAA"]
[null,"3000-12-12"]
[]
["Código del proyecto",{"$f":"IF(B12=\"\",\"\",INDEX('Otras referencias'!$D$7:$E$7,MATCH(DIGITADOR!B12,'Otras referencias'!$E$7:$E$7,0),1))","v":3036},null,"Previamente a iniciar el llenado de la plantilla, debe presionar el botón \"Descargar referentes\" para que los referentes de ésta plantilla sean actualizados. \nLuego de llenar completamente la plantilla verifique que:\na. No haya celdas con valores como \"#N/A\" o \"#¡REF!\".\nb. No se estén aplicando filtros en la hoja de datos.\nEnvíe la plantilla diligenciada al correo kevin.moreno@invemar.org.co"]
["Proyecto que financia","Monitoreo Pastos - BPIN"]
["Nombre del Archivo",{"$f":"MID(CELL(\"FILENAME\",N63),FIND(\"[\",CELL(\"FILENAME\",N63))+1,   FIND(\"]\",CELL(\"FILENAME\",N63))-FIND(\"[\",CELL(\"FILENAME\",N63))-1)","v":"PASTOS_ABUNDANCIA_20240521i.xlsm"}]
["DOI Metadato"]
["Fuente Plantilla ","http://cinto.invemar.org.co/download/Plantillas_ARGOS_Plus/"]
[null,null,null,"Si requiere ayuda contacte a:\nKevin S. Moreno (kevin.moreno@invemar.org.co)"]
["ROLES INVOLUCRADOS","NOMBRE DE LA PERSONA",null,"El custodio de los datos es el único autorizado para distribuir este conjunto de datos. El observador y el digitador se comprometen a tomar las medidas necesarias para salvaguardar este conjunto de datos de modo que copia de los mismos no sean obtenidas y/o usadas por terceros no relacionados con el propósito para la cual se recolectó."]
[{"$f":"IF(A19=\"\",\"\",INDEX('Otras referencias'!$H$6:$I$9,MATCH(DIGITADOR!A19,'Otras referencias'!$I$6:$I$9,0),1))","v":""},{"$f":"IF(B19=\"\",\"\",INDEX(referentes!$Z$2:$AA$60,MATCH(DIGITADOR!B19,referentes!$AA$2:$AA$60,0),1))","v":""}]
[]
[{"$f":"IF(A21=\"\",\"\",INDEX('Otras referencias'!$H$6:$I$9,MATCH(DIGITADOR!A21,'Otras referencias'!$I$6:$I$9,0),1))","v":""},{"$f":"IF(B21=\"\",\"\",INDEX(referentes!$Z$2:$AA$60,MATCH(DIGITADOR!B21,referentes!$AA$2:$AA$60,0),1))","v":""}]
{"$rows_left_out":19}
{"sheet":"DATOS","index":3,"n_rows":303,"n_cols":19,"rows_kept":303,"cut":false,"hidden":false,"merged":[[0,6,0,9],[0,11,0,18]]}
[null,null,null,null,null,null,"MUESTREO ",null,null,null,null,"MUESTRA"]
[{"$f":"TEXT(DIGITADOR!$B$9,\"yyyymmdd\")","v":"30001212"},"AGM MUESTREO","ID MUESTREO","ID MUESTRA","ID ESTACION",null,"Estación","Fecha\n(DD/MM/AAAA)",null,null,null,null,null,null,"Censo Errante\n(Replica)","ESPECIE","ID Especie","Cantidad de Peces","Observaciones"]
[null,{"$f":"IF(C3=\"\",\"\",IF(COUNTIF($C$3:C3, C3)>1, \"\", C3))","v":""},{"$f":"IF(H3=\"\",\"\",IF(G3=\"\",\"\",CONCATENATE(DIGITADOR!$M$1,H3,E3)))","v":""},{"$f":"IF(C3=\"\",\"\",CONCATENATE(C3,ROW()-2))","v":""},{"$f":"IF(G3=\"\",\"\",VLOOKUP(G3,'Otras referencias'!$A$24:$E$48,2,FALSE))","v":""},null,null,null,null,null,null,null,null,null,null,{"$f":"IF(Q3=\"\",\"\",VLOOKUP(Q3,referentes!$K$2:$R$209,2,FALSE))","v":""}]
[null,{"$f":"IF(C4=\"\",\"\",IF(COUNTIF($C$3:C4, C4)>1, \"\", C4))","v":""},{"$f":"IF(H4=\"\",\"\",CONCATENATE(DIGITADOR!$M$1,H4,E4))","v":""},{"$f":"IF(C4=\"\",\"\",CONCATENATE(C4,ROW()-2))","v":""},{"$f":"IF(G4=\"\",\"\",VLOOKUP(G4,'Otras referencias'!$A$24:$E$48,2,FALSE))","v":""},null,null,null,null,null,null,null,null,null,null,{"$f":"IF(Q4=\"\",\"\",VLOOKUP(Q4,referentes!$K$2:$R$209,2,FALSE))","v":""}]
[null,{"$f":"IF(C5=\"\",\"\",IF(COUNTIF($C$3:C5, C5)>1, \"\", C5))","v":""},{"$f":"IF(H5=\"\",\"\",CONCATENATE(DIGITADOR!$M$1,H5,E5))","v":""},"",{"$f":"IF(G5=\"\",\"\",VLOOKUP(G5,'Otras referencias'!$A$24:$E$48,2,FALSE))","v":""},null,null,null,null,null,null,null,null,null,null,{"$f":"IF(Q5=\"\",\"\",VLOOKUP(Q5,referentes!$K$2:$R$209,2,FALSE))","v":""}]
[null,{"$f":"IF(C6=\"\",\"\",IF(COUNTIF($C$3:C6, C6)>1, \"\", C6))","v":""},{"$f":"IF(H6=\"\",\"\",CONCATENATE(DIGITADOR!$M$1,H6,E6))","v":""},"",{"$f":"IF(G6=\"\",\"\",VLOOKUP(G6,'Otras referencias'!$A$24:$E$48,2,FALSE))","v":""},null,null,null,null,null,null,null,null,null,null,{"$f":"IF(Q6=\"\",\"\",VLOOKUP(Q6,referentes!$K$2:$R$209,2,FALSE))","v":""}]
[null,{"$f":"IF(C7=\"\",\"\",IF(COUNTIF($C$3:C7, C7)>1, \"\", C7))","v":""},{"$f":"IF(H7=\"\",\"\",CONCATENATE(DIGITADOR!$M$1,H7,E7))","v":""},"",{"$f":"IF(G7=\"\",\"\",VLOOKUP(G7,'Otras referencias'!$A$24:$E$48,2,FALSE))","v":""},null,null,null,null,null,null,null,null,null,null,{"$f":"IF(Q7=\"\",\"\",VLOOKUP(Q7,referentes!$K$2:$R$209,2,FALSE))","v":""}]
[null,{"$f":"IF(C8=\"\",\"\",IF(COUNTIF($C$3:C8, C8)>1, \"\", C8))","v":""},{"$f":"IF(H8=\"\",\"\",CONCATENATE(DIGITADOR!$M$1,H8,E8))","v":""},"",{"$f":"IF(G8=\"\",\"\",VLOOKUP(G8,'Otras referencias'!$A$24:$E$48,2,FALSE))","v":""},null,null,null,null,null,null,null,null,null,null,{"$f":"IF(Q8=\"\",\"\",VLOOKUP(Q8,referentes!$K$2:$R$209,2,FALSE))","v":""}]
[null,{"$f":"IF(C9=\"\",\"\",IF(COUNTIF($C$3:C9, C9)>1, \"\", C9))","v":""},{"$f":"IF(H9=\"\",\"\",CONCATENATE(DIGITADOR!$M$1,H9,E9))","v":""},"",{"$f":"IF(G9=\"\",\"\",VLOOKUP(G9,'Otras referencias'!$A$24:$E$48,2,FALSE))","v":""},null,null,null,null,null,null,null,null,null,null,{"$f":"IF(Q9=\"\",\"\",VLOOKUP(Q9,referentes!$K$2:$R$209,2,FALSE))","v":""}]
[null,{"$f":"IF(C10=\"\",\"\",IF(COUNTIF($C$3:C10, C10)>1, \"\", C10))","v":""},{"$f":"IF(H10=\"\",\"\",CONCATENATE(DIGITADOR!$M$1,H10,E10))","v":""},"",{"$f":"IF(G10=\"\",\"\",VLOOKUP(G10,'Otras referencias'!$A$24:$E$48,2,FALSE))","v":""},null,null,null,null,null,null,null,null,null,null,{"$f":"IF(Q10=\"\",\"\",VLOOKUP(Q10,referentes!$K$2:$R$209,2,FALSE))","v":""}]
[null,{"$f":"IF(C11=\"\",\"\",IF(COUNTIF($C$3:C11, C11)>1, \"\", C11))","v":""},{"$f":"IF(H11=\"\",\"\",CONCATENATE(DIGITADOR!$M$1,H11,E11))","v":""},"",{"$f":"IF(G11=\"\",\"\",VLOOKUP(G11,'Otras referencias'!$A$24:$E$48,2,FALSE))","v":""},null,null,null,null,null,null,null,null,null,null,{"$f":"IF(Q11=\"\",\"\",VLOOKUP(Q11,referentes!$K$2:$R$209,2,FALSE))","v":""}]
[null,{"$f":"IF(C12=\"\",\"\",IF(COUNTIF($C$3:C12, C12)>1, \"\", C12))","v":""},{"$f":"IF(H12=\"\",\"\",CONCATENATE(DIGITADOR!$M$1,H12,E12))","v":""},"",{"$f":"IF(G12=\"\",\"\",VLOOKUP(G12,'Otras referencias'!$A$24:$E$48,2,FALSE))","v":""},null,null,null,null,null,null,null,null,null,null,{"$f":"IF(Q12=\"\",\"\",VLOOKUP(Q12,referentes!$K$2:$R$209,2,FALSE))","v":""}]
[null,{"$f":"IF(C13=\"\",\"\",IF(COUNTIF($C$3:C13, C13)>1, \"\", C13))","v":""},{"$f":"IF(H13=\"\",\"\",CONCATENATE(DIGITADOR!$M$1,H13,E13))","v":""},"",{"$f":"IF(G13=\"\",\"\",VLOOKUP(G13,'Otras referencias'!$A$24:$E$48,2,FALSE))","v":""},null,null,null,null,null,null,null,null,null,null,{"$f":"IF(Q13=\"\",\"\",VLOOKUP(Q13,referentes!$K$2:$R$209,2,FALSE))","v":""}]
[null,{"$f":"IF(C14=\"\",\"\",IF(COUNTIF($C$3:C14, C14)>1, \"\", C14))","v":""},{"$f":"IF(H14=\"\",\"\",CONCATENATE(DIGITADOR!$M$1,H14,E14))","v":""},"",{"$f":"IF(G14=\"\",\"\",VLOOKUP(G14,'Otras referencias'!$A$24:$E$48,2,FALSE))","v":""},null,null,null,null,null,null,null,null,null,null,{"$f":"IF(Q14=\"\",\"\",VLOOKUP(Q14,referentes!$K$2:$R$209,2,FALSE))","v":""}]
[null,{"$f":"IF(C15=\"\",\"\",IF(COUNTIF($C$3:C15, C15)>1, \"\", C15))","v":""},{"$f":"IF(H15=\"\",\"\",CONCATENATE(DIGITADOR!$M$1,H15,E15))","v":""},"",{"$f":"IF(G15=\"\",\"\",VLOOKUP(G15,'Otras referencias'!$A$24:$E$48,2,FALSE))","v":""},null,null,null,null,null,null,null,null,null,null,{"$f":"IF(Q15=\"\",\"\",VLOOKUP(Q15,referentes!$K$2:$R$209,2,FALSE))","v":""}]
[null,{"$f":"IF(C16=\"\",\"\",IF(COUNTIF($C$3:C16, C16)>1, \"\", C16))","v":""},{"$f":"IF(H16=\"\",\"\",CONCATENATE(DIGITADOR!$M$1,H16,E16))","v":""},"",{"$f":"IF(G16=\"\",\"\",VLOOKUP(G16,'Otras referencias'!$A$24:$E$48,2,FALSE))","v":""},null,null,null,null,null,null,null,null,null,null,{"$f":"IF(Q16=\"\",\"\",VLOOKUP(Q16,referentes!$K$2:$R$209,2,FALSE))","v":""}]
[null,{"$f":"IF(C17=\"\",\"\",IF(COUNTIF($C$3:C17, C17)>1, \"\", C17))","v":""},{"$f":"IF(H17=\"\",\"\",CONCATENATE(DIGITADOR!$M$1,H17,E17))","v":""},"",{"$f":"IF(G17=\"\",\"\",VLOOKUP(G17,'Otras referencias'!$A$24:$E$48,2,FALSE))","v":""},null,null,null,null,null,null,null,null,null,null,{"$f":"IF(Q17=\"\",\"\",VLOOKUP(Q17,referentes!$K$2:$R$209,2,FALSE))","v":""}]
[null,{"$f":"IF(C18=\"\",\"\",IF(COUNTIF($C$3:C18, C18)>1, \"\", C18))","v":""},{"$f":"IF(H18=\"\",\"\",CONCATENATE(DIGITADOR!$M$1,H18,E18))","v":""},"",{"$f":"IF(G18=\"\",\"\",VLOOKUP(G18,'Otras referencias'!$A$24:$E$48,2,FALSE))","v":""},null,null,null,null,null,null,null,null,null,null,{"$f":"IF(Q18=\"\",\"\",VLOOKUP(Q18,referentes!$K$2:$R$209,2,FALSE))","v":""}]
[null,{"$f":"IF(C19=\"\",\"\",IF(COUNTIF($C$3:C19, C19)>1, \"\", C19))","v":""},{"$f":"IF(H19=\"\",\"\",CONCATENATE(DIGITADOR!$M$1,H19,E19))","v":""},"",{"$f":"IF(G19=\"\",\"\",VLOOKUP(G19,'Otras referencias'!$A$24:$E$48,2,FALSE))","v":""},null,null,null,null,null,null,null,null,null,null,{"$f":"IF(Q19=\"\",\"\",VLOOKUP(Q19,referentes!$K$2:$R$209,2,FALSE))","v":""}]
[null,{"$f":"IF(C20=\"\",\"\",IF(COUNTIF($C$3:C20, C20)>1, \"\", C20))","v":""},{"$f":"IF(H20=\"\",\"\",CONCATENATE(DIGITADOR!$M$1,H20,E20))","v":""},"",{"$f":"IF(G20=\"\",\"\",VLOOKUP(G20,'Otras referencias'!$A$24:$E$48,2,FALSE))","v":""},null,null,null,null,null,null,null,null,null,null,{"$f":"IF(Q20=\"\",\"\",VLOOKUP(Q20,referentes!$K$2:$R$209,2,FALSE))","v":""}]
{"$rows_left_out":284}
{"sheet":"referentes","index":4,"n_rows":209,"n_cols":32,"rows_kept":209,"cut":false,"hidden":false,"merged":[]}
["codigo","descripcion",null,"codigo","descripcion",null,"codigo","descripcion",null,null,"cod_letras","descripcion","clave_sibm","phylum","clase","orden","familia","genero",null,"secuencia_loc","prefijo_cdg_est_loc","codigo_estacion_loc","descripcion_estacion_loc","lugar",null,"codigo","nombre"]
["CORALINA","CORALINA",null,"SARA","Sparisoma radians",null,3343,"ANH Pastos Guajira Choco (3343)",null,null,"AAFE","Alphestes afer",null,"Chordata","Teleostei","Perciformes","Serranidae",null,null,57180,"AHUY",1,"MN-Ahuyama","Ahuyama",null,3907,"Ameth  Vargas Campo",null,null,null,"AD Pto. Moin C.R.","Administración Desarrollo Complejo Portuario  Limón Moin Costa Rica"]
["F. Malpelo","Fundacion Malpelo",null,"ABAH","Acanthurus bahianus",null,3422,"Coralina 02 2018 (3422)",null,null,"ABAH","Acanthurus bahianus","70.55.666","CHORDATA",null,null,"ACANTHURIDAE",null,null,43727,"BPOR",3,"MN-Bahía Portete","Bahía Portete",null,593,"Andrea Polanco",null,null,null,"ANADARKO","Anadarko Colombia Company"]
["INVEMAR","Instituto de Investigaciones Marinas y Costeras",null,"DAME","Dasyatis americana",null,"Monitoreo Pastos - BPIN","Monitoreo Pastos - BPIN (COD_ALFABETICO anterior: 3494)",null,null,"ACBE","Acyrtops beryllinus",null,"Chordata","Teleostei","Gobiesociformes","Gobiesocidae",null,null,48586,"BALL",1,"MN-Ballenas","Ballenas",null,4408,"Andres Felipe Acosta Chaparro",null,null,null,"AQUABIOSFERA","Aquabiosfera SAS"]
["ParquesNacionales","Parques Nacionales",null,"GERR","Gerres sp.",null,3304,"ANH Pastos Marinos. PRY-BEM-012-15_T2",null,null,"ACHI","Acanthurus chirurgus","70.55.667","Chordata","Teleostei","Acanthuriformes","Acanthuridae",null,null,48584,"CVEL",3,"MN-Cabo de la Vela","Cabo de la Vela",null,4109,"Angélica Rodríguez",null,null,null,"CALIDRIS","Asociación Calidris"]
["PNN_GORGONA","PNN_GORGONA",null,"HFLA","Haemulon flaviguttatus",null,null,null,null,null,"ACOE","Acanthurus coeruleus","70.55.668","Chordata","Teleostei","Acanthuriformes","Acanthuridae",null,null,49303,"CVNU",2,"MN-Cabo Nuevo","Cabo de la Vela",null,3956,"Carlos Aponte",null,null,null,"ASOCARS","Asociación de Corporaciones Autónomas Regionales"]
["UJTL","UJTL",null,"HMAC","Haemulon maculicauda",null,null,null,null,null,"ACYA","Azurina cyanea",null,"Chordata","Teleostei","Ovalentaria incertae sedis","Pomacentridae",null,null,57179,"CPLA",1,"MN-Cabo playa","Cabo playa",null,3147,"Christian Michael Díaz Sánchez",null,null,null,"ANLA","Autoridad Nacional de Licencias Ambientales"]
["UNal","Universidad Nacional",null,"RTRI","Rhinesomus triqueter",null,null,null,null,null,"AEGM","Ahlia egmontis",null,"Chordata","Teleostei","Anguilliformes","Ophichthidae",null,null,57178,"CARR",1,"MN-Carrizal","Carrizal",null,4407,"Cristian Camilo Salinas zapata",null,null,null,"ARAP","Autoridad de Recursos Acuáticos de Panamá"]
["UNIVALLE","Universidad del Valle",null,"CLUP","CLUPEIFORMES",null,null,null,null,null,"AMAC","Apogon maculatus","70.55.351","Chordata","Teleostei","Kurtiformes","Apogonidae",null,null,43120,"CHEN",2,"MN-Chengue","Chengue",null,3829,"Diana Carolina Ballesteros Contreras",null,null,null,"CWOP","Caribbean-Wide Orca Project"]
[null,null,null,"CARA","Caranx sp.",null,null,null,null,null,"AMUL","Azurina multilineata",null,"Chordata","Teleostei","Ovalentaria incertae sedis","Pomacentridae",null,null,43121,"CINT",3,"MN-Cinto","Cinto",null,1834,"Diana Isabel Gómez López",null,null,null,"CEAC","Centro de Estudios Ambientales de Cienfuegos"]
[null,null,null,"ELUS","Elacatinus sp.",null,null,null,null,null,"ANAR","Aetobatus narinari","70.55.40","Chordata","Elasmobranchii","Myliobatiformes","Myliobatidae",null,null,48964,"CCAY",1,"MN-Cotton Cay","Cotton Cay",null,3957,"Diana Vergara",null,null,null,"CECIMAR","Centro de Estudios en Ciencias del Mar - Universidad Nacional"]
[null,null,null,"HCHR","Haemulon chrysargyreum",null,null,null,null,null,"APOG","Apogon sp.","70.46.183","Chordata","Teleostei","Kurtiformes","Apogonidae",null,null,43118,"IMAN",2,"MN-Isla Mangle","Isla Mangle",null,1775,"Diego Duque",null,null,null,"CIEMAT","Centro de Investigaciones Energéticas, Medioambientales y Tecnológicas"]
[null,null,null,"HAEM","Haemulon sp.",null,null,null,null,null,"APOL","Acanthostracion polygonium","70.55.750","Chordata","Teleostei","Tetraodontiformes","Ostraciidae",null,null,43117,"IROS",1,"MN-Isla Rosario","Isla Rosario",null,3646,"Elizabeth Galeano Galeano",null,null,null,"CIOH","Centro de Investigaciones Oceanográficas e Hidrográficas"]
[null,null,null,"LUTJ","Lutjanus sp.",null,null,null,null,null,"AQUA","Acanthostracion quadricornis","70.55.751","Chordata","Teleostei","Tetraodontiformes","Ostraciidae",null,null,48966,"ISLE",1,"MN-Isleño","Isleño",null,3809,"Esteban Zarza",null,null,null,"C.C.C.P.","Centro de Investigaciones Oceanográficas e Hidrográficas del Pacífico"]
[null,null,null,"SCAR","Scarus sp.",null,null,null,null,null,"ARIV","Acanthemblemaria rivasi",null,"Chordata","Teleostei","Blenniiformes","Chaenopsidae",null,null,51465,"KAUR",1,"MN-Kaurrele","Manaure",null,4106,"Johana Vega",null,null,null,"CEINER","Centro de Investigación Educación y Recreación Islas del Rosario"]
[null,null,null,"SSPL","Sphoeroides spengleri",null,null,null,null,null,"ARRH","Archosargus rhomboidalis",null,"Chordata","Teleostei","Eupercaria incertae sedis","Sparidae",null,null,48585,"MANA",2,"MN-Manaure","Manaure",null,3905,"Juan David González Corredor",null,null,null,"CIRA","Centro de Investigación de los Recursos Acuáticos de Nicaragua (CIRA)"]
[null,null,null,"ASAX","Abudefduf saxatilis",null,null,null,null,null,"ASAX","Abudefduf saxatilis","70.55.513","Chordata","Teleostei","Ovalentaria incertae sedis","Pomacentridae",null,null,48965,"MARA",1,"MN-Marazul","Marazul",null,3505,"Juan Manuel Rodriguez Pineda",null,null,null,"CICA","Centro de Investigación en Contaminación Ambiental"]
[null,null,null,"ATAU","Abudefduf taurus",null,null,null,null,null,"ASCR","Aluterus scriptus","70.55.743","Chordata","Teleostei","Tetraodontiformes","Monacanthidae",null,null,43123,"MBAY",1,"MN-Mauricio Bay","Mauricio Bay",null,4409,"Karen Melissa Serna Rodriguez",null,null,null,"CRBMUV","Colección de Referencia Biología Marina Universidad del Valle"]
[null,null,null,"ARIV","Acanthemblemaria rivasi",null,null,null,null,null,"ASSP","Astrapogon sp.",null,"Chordata","Teleostei","Kurtiformes","Apogonidae",null,null,43119,"NEGU",1,"MN-Neguanje","Neguanje",null,4107,"Kelly Gómez",null,null,null,"Coleccion_Personal","Colección personal"]
[null,null,null,"APOL","Acanthostracion polygonium",null,null,null,null,null,"ASTI","Atherinomorus stipes",null,"Chordata","Teleostei","Atheriniformes","Atherinidae",null,null,43122,"OCRE",2,"MN-Oyster Creek","Oyster Creek",null,8265,"Kevin Samuel Moreno",null,null,null,"CPPS","Comisión Permanente del Pacífico Sur"]
{"$rows_left_out":190}
{"sheet":"Otras referencias","index":5,"n_rows":48,"n_cols":16,"rows_kept":48,"cut":false,"hidden":false,"merged":[[0,0,2,6],[4,0,4,1],[4,10,4,11],[22,5,24,5],[25,5,47,5],[21,0,21,5],[4,13,4,15],[4,3,4,5],[4,7,4,8],[9,13,9,15]]}
["Estas son listas para variables con valores que no se encuentran codificados, pero que deben manejarse de manera estandarizada. \nSi se requiere agregar un valor nuevo hagalo debajo de la lista correspondiente"]
[]
[]
[]
["UNIDADES DE MEDIDA",null,null,"PROYECTO",null,null,null,"ROLES",null,null,"METODOLOGIAS",null,null,"TEMATICAS"]
["CODIGO","DESCRIPCION",null,"COD","PROYECTO","PROYECTO DESC",null,4,"Captura en campo",null,"CODIGO","DESCRIPCION",null,"COD METODOLOGIA","COD TEMATICA","DESCRIPCION"]
[10,"cm",null,3036,"Monitoreo Pastos - BPIN","Monitoreo de Pastos Marinos de Colombia",null,6,"Revisar datos",null,818,"Pastos-Abundancia Peces",null,818,222,"ABUNDANCIA"]
[11,"m",null,null,null,null,null,3497,"Coordinador actividad de campo"]
[69,"g",null,null,null,null,null,4526,"Procesamiento en laboratorio"]
[142,"Ind/Estación",null,null,null,null,null,null,null,null,null,null,null,"CODIGOS LOV"]
[null,null,null,null,null,null,null,null,null,null,null,null,null,"DESCRIPCIÓN","CÓDIGO","GRUPO"]
[null,null,null,null,null,null,null,null,null,null,null,null,null,"Departamento",10,2]
[null,null,null,null,null,null,null,null,null,null,null,null,null,"Sector",20,2]
[null,null,null,null,null,null,null,null,null,null,null,null,null,"Punto",30,2]
[null,null,null,null,null,null,null,null,null,null,null,null,null,"Parcela",35,2]
[null,null,null,null,null,null,null,null,null,null,null,null,null,"Estaciones",40,2]
[null,null,null,null,null,null,null,null,null,null,null,null,null,"Region",50,2]
[null,null,null,null,null,null,null,null,null,null,null,null,null,"Unidad_de_Manejo",60,2]
[null,null,null,null,null,null,null,null,null,null,null,null,null,"Unidad_Ambiental_Costera",70,2]
[null,null,null,null,null,null,null,null,null,null,null,null,null,"Localidad",80,2]
{"$rows_left_out":29}
{"sheet":"AGD_MUESTREOS","index":6,"n_rows":0,"n_cols":0,"rows_kept":0,"cut":false,"hidden":true,"merged":[]}

{"sheet":"AGD_PARAMETRO","index":7,"n_rows":0,"n_cols":0,"rows_kept":0,"cut":false,"hidden":true,"merged":[]}

{"sheet":"AGD_MUESTRAS","index":8,"n_rows":0,"n_cols":0,"rows_kept":0,"cut":false,"hidden":true,"merged":[]}

{"sheet":"AGD_MUESTRAS_VARIABLES","index":9,"n_rows":0,"n_cols":0,"rows_kept":0,"cut":false,"hidden":true,"merged":[]}

{"sheet":"AGD_AUTORIAS","index":10,"n_rows":0,"n_cols":0,"rows_kept":0,"cut":false,"hidden":true,"merged":[]}