{"text_format":"1","workbook":"xlsx","n_sheets":11,"sheets":["Registro de cambios","configuracion","DIGITADOR","DATOS","referentes","Otras referencias","AGD_MUESTREOS","AGD_PARAMETRO","AGD_MUESTRAS","AGD_MUESTRAS_VARIABLES","AGD_AUTORIAS"],"not_rendered":{"charts":0,"images":0,"macros":1,"external_links":1,"defined_names":22,"comments":3,"pivot_tables":0},"unopened":[],"bounds":{"document_bytes":16777216,"sheet_cells":100000,"rows_first":2000,"rows_last":500,"rows_between":2000,"halvings":0,"cell_chars":16384,"cell_head_chars":4096},"cells_cut":0,"cells_raw":0,"read":"whole","date_system":"1900"}

{"sheet":"Registro de cambios","index":0,"n_rows":8,"n_cols":7,"rows_kept":8,"cut":false,"hidden":true,"merged":[[2,3,2,6]]}
[]
[]
[null,null,null,"REGISTRO DE CAMBIOS"]
[null,null,null,"VERSIÓN No.","CAMBIO REALIZADO","AUTOR","VIGENTE DESDE\n(DD/MM/AAAA)"]
[null,null,null,"20241010i","Actualización del código de la macro\nSe eliminó la URL de la antigua API de Portete: http://portete.invemar.org.co:7003/ArgosWebServices-RESTWebService-context-root/rest/1.0\n\nEsta fue reemplazada por la nueva URL de la API de ARGOS: https://argos.invemar.org.co/api/\n\nLa API actual proporciona Endpoints que permiten un mayor control y facilitan la descarga de datos relevantes, como listas de usuarios, estaciones, especies, entre otros, filtradas según criterios específicos, como el proyecto utilizado en la plantilla. Esto evita la descarga de información innecesaria.\n\nAdemás, la API permite la carga de información directamente en la base de datos del INVEMAR.\n\nLa macro extrae los Endpoints desde la hoja \"Configuración\", a través de una tabla denominada \"Configuración referentes\", en la que se pueden modificar o agregar nuevas rutas de la API. Cabe destacar que también es posible \"quemar\" directamente los Endpoints dentro de la macro cuando sea necesario.                                                                                                                                               Para asegurar que recibieran los datos correctos de las celdas correspondientes. También se incorporaron nuevos campos en la hoja \"Digitador\" y se ajustaron las fórmulas en la hoja \"Datos\" para garantizar la correcta manipulación y procesamiento de la información.","Juan Muñoz","2024-10-10"]
[null,null,null,"20231012m","Se agregó una nueva especie a la lista de referentes.","Kevin Moreno","2023-10-12"]
[null,null,null,"20230815i","Se actualizó el listado de especies en la tabla AG_ESPECIES de la BDD, se corrigieron las fórmulas que involucran estos valores para que los tomara por completo.","Kevin Moreno","15/8/2023"]
[null,null,null,"20230814i","Se creó la plantilla de cero (0), los elementos que componen la plantilla funcionan para la temática de VEGETACION.\n\nSe modificó la hoja de DIGITADOR añadiendo listas de valores, entre otros tal como observaciones generales.\n\nSe crearon todas las columnas que componente la hoja de DATOS, se obtienen valores como la fecha, estación, especie, DAP, altura, etc .\n\nSe mapeó toda la hoja de CONFIGURACIÓN para tomar los valores de los muestreos y muestras y generar las tablas que sirven para subir la información al sistema.\n","Kevin Moreno","14/8/2023"]

{"sheet":"configuracion","index":1,"n_rows":71,"n_cols":14,"rows_kept":71,"cut":false,"hidden":true,"merged":[[45,5,45,7],[61,0,61,2],[23,0,26,0],[0,0,2,0],[3,0,5,0],[7,0,8,0],[9,0,15,0],[17,0,21,0],[60,0,60,1],[28,0,35,0],[37,0,42,0],[45,0,45,1]]}
["general","urlServicio","https://argos.invemar.org.co/api/"]
[null,"fila de inicio",4]
[null,"fila de fin",304]
["metodologias","Metodologias",{"$f":"DIGITADOR!B4","v":873}]
[null,"Referentes",300]
[null,"Cantidad maxima de referentes ",300]
["estaciones/investigadores","proyectos",3572]
["Lista especies","metodologias",{"$f":"DIGITADOR!B4","v":873}]
[null,"proyectos",3572]
["MUESTREOS","ID_MUESTREO","DATOS,B"]
{"$rows_left_out":62}
{"sheet":"DIGITADOR","index":2,"n_rows":38,"n_cols":4,"rows_kept":38,"cut":false,"hidden":false,"merged":[[37,1,37,2],[36,1,36,2],[0,0,0,1],[15,3,15,9],[16,3,16,9],[1,3,9,9],[10,3,14,9],[7,0,8,0],[26,0,26,1],[29,0,29,1]]}
["Recolección de Datos Monitoreo\nPlayas Y Dunas - Vegetación KFW"]
["Código Digitador",{"$f":"IF(B3=\"\",\"\",INDEX(referentes!$Y$2:$Z$60,MATCH(DIGITADOR!B3,referentes!$Z$2:$Z$60,0),1))","v":""},null,"Recomendaciones generales: \n¡Precaución! No inserte Filas o Columnas.\nEn los casos en que falte un valor a ingresar que provenga de la hoja de referencias, informe para que el administrador del sistema haga las adiciones necesarias.\nEsta es una plantilla programada. Las columnas de color oscuro se llenan automaticamente, principalmente a partir de los contenidos de la hoja de referencias. \nNO UTILICE PUNTO Y COMA (;) en ningun campo, por ser el separador de variables (columnas). Las unidades de medida son las especificadas en la cabecera de la hoja.\nPara el correcto funcionamiento de la hoja debe estar activa la opcion de Excel de ejecutar macros (al abrir la hoja acepte la opcion habilitar macros, mensaje de Excel que aparece en la parte superior de la hoja en un recuadro amarillo). La extensión del archivo debe ser .xlsm.. \nAl finalizar, renombre el archivo de modo que su contenido sea claro, ejemplo:\ncorporacion_estacion_anocuatrodigitosmesmuestreo.xlsm. El nombre no debe tener espacios en blanco vocales tildadas o ñ."]
["Nombre del responsable",null,{"$f":"IF(G3=\"\",\"\",CONCATENATE(DIGITADOR!$M$1,G3,E3))","v":""}]
["Código Monitoreo",{"$f":"IF(B5=\"\",\"\",INDEX('Otras referencias'!$K$7:$L$9,MATCH(DIGITADOR!B5,'Otras referencias'!$L$7:$L$9,0),1))","v":873}]
["Monitoreo","Playas - VEGETACION"]
["Entidad","Instituto de Investigaciones Marinas y Costeras"]
["Versión de la plantilla",{"$f":"'Registro de cambios'!$D$5","v":"20241010i"}]
["Fecha en la que ingresa los datos en esta hoja","DD/MM/AAAA"]
[null,"3000-12-12"]
[]
{"$rows_left_out":29}
{"sheet":"DATOS","index":3,"n_rows":304,"n_cols":41,"rows_kept":304,"cut":false,"hidden":false,"merged":[[0,5,1,9],[2,25,2,31],[0,10,1,40],[2,33,2,38]]}
[null,null,null,null,null,"MUESTREO ",null,null,null,null,"MUESTRA"]
[]
[{"$f":"TEXT(DIGITADOR!$B$9,\"yyyymmdd\")","v":"30001212"},"AGM MUESTREO","ID MUESTREO","ID MUESTRA","ID ESTACION","Estación","Fecha\n(DD/MM/AAAA)",null,null,null,"Tamaño Parcela (m²)\n(132/28/1)","Subcuadrante","Número de Individuo (Abundancia)",null,null,"ID ESPECIE","Especie (Riqueza)","DAP","Unidad DAP","Altura","Unidad Altura","Copa X","Copa Y","Cobertura (%)","Número de Colecta","Microhábitats asociados,Microhábitats asociados\nElija los microhábitats.",null,null,null,null,null,null,"COD MICROHABITATS","Estado de la Playa/Duna",null,null,null,null,null,"COD ESTADO_PLAYA","Observaciones"]
[null,{"$f":"IF(C4=\"\",\"\",IF(COUNTIF($C$4:C4, C4)>1, \"\", C4))","v":""},{"$f":"IF(G4=\"\",\"\",IF(F4=\"\",\"\",CONCATENATE(DIGITADOR!$M$1,G4,E4)))","v":""},{"$f":"IF(C4=\"\",\"\",CONCATENATE(C4,ROW()-2))","v":""},{"$f":"IF(F4=\"\",\"\",VLOOKUP(F4,referentes!$N$2:$Q$161,3,FALSE))","v":""},null,null,null,null,null,null,null,null,null,null,{"$f":"IF(Q4=\"\",\"\",INDEX(referentes!$D$2:$E$65,MATCH(Q4,referentes!$E$2:$E$65,0),1))","v":""},null,null,{"$f":"IF(R4=\"\",\"\",'Otras referencias'!$B$7)","v":""},null,{"$f":"IF(T4=\"\",\"\",'Otras referencias'!$B$8)","v":""},null,null,null,null,null,null,null,null,null,null,null,{"$f":"CONCATENATE(\n                                IF(AA4<>\"\",CONCATENATE(Z4,\", \",\n                                                      IF(AB4<>\"\",CONCATENATE(AA4,\", \",\n                                                           IF(AC4<>\"\",CONCATENATE(AB4,\", \",\n                                                               IF(AD4<>\"\",CONCATENATE(AC4,\", \",\n                                                                   IF(AE4<>\"\",CONCATENATE(AD4,\", \",\n                                                                        IF(AF4<>\"\",CONCATENATE(AE4,\", \", AF4), AE4)\n                                                                      ), AD4)\n                                                                   ), AC4)\n                                                               ), AB4)\n                                                       ), AA4)\n                                ),Z4)\n)","v":""},null,null,null,null,null,null,{"$f":"CONCATENATE(\n                                IF(AI4<>\"\",CONCATENATE(AH4,\", \",\n                                                      IF(AJ4<>\"\",CONCATENATE(AI4,\", \",\n                                                           IF(AK4<>\"\",CONCATENATE(AJ4,\", \",\n                                                               IF(AL4<>\"\",CONCATENATE(AK4,\", \",\n                                                                       IF(AM4<>\"\",CONCATENATE(AL4,\", \", AM4), AL4)\n                                                                      ), AK4)\n                                                               ), AJ4)\n                                                       ), AI4)\n                                ),AH4)\n)","v":""}]
[null,{"$f":"IF(C5=\"\",\"\",IF(COUNTIF($C$4:C5, C5)>1, \"\", C5))","v":""},{"$f":"IF(G5=\"\",\"\",IF(F5=\"\",\"\",CONCATENATE(DIGITADOR!$M$1,G5,E5)))","v":""},{"$f":"IF(C5=\"\",\"\",CONCATENATE(C5,ROW()-2))","v":""},{"$f":"IF(F5=\"\",\"\",VLOOKUP(F5,referentes!$N$2:$Q$161,3,FALSE))","v":""},null,null,null,null,null,null,null,null,null,null,{"$f":"IF(Q5=\"\",\"\",INDEX(referentes!$D$2:$E$65,MATCH(Q5,referentes!$E$2:$E$65,0),1))","v":""},null,null,{"$f":"IF(R5=\"\",\"\",'Otras referencias'!$B$7)","v":""},null,{"$f":"IF(T5=\"\",\"\",'Otras referencias'!$B$8)","v":""},null,null,null,null,null,null,null,null,null,null,null,{"$f":"CONCATENATE(\n                                IF(AA5<>\"\",CONCATENATE(Z5,\", \",\n                                                      IF(AB5<>\"\",CONCATENATE(AA5,\", \",\n                                                           IF(AC5<>\"\",CONCATENATE(AB5,\", \",\n                                                               IF(AD5<>\"\",CONCATENATE(AC5,\", \",\n                                                                   IF(AE5<>\"\",CONCATENATE(AD5,\", \",\n                                                                        IF(AF5<>\"\",CONCATENATE(AE5,\", \", AF5), AE5)\n                                                                      ), AD5)\n                                                                   ), AC5)\n                                                               ), AB5)\n                                                       ), AA5)\n                                ),Z5)\n)","v":""},null,null,null,null,null,null,{"$f":"CONCATENATE(\n                                IF(AI5<>\"\",CONCATENATE(AH5,\", \",\n                                                      IF(AJ5<>\"\",CONCATENATE(AI5,\", \",\n                                                           IF(AK5<>\"\",CONCATENATE(AJ5,\", \",\n                                                               IF(AL5<>\"\",CONCATENATE(AK5,\", \",\n                                                                       IF(AM5<>\"\",CONCATENATE(AL5,\", \", AM5), AL5)\n                                                                      ), AK5)\n                                                               ), AJ5)\n                                                       ), AI5)\n                                ),AH5)\n)","v":""}]
[null,{"$f":"IF(C6=\"\",\"\",IF(COUNTIF($C$4:C6, C6)>1, \"\", C6))","v":""},{"$f":"IF(G6=\"\",\"\",IF(F6=\"\",\"\",CONCATENATE(DIGITADOR!$M$1,G6,E6)))","v":""},"",{"$f":"IF(F6=\"\",\"\",VLOOKUP(F6,referentes!$N$2:$Q$161,3,FALSE))","v":""},null,null,null,null,null,null,null,null,null,null,{"$f":"IF(Q6=\"\",\"\",INDEX(referentes!$D$2:$E$65,MATCH(Q6,referentes!$E$2:$E$65,0),1))","v":""},null,null,{"$f":"IF(R6=\"\",\"\",'Otras referencias'!$B$7)","v":""},null,{"$f":"IF(T6=\"\",\"\",'Otras referencias'!$B$8)","v":""},null,null,null,null,null,null,null,null,null,null,null,"",null,null,null,null,null,null,""]
[null,{"$f":"IF(C7=\"\",\"\",IF(COUNTIF($C$4:C7, C7)>1, \"\", C7))","v":""},{"$f":"IF(G7=\"\",\"\",IF(F7=\"\",\"\",CONCATENATE(DIGITADOR!$M$1,G7,E7)))","v":""},"",{"$f":"IF(F7=\"\",\"\",VLOOKUP(F7,referentes!$N$2:$Q$161,3,FALSE))","v":""},null,null,null,null,null,null,null,null,null,null,{"$f":"IF(Q7=\"\",\"\",INDEX(referentes!$D$2:$E$65,MATCH(Q7,referentes!$E$2:$E$65,0),1))","v":""},null,null,{"$f":"IF(R7=\"\",\"\",'Otras referencias'!$B$7)","v":""},null,{"$f":"IF(T7=\"\",\"\",'Otras referencias'!$B$8)","v":""},null,null,null,null,null,null,null,null,null,null,null,"",null,null,null,null,null,null,""]
[null,{"$f":"IF(C8=\"\",\"\",IF(COUNTIF($C$4:C8, C8)>1, \"\", C8))","v":""},{"$f":"IF(G8=\"\",\"\",IF(F8=\"\",\"\",CONCATENATE(DIGITADOR!$M$1,G8,E8)))","v":""},"",{"$f":"IF(F8=\"\",\"\",VLOOKUP(F8,referentes!$N$2:$Q$161,3,FALSE))","v":""},null,null,null,null,null,null,null,null,null,null,{"$f":"IF(Q8=\"\",\"\",INDEX(referentes!$D$2:$E$65,MATCH(Q8,referentes!$E$2:$E$65,0),1))","v":""},null,null,{"$f":"IF(R8=\"\",\"\",'Otras referencias'!$B$7)","v":""},null,{"$f":"IF(T8=\"\",\"\",'Otras referencias'!$B$8)","v":""},null,null,null,null,null,null,null,null,null,null,null,"",null,null,null,null,null,null,""]
[null,{"$f":"IF(C9=\"\",\"\",IF(COUNTIF($C$4:C9, C9)>1, \"\", C9))","v":""},{"$f":"IF(G9=\"\",\"\",IF(F9=\"\",\"\",CONCATENATE(DIGITADOR!$M$1,G9,E9)))","v":""},"",{"$f":"IF(F9=\"\",\"\",VLOOKUP(F9,referentes!$N$2:$Q$161,3,FALSE))","v":""},null,null,null,null,null,null,null,null,null,null,{"$f":"IF(Q9=\"\",\"\",INDEX(referentes!$D$2:$E$65,MATCH(Q9,referentes!$E$2:$E$65,0),1))","v":""},null,null,{"$f":"IF(R9=\"\",\"\",'Otras referencias'!$B$7)","v":""},null,{"$f":"IF(T9=\"\",\"\",'Otras referencias'!$B$8)","v":""},null,null,null,null,null,null,null,null,null,null,null,"",null,null,null,null,null,null,""]
[null,{"$f":"IF(C10=\"\",\"\",IF(COUNTIF($C$4:C10, C10)>1, \"\", C10))","v":""},{"$f":"IF(G10=\"\",\"\",IF(F10=\"\",\"\",CONCATENATE(DIGITADOR!$M$1,G10,E10)))","v":""},"",{"$f":"IF(F10=\"\",\"\",VLOOKUP(F10,referentes!$N$2:$Q$161,3,FALSE))","v":""},null,null,null,null,null,null,null,null,null,null,{"$f":"IF(Q10=\"\",\"\",INDEX(referentes!$D$2:$E$65,MATCH(Q10,referentes!$E$2:$E$65,0),1))","v":""},null,null,{"$f":"IF(R10=\"\",\"\",'Otras referencias'!$B$7)","v":""},null,{"$f":"IF(T10=\"\",\"\",'Otras referencias'!$B$8)","v":""},null,null,null,null,null,null,null,null,null,null,null,"",null,null,null,null,null,null,""]
{"$rows_left_out":295}
{"sheet":"referentes","index":4,"n_rows":161,"n_cols":30,"rows_kept":161,"cut":false,"hidden":false,"merged":[]}
["AG_ESPECIES",3572873,null,"cod_letras","descripcion",null,"phylum","clase","orden","familia","genero",null,null,null,null,null,null,null,"secuencia_loc","prefijo_cdg_est_loc","codigo_estacion_loc","descripcion_estacion_loc","lugar"]
["MESP","Morfoespecie sp1.",null,"ADUB","Amaranthus dubius",null,"Plantae","Magnoliophyta","Caryophyllales","Amaranthaceae","Amaranthus",null,null,"Ciénaga P1","4718921PVEG1P",56243,1,null,55958,"Bahia_Cocinetas",96321,null,"Bahia Cocinetas1",null,3546,"Administrador SIGMA"]
["AMER","Adonidia merrillii",null,"AHER","Anthephora hermaphrodita",null,"Plantae","Magnoliophyta","Poales","Poaceae","Anthephora",null,null,"Ciénaga P10","4718921PVEG1P",56252,10,null,55957,"Bahia_Hondita",96321,null,"Bahia Hondita1",null,3444,"Alexandra Rodríguez",null,null,"AD Pto. Moin C.R.","Administración Desarrollo Complejo Portuario  Limón Moin Costa Rica"]
["ADUB","Amaranthus dubius",null,"AIND","Azadirachta indica",null,"Plantae","Magnoliophyta","Sapindales","Meliaceae","Azadirachta",null,null,"Ciénaga P11","4718921PVEG1P",56253,11,null,55959,"Bahia_Tukakas",96321,null,"Bahia Tukakaspl1",null,8258,"Daniel Fernando Jiménez Rincón",null,null,"ANADARKO","Anadarko Colombia Company"]
["AHER","Anthephora hermaphrodita",null,"AMER","Adonidia merrillii",null,"Plantae","Magnoliophyta","Arecales","Arecaceae","Adonidia",null,null,"Ciénaga P12","4718921PVEG1P",56254,12,null,55967,"Boca_Laenea1",96321,null,"Boca La enea1",null,8378,"David Alejandro Navarrete Rodríguez",null,null,"AQUABIOSFERA","Aquabiosfera SAS"]
["AIND","Azadirachta indica",null,"BMAR","Batis maritima",null,"Plantae","Magnoliophyta","Brassicales","Bataceae","Batis",null,null,"Ciénaga P13","4718921PVEG1P",56255,13,null,55968,"Boca_Laenea2",96321,null,"Boca La enea2",null,4918,"Edgar Fernando Dorado Roncancio",null,null,"CALIDRIS","Asociación Calidris"]
["BMAR","Batis maritima",null,"BVER","Blutaparon vermiculare",null,"Plantae","Magnoliophyta","Caryophyllales","Amaranthaceae","Blutaparon",null,null,"Ciénaga P14","4718921PVEG1P",56256,14,null,56558,"Bocas_Atrato",96321,null,"Bocas del Atrato1",null,3403,"Eliana Marcela Barrios Vasquez",null,null,"ASOCARS","Asociación de Corporaciones Autónomas Regionales"]
["BVER","Blutaparon vermiculare",null,"CBON","Caesalpinia bonduc",null,"Plantae","Magnoliophyta","Fabales","Fabaceae","Caesalpinia",null,null,"Ciénaga P15","4718921PVEG1P",56257,15,null,55972,"Broqueles",96321,null,"Broqueles1",null,7840,"Fair Fernando Dager Osorio",null,null,"ANLA","Autoridad Nacional de Licencias Ambientales"]
["CBON","Caesalpinia bonduc",null,"CERE","Conocarpus erectus",null,"Plantae","Magnoliophyta","Myrtales","Combretaceae","Conocarpus",null,null,"Ciénaga P16","4718921PVEG1P",56258,16,null,57245,"Buenavista1",96321,null,"Buenavista1",null,5685,"Henry Fabian Bustos Ordoñez",null,null,"ARAP","Autoridad de Recursos Acuáticos de Panamá"]
["CPRO","Calotropis procera",null,"CFIL","Cassytha filiformis",null,"Plantae","Magnoliophyta","Laurales","Lauraceae","Cassytha",null,null,"Ciénaga P17","4718921PVEG1P",56259,17,null,57246,"Buenavista2",96321,null,"Buenavista2",null,7841,"Jean David Varilla Gonzalez",null,null,"CWOP","Caribbean-Wide Orca Project"]
{"$rows_left_out":152}
{"sheet":"Otras referencias","index":5,"n_rows":35,"n_cols":16,"rows_kept":35,"cut":false,"hidden":false,"merged":[[0,0,2,6],[4,0,4,1],[4,10,4,11],[20,7,20,8],[10,7,10,8],[22,3,22,5],[4,13,4,15],[4,3,4,5],[4,7,4,8],[10,10,10,11]]}
["Estas son listas para variables con valores que no se encuentran codificados, pero que deben manejarse de manera estandarizada. \nSi se requiere agregar un valor nuevo hagalo debajo de la lista correspondiente"]
[]
[]
[]
["UNIDADES DE MEDIDA",null,null,"PROYECTO",null,null,null,"ROLES",null,null,"METODOLOGIAS",null,null,"TEMATICAS"]
["CODIGO","DESCRIPCION",null,"COD","PROYECTO","PROYECTO DESC",null,4,"Captura en campo",null,"CODIGO","DESCRIPCION",null,"COD METODOLOGIA","COD TEMATICA","DESCRIPCION"]
[10,"cm",null,3572,"KFW","KFW",null,6,"Revisar datos",null,871,"Playas - MEGAFAUNA",null,870,268,"PLAYAS MACROFAUNA"]
[11,"m",null,null,null,null,null,3497,"Coordinador actividad de campo",null,870,"Playas - MACROFAUNA",null,871,269,"PLAYAS MEGAFAUNA"]
[69,"g",null,null,null,null,null,4526,"Procesamiento en laboratorio",null,873,"Playas - VEGETACION",null,869,267,"OLEAJE"]
[142,"Ind/Estación",null,null,null,null,null,null,null,null,null,null,null,873,270,"PLAYAS VEGETACION"]
{"$rows_left_out":26}
{"sheet":"AGD_MUESTREOS","index":6,"n_rows":0,"n_cols":0,"rows_kept":0,"cut":false,"hidden":true,"merged":[]}

{"sheet":"AGD_PARAMETRO","index":7,"n_rows":0,"n_cols":0,"rows_kept":0,"cut":false,"hidden":true,"merged":[]}

{"sheet":"AGD_MUESTRAS","index":8,"n_rows":0,"n_cols":0,"rows_kept":0,"cut":false,"hidden":true,"merged":[]}

{"sheet":"AGD_MUESTRAS_VARIABLES","index":9,"n_rows":0,"n_cols":0,"rows_kept":0,"cut":false,"hidden":true,"merged":[]}

{"sheet":"AGD_AUTORIAS","index":10,"n_rows":0,"n_cols":0,"rows_kept":0,"cut":false,"hidden":true,"merged":[]}