{"text_format":"1","workbook":"xlsx","n_sheets":11,"sheets":["Registro de cambios","configuracion","DIGITADOR","DATOS","referentes","Otras referencias","AGD_MUESTREOS","AGD_PARAMETRO","AGD_MUESTRAS","AGD_MUESTRAS_VARIABLES","AGD_AUTORIAS"],"not_rendered":{"charts":0,"images":0,"macros":1,"external_links":3,"defined_names":21,"comments":2,"pivot_tables":0},"unopened":[],"bounds":{"document_bytes":16777216,"sheet_cells":100000,"rows_first":2000,"rows_last":500,"rows_between":2000,"halvings":0,"cell_chars":16384,"cell_head_chars":4096},"cells_cut":0,"cells_raw":0,"read":"whole","date_system":"1900"}

{"sheet":"Registro de cambios","index":0,"n_rows":6,"n_cols":7,"rows_kept":6,"cut":false,"hidden":true,"merged":[[2,3,2,6]]}
[]
[]
[null,null,null,"REGISTRO DE CAMBIOS"]
[null,null,null,"VERSIÓN No.","CAMBIO REALIZADO","AUTOR","VIGENTE DESDE\n(DD/MM/AAAA)"]
[null,null,null,"20241005i","Actualización del código de la macro.\n\nSe eliminó la URL de la antigua API de portete:\n       http://portete.invemar.org.co:7003/ArgosWebServices-RESTWebService-context-root/rest/1.0\n\nFue reemplazada por la URL de la API de ARGOS:\n       https://argos.invemar.org.co/api/\n\nLa API contiene End Points que permiten tener mayor control, facilitan la descarga de referentes (listas de usuarios, estaciones, especies, etc.) que corresponden a criterios específicos como el proyecto usado en la plantilla para evitar descargar data innecesaria.\n\nDel mismo modo, también permite la carga de información a la BDD del INVEMAR.\n\nLa macro toma los Endpoints desde la hoja configuracion de una tabla llamada \"Configuración referentes\", a la que se le puede modificar las rutas de la API o agregar nuevas. cabe resaltar que se puede \"quemar\" directamente en la macro los Endpoints que lo requieran.","Juan Muñoz","2024-05-10"]
[null,null,null,"20230813i","Se creó la plantilla de cero (0), los elementos que componen la plantilla funcionan para la temática de OCEANOGRAFÍA.\n\nSe modificó la hoja de DIGITADOR añadiendo listas de valores como y atributos adicionales como 'Observaciones generales'.\n\nSe crearon todas las columnas que componente la hoja de DATOS, se obtienen valores como la fecha, estación, altura significativa de la ola, periodo y dirección pico, etc .\n\nSe mapeó toda la hoja de CONFIGURACIÓN para tomar los valores de los muestreos y muestras y generar las tablas que sirven para subir la información al sistema.\n","Kevin Moreno","13/8/2023"]

{"sheet":"configuracion","index":1,"n_rows":71,"n_cols":7,"rows_kept":71,"cut":false,"hidden":true,"merged":[[23,0,26,0],[0,0,2,0],[3,0,5,0],[7,0,8,0],[9,0,15,0],[17,0,21,0],[61,0,61,2],[45,5,45,6],[60,0,60,1],[28,0,35,0],[37,0,42,0],[45,0,45,1]]}
["general","urlServicio","https://argos.invemar.org.co/api/"]
[null,"fila de inicio",3]
[null,"fila de fin",303]
["metodologias","Metodologias",{"$f":"DIGITADOR!B4","v":869}]
[null,"Referentes",300]
[null,"Cantidad maxima de referentes ",300]
["estaciones/investigadores","proyectos",3572]
["Lista especies","metodologias",{"$f":"DIGITADOR!B4","v":869}]
[null,"proyectos",3572]
["MUESTREOS","ID_MUESTREO","DATOS,B"]
[null,"ID_ESTACION","DATOS,E"]
[null,"ID_PROYECTO",3572]
[null,"ID_METODOLOGIA",{"$f":"DIGITADOR!B4","v":869}]
[null,"ID_TEMATICAS",{"$f":"IF(C4=\"\",\"\",VLOOKUP(C4,'Otras referencias'!N7:P9,2,FALSE))","v":267}]
[null,"FECHA","DATOS,G"]
[null,"NOTAS","DIGITADOR,B,28"]
[null,"cantidad",303]
["parametro muestreo","ID_MUESTREO","DATOS,B","DATOS,B","DATOS,B","DATOS,B"]
[null,"ID_PARAMETRO",1169,1055,1170,127]
[null,"ID_METODOLOGIA",{"$f":"DIGITADOR!$B$4","v":869},{"$f":"DIGITADOR!$B$4","v":869},{"$f":"DIGITADOR!$B$4","v":869},{"$f":"DIGITADOR!$B$4","v":869}]
{"$rows_left_out":52}
{"sheet":"DIGITADOR","index":2,"n_rows":38,"n_cols":4,"rows_kept":38,"cut":false,"hidden":false,"merged":[[37,1,37,2],[36,1,36,2],[0,0,0,1],[15,3,15,9],[16,3,16,9],[1,3,9,9],[10,3,14,9],[7,0,8,0],[26,0,26,1],[29,0,29,1]]}
["Recolección de Datos Monitoreo Oceanografía KFW"]
["Código Digitador",{"$f":"IF(B3=\"\",\"\",INDEX(referentes!Y:Z,MATCH(B3,referentes!Z:Z,0),1))","v":""},null,"Recomendaciones generales: \n¡Precaución! No inserte Filas o Columnas.\nEn los casos en que falte un valor a ingresar que provenga de la hoja de referencias, informe para que el administrador del sistema haga las adiciones necesarias.\nEsta es una plantilla programada. Las columnas de color oscuro se llenan automaticamente, principalmente a partir de los contenidos de la hoja de referencias. \nNO UTILICE PUNTO Y COMA (;) en ningun campo, por ser el separador de variables (columnas). Las unidades de medida son las especificadas en la cabecera de la hoja.\nPara el correcto funcionamiento de la hoja debe estar activa la opcion de Excel de ejecutar macros (al abrir la hoja acepte la opcion habilitar macros, mensaje de Excel que aparece en la parte superior de la hoja en un recuadro amarillo). La extensión del archivo debe ser .xlsm.. \nAl finalizar, renombre el archivo de modo que su contenido sea claro, ejemplo:\ncorporacion_estacion_anocuatrodigitosmesmuestreo.xlsm. El nombre no debe tener espacios en blanco vocales tildadas o ñ."]
["Nombre del responsable",null,{"$f":"IF(G3=\"\",\"\",CONCATENATE(DIGITADOR!$M$1,G3,E3))","v":""}]
["Código Monitoreo",{"$f":"IF(B5=\"\",\"\",INDEX('Otras referencias'!$K$7:$L$9,MATCH(DIGITADOR!B5,'Otras referencias'!$L$7:$L$9,0),1))","v":869}]
["Monitoreo","Oceanografía"]
["Entidad"]
["Versión de la plantilla",{"$f":"'Registro de cambios'!$D$5","v":"20241005i"}]
["Fecha en la que ingresa los datos en esta hoja","DD/MM/AAAA"]
[null,"3000-12-12"]
[]
["Código del proyecto",{"$f":"IF(B12=\"\",\"\",INDEX('Otras referencias'!$D$7:$E$7,MATCH(DIGITADOR!B12,'Otras referencias'!$E$7:$E$7,0),1))","v":3572},null,"Previamente a iniciar el llenado de la plantilla, debe presionar el botón \"Descargar referentes\" para que los referentes de ésta plantilla sean actualizados. \nLuego de llenar completamente la plantilla verifique que:\na. No haya celdas con valores como \"#N/A\" o \"#¡REF!\".\nb. No se estén aplicando filtros en la hoja de datos.\nEnvíe la plantilla diligenciada al correo kevin.moreno@invemar.org.co"]
["Proyecto que financia","KFW"]
["Nombre del Archivo",{"$f":"MID(CELL(\"FILENAME\",N63),FIND(\"[\",CELL(\"FILENAME\",N63))+1,   FIND(\"]\",CELL(\"FILENAME\",N63))-FIND(\"[\",CELL(\"FILENAME\",N63))-1)","v":"KFW_OCEANOGRAFIA_20241005i.xlsm"}]
["DOI Metadato"]
["Fuente Plantilla ","http://cinto.invemar.org.co/download/Plantillas_ARGOS_Plus/"]
[null,null,null,"Si requiere ayuda contacte a:\nKevin S. Moreno (kevin.moreno@invemar.org.co)"]
["ROLES INVOLUCRADOS","NOMBRE DE LA PERSONA",null,"El custodio de los datos es el único autorizado para distribuir este conjunto de datos. El observador y el digitador se comprometen a tomar las medidas necesarias para salvaguardar este conjunto de datos de modo que copia de los mismos no sean obtenidas y/o usadas por terceros no relacionados con el propósito para la cual se recolectó."]
[{"$f":"IF(A19=\"\",\"\",INDEX('Otras referencias'!$H$6:$I$9,MATCH(DIGITADOR!A19,'Otras referencias'!$I$6:$I$9,0),1))","v":""},{"$f":"IF(B19=\"\",\"\",INDEX(referentes!Y:Z,MATCH(B19,referentes!Z:Z,0),1))","v":""}]
[]
[{"$f":"IF(A21=\"\",\"\",INDEX('Otras referencias'!$H$6:$I$9,MATCH(DIGITADOR!A21,'Otras referencias'!$I$6:$I$9,0),1))","v":""},{"$f":"IF(B21=\"\",\"\",INDEX(referentes!Y:Z,MATCH(B21,referentes!Z:Z,0),1))","v":""}]
{"$rows_left_out":19}
{"sheet":"DATOS","index":3,"n_rows":304,"n_cols":16,"rows_kept":304,"cut":false,"hidden":false,"merged":[[0,5,0,8],[0,10,0,15]]}
[null,null,null,null,null,"MUESTREO ",null,null,null,null,"VARIABLES "]
[{"$f":"TEXT(DIGITADOR!$B$9,\"yyyymmdd\")","v":"30001212"},"AGM MUESTREO","ID MUESTREO","ID MUESTRA","ID ESTACION","Estación","Fecha\n(DD/MM/AAAA)","HORA TXT","Hora",null,"Hs ","Tp","DirTp",null,null,"Observaciones"]
[null,{"$f":"IF(C3=\"\",\"\",IF(COUNTIF($C$3:C3, C3)>1, \"\", C3))","v":""},{"$f":"IF(G3=\"\",\"\",CONCATENATE(DIGITADOR!$M$1,G3,E3))","v":""},{"$f":"IF(C3=\"\",\"\",CONCATENATE(C3,ROW()-2))","v":""},{"$f":"IF(F3=\"\",\"\",INDEX(referentes!$S:$S,MATCH(F3,referentes!$W:$W,0)))","v":""},null,null,{"$f":"IF(I3=\"\",\"\",TEXT(I3,\"hh:mm\"))","v":""}]
[null,{"$f":"IF(C4=\"\",\"\",IF(COUNTIF($C$3:C4, C4)>1, \"\", C4))","v":""},{"$f":"IF(G4=\"\",\"\",CONCATENATE(DIGITADOR!$M$1,G4,E4))","v":""},{"$f":"IF(C4=\"\",\"\",CONCATENATE(C4,ROW()-2))","v":""},{"$f":"IF(F4=\"\",\"\",INDEX(referentes!$S:$S,MATCH(F4,referentes!$W:$W,0)))","v":""},null,null,{"$f":"IF(I4=\"\",\"\",TEXT(I4,\"hh:mm\"))","v":""}]
[null,{"$f":"IF(C5=\"\",\"\",IF(COUNTIF($C$3:C5, C5)>1, \"\", C5))","v":""},{"$f":"IF(G5=\"\",\"\",CONCATENATE(DIGITADOR!$M$1,G5,E5))","v":""},"",{"$f":"IF(F5=\"\",\"\",INDEX(referentes!$S:$S,MATCH(F5,referentes!$W:$W,0)))","v":""},null,null,""]
[null,{"$f":"IF(C6=\"\",\"\",IF(COUNTIF($C$3:C6, C6)>1, \"\", C6))","v":""},{"$f":"IF(G6=\"\",\"\",CONCATENATE(DIGITADOR!$M$1,G6,E6))","v":""},"",{"$f":"IF(F6=\"\",\"\",INDEX(referentes!$S:$S,MATCH(F6,referentes!$W:$W,0)))","v":""},null,null,""]
[null,{"$f":"IF(C7=\"\",\"\",IF(COUNTIF($C$3:C7, C7)>1, \"\", C7))","v":""},{"$f":"IF(G7=\"\",\"\",CONCATENATE(DIGITADOR!$M$1,G7,E7))","v":""},"",{"$f":"IF(F7=\"\",\"\",INDEX(referentes!$S:$S,MATCH(F7,referentes!$W:$W,0)))","v":""},null,null,""]
[null,{"$f":"IF(C8=\"\",\"\",IF(COUNTIF($C$3:C8, C8)>1, \"\", C8))","v":""},{"$f":"IF(G8=\"\",\"\",CONCATENATE(DIGITADOR!$M$1,G8,E8))","v":""},"",{"$f":"IF(F8=\"\",\"\",INDEX(referentes!$S:$S,MATCH(F8,referentes!$W:$W,0)))","v":""},null,null,""]
[null,{"$f":"IF(C9=\"\",\"\",IF(COUNTIF($C$3:C9, C9)>1, \"\", C9))","v":""},{"$f":"IF(G9=\"\",\"\",CONCATENATE(DIGITADOR!$M$1,G9,E9))","v":""},"",{"$f":"IF(F9=\"\",\"\",INDEX(referentes!$S:$S,MATCH(F9,referentes!$W:$W,0)))","v":""},null,null,""]
[null,{"$f":"IF(C10=\"\",\"\",IF(COUNTIF($C$3:C10, C10)>1, \"\", C10))","v":""},{"$f":"IF(G10=\"\",\"\",CONCATENATE(DIGITADOR!$M$1,G10,E10))","v":""},"",{"$f":"IF(F10=\"\",\"\",INDEX(referentes!$S:$S,MATCH(F10,referentes!$W:$W,0)))","v":""},null,null,""]
[null,{"$f":"IF(C11=\"\",\"\",IF(COUNTIF($C$3:C11, C11)>1, \"\", C11))","v":""},{"$f":"IF(G11=\"\",\"\",CONCATENATE(DIGITADOR!$M$1,G11,E11))","v":""},"",{"$f":"IF(F11=\"\",\"\",INDEX(referentes!$S:$S,MATCH(F11,referentes!$W:$W,0)))","v":""},null,null,""]
[null,{"$f":"IF(C12=\"\",\"\",IF(COUNTIF($C$3:C12, C12)>1, \"\", C12))","v":""},{"$f":"IF(G12=\"\",\"\",CONCATENATE(DIGITADOR!$M$1,G12,E12))","v":""},"",{"$f":"IF(F12=\"\",\"\",INDEX(referentes!$S:$S,MATCH(F12,referentes!$W:$W,0)))","v":""},null,null,""]
[null,{"$f":"IF(C13=\"\",\"\",IF(COUNTIF($C$3:C13, C13)>1, \"\", C13))","v":""},{"$f":"IF(G13=\"\",\"\",CONCATENATE(DIGITADOR!$M$1,G13,E13))","v":""},"",{"$f":"IF(F13=\"\",\"\",INDEX(referentes!$S:$S,MATCH(F13,referentes!$W:$W,0)))","v":""},null,null,""]
[null,{"$f":"IF(C14=\"\",\"\",IF(COUNTIF($C$3:C14, C14)>1, \"\", C14))","v":""},{"$f":"IF(G14=\"\",\"\",CONCATENATE(DIGITADOR!$M$1,G14,E14))","v":""},"",{"$f":"IF(F14=\"\",\"\",INDEX(referentes!$S:$S,MATCH(F14,referentes!$W:$W,0)))","v":""},null,null,""]
[null,{"$f":"IF(C15=\"\",\"\",IF(COUNTIF($C$3:C15, C15)>1, \"\", C15))","v":""},{"$f":"IF(G15=\"\",\"\",CONCATENATE(DIGITADOR!$M$1,G15,E15))","v":""},"",{"$f":"IF(F15=\"\",\"\",INDEX(referentes!$S:$S,MATCH(F15,referentes!$W:$W,0)))","v":""},null,null,""]
[null,{"$f":"IF(C16=\"\",\"\",IF(COUNTIF($C$3:C16, C16)>1, \"\", C16))","v":""},{"$f":"IF(G16=\"\",\"\",CONCATENATE(DIGITADOR!$M$1,G16,E16))","v":""},"",{"$f":"IF(F16=\"\",\"\",INDEX(referentes!$S:$S,MATCH(F16,referentes!$W:$W,0)))","v":""},null,null,""]
[null,{"$f":"IF(C17=\"\",\"\",IF(COUNTIF($C$3:C17, C17)>1, \"\", C17))","v":""},{"$f":"IF(G17=\"\",\"\",CONCATENATE(DIGITADOR!$M$1,G17,E17))","v":""},"",{"$f":"IF(F17=\"\",\"\",INDEX(referentes!$S:$S,MATCH(F17,referentes!$W:$W,0)))","v":""},null,null,""]
[null,{"$f":"IF(C18=\"\",\"\",IF(COUNTIF($C$3:C18, C18)>1, \"\", C18))","v":""},{"$f":"IF(G18=\"\",\"\",CONCATENATE(DIGITADOR!$M$1,G18,E18))","v":""},"",{"$f":"IF(F18=\"\",\"\",INDEX(referentes!$S:$S,MATCH(F18,referentes!$W:$W,0)))","v":""},null,null,""]
[null,{"$f":"IF(C19=\"\",\"\",IF(COUNTIF($C$3:C19, C19)>1, \"\", C19))","v":""},{"$f":"IF(G19=\"\",\"\",CONCATENATE(DIGITADOR!$M$1,G19,E19))","v":""},"",{"$f":"IF(F19=\"\",\"\",INDEX(referentes!$S:$S,MATCH(F19,referentes!$W:$W,0)))","v":""},null,null,""]
[null,{"$f":"IF(C20=\"\",\"\",IF(COUNTIF($C$3:C20, C20)>1, \"\", C20))","v":""},{"$f":"IF(G20=\"\",\"\",CONCATENATE(DIGITADOR!$M$1,G20,E20))","v":""},"",{"$f":"IF(F20=\"\",\"\",INDEX(referentes!$S:$S,MATCH(F20,referentes!$W:$W,0)))","v":""},null,null,""]
{"$rows_left_out":285}
{"sheet":"referentes","index":4,"n_rows":140,"n_cols":30,"rows_kept":140,"cut":false,"hidden":false,"merged":[]}
["AG_LOV",3064,null,"AG_LOV",2007,null,"AG_LOV",3002,null,"AG_LOV",1071,null,"AG_LOV",1072,null,"cod_letras","descripcion",null,"secuencia_loc","prefijo_cdg_est_loc","codigo_estacion_loc","descripcion_estacion_loc","lugar"]
[4519,"Lluvia",null,"LTA","Litoral arenoso",null,"Macrofauna","Macrofauna",null,4522,"Nucleador/Corazonador",null,4523,"Toma directa con corazonador hasta 0.3 m2",null,null,null,"clave_sibm",55958,"Bahia_Cocinetas",96321,null,"Bahia Cocinetas1",null,3546,"Administrador SIGMA"]
[4520,"Seca",null,1,"Area coralina",null,"Megafauna","Megafauna",null,1,"Draga van Veen ",null,4524,"4 parcelas por estación y subcuadrantes de 9 m2",null,null,null,null,55957,"Bahia_Hondita",96321,null,"Bahia Hondita1",null,3444,"Alexandra Rodríguez",null,null,"AD Pto. Moin C.R.","Administración Desarrollo Complejo Portuario  Limón Moin Costa Rica"]
[4521,"Transición",null,2,"Columna de agua",null,"Meiofauna","Meiofauna",null,2,"Box Corer",null,1,"Lance Box corer 0,250 m2",null,null,null,null,55959,"Bahia_Tukakas",96321,null,"Bahia Tukakaspl1",null,8258,"Daniel Fernando Jiménez Rincón",null,null,"ANADARKO","Anadarko Colombia Company"]
[null,null,null,3,"Fondos blandos plataforma",null,"Microfauna","Microfauna",null,3,"Red de arrastre demersal tipo semi-balón",null,2,"Lance Box corer 0,0625 m2",null,null,null,null,55967,"Boca_Laenea1",96321,null,"Boca La enea1",null,8378,"David Alejandro Navarrete Rodríguez",null,null,"AQUABIOSFERA","Aquabiosfera SAS"]
[null,null,null,4,"Fondos duros plataforma",null,null,null,null,null,null,null,3,"Lance Draga van Veen 0,075 m2",null,null,null,null,55968,"Boca_Laenea2",96321,null,"Boca La enea2",null,4918,"Edgar Fernando Dorado Roncancio",null,null,"CALIDRIS","Asociación Calidris"]
[null,null,null,5,"Litoral rocoso",null,null,null,null,null,null,null,4,"Lance Draga van Veen 0,4 m2",null,null,null,null,56558,"Bocas_Atrato",96321,null,"Bocas del Atrato1",null,3403,"Eliana Marcela Barrios Vasquez",null,null,"ASOCARS","Asociación de Corporaciones Autónomas Regionales"]
[null,null,null,6,"Manglar",null,null,null,null,null,null,null,5,"Arrastre bentonico 10 min / 2,5 nudos",null,null,null,null,55972,"Broqueles",96321,null,"Broqueles1",null,7840,"Fair Fernando Dager Osorio",null,null,"ANLA","Autoridad Nacional de Licencias Ambientales"]
[null,null,null,7,"Playas",null,null,null,null,null,null,null,null,null,null,null,null,null,57245,"Buenavista1",96321,null,"Buenavista1",null,5685,"Henry Fabian Bustos Ordoñez",null,null,"ARAP","Autoridad de Recursos Acuáticos de Panamá"]
[null,null,null,8,"Praderas de pastos",null,null,null,null,null,null,null,null,null,null,null,null,null,57246,"Buenavista2",96321,null,"Buenavista2",null,7841,"Jean David Varilla Gonzalez",null,null,"CWOP","Caribbean-Wide Orca Project"]
[null,null,null,9,"Sustrato artificial",null,null,null,null,null,null,null,null,null,null,null,null,null,56551,"Camaronera",96321,null,"Camaronera1",null,8277,"Jeffry Bolaños",null,null,"CEAC","Centro de Estudios Ambientales de Cienfuegos"]
[null,null,null,10,"Fondos blandos del talud",null,null,null,null,null,null,null,null,null,null,null,null,null,55970,"Cristo_Rey",96321,null,"Cristo Rey1",null,8263,"Johan Casadiego Estévez",null,null,"CECIMAR","Centro de Estudios en Ciencias del Mar - Universidad Nacional"]
[null,null,null,11,"Oceánico costa afuera",null,null,null,null,null,null,null,null,null,null,null,null,null,55961,"Dibulla1_Occidente",96321,null,"Dibulla1 Occidente -Rio Jerez",null,7141,"Juan Camilo Rodríguez Atara",null,null,"CIEMAT","Centro de Investigaciones Energéticas, Medioambientales y Tecnológicas"]
[null,null,null,12,"Comunidad Planctónica",null,null,null,null,null,null,null,null,null,null,null,null,null,55962,"Dibulla2_Occidente",96321,null,"Dibulla2 Occidente -Rio Jerez",null,8264,"Juan Fernando Cortina Munera",null,null,"CIOH","Centro de Investigaciones Oceanográficas e Hidrográficas"]
[null,null,null,14,"Ciénaga",null,null,null,null,null,null,null,null,null,null,null,null,null,55974,"Laguna_Bocacorea",96321,null,"Laguna Bocacorea1",null,8217,"Juan Lazarus",null,null,"C.C.C.P.","Centro de Investigaciones Oceanográficas e Hidrográficas del Pacífico"]
[null,null,null,15,"Desembarco de pesca artesanal",null,null,null,null,null,null,null,null,null,null,null,null,null,56887,"4484701OCEA",100,null,"PMO - BAHIA COCINETAS",null,8265,"Kevin Samuel Moreno",null,null,"CEINER","Centro de Investigación Educación y Recreación Islas del Rosario"]
[null,null,null,null,null,null,null,null,null,null,null,null,null,null,null,null,null,null,56888,"4484703OCEA",100,null,"PMO - BAHIA HONDITA",null,8377,"Lady Liliana Espinosa Leal",null,null,"CIRA","Centro de Investigación de los Recursos Acuáticos de Nicaragua (CIRA)"]
[null,null,null,null,null,null,null,null,null,null,null,null,null,null,null,null,null,null,56886,"4484702OCEA",100,null,"PMO - BAHIA TUKAKAS",null,7757,"Laura  Martínez Lacharme",null,null,"CICA","Centro de Investigación en Contaminación Ambiental"]
[null,null,null,null,null,null,null,null,null,null,null,null,null,null,null,null,null,null,56921,"0583740OCEA",100,null,"PMO - BAHÍA EL UNO",null,4227,"Laura Sanchez Valencia",null,null,"CRBMUV","Colección de Referencia Biología Marina Universidad del Valle"]
[null,null,null,null,null,null,null,null,null,null,null,null,null,null,null,null,null,null,56895,"4456009OCEA",100,null,"PMO - BALLENAS",null,3281,"Leonardo José Arias Alemán (2022)",null,null,"Coleccion_Personal","Colección personal"]
{"$rows_left_out":121}
{"sheet":"Otras referencias","index":5,"n_rows":33,"n_cols":16,"rows_kept":33,"cut":false,"hidden":false,"merged":[[20,3,20,5],[4,13,4,15],[4,3,4,5],[4,7,4,8],[0,0,2,6],[4,0,4,1],[4,10,4,11]]}
["Estas son listas para variables con valores que no se encuentran codificados, pero que deben manejarse de manera estandarizada. \nSi se requiere agregar un valor nuevo hagalo debajo de la lista correspondiente"]
[]
[]
[]
["UNIDADES DE MEDIDA",null,null,"PROYECTO",null,null,null,"ROLES",null,null,"METODOLOGIAS",null,null,"TEMATICAS"]
["CODIGO","DESCRIPCION",null,"COD","PROYECTO","PROYECTO DESC",null,4,"Captura en campo",null,"CODIGO","DESCRIPCION",null,"COD METODOLOGIA","COD TEMATICA","DESCRIPCION"]
[10,"cm",null,3572,"KFW","KFW",null,6,"Revisar datos",null,871,"Playas - MEGAFAUNA",null,870,268,"PLAYAS MACROFAUNA"]
[11,"m",null,null,null,null,null,3497,"Coordinador actividad de campo",null,870,"Playas - MACROFAUNA",null,871,269,"PLAYAS MEGAFAUNA"]
[69,"g",null,null,null,null,null,4526,"Procesamiento en laboratorio",null,869,"Oceanografía",null,869,267,"OLEAJE"]
[142,"Ind/Estación"]
[]
[]
[]
[]
[]
[]
[]
[]
[]
[]
{"$rows_left_out":14}
{"sheet":"AGD_MUESTREOS","index":6,"n_rows":0,"n_cols":0,"rows_kept":0,"cut":false,"hidden":true,"merged":[]}

{"sheet":"AGD_PARAMETRO","index":7,"n_rows":0,"n_cols":0,"rows_kept":0,"cut":false,"hidden":true,"merged":[]}

{"sheet":"AGD_MUESTRAS","index":8,"n_rows":0,"n_cols":0,"rows_kept":0,"cut":false,"hidden":true,"merged":[]}

{"sheet":"AGD_MUESTRAS_VARIABLES","index":9,"n_rows":0,"n_cols":0,"rows_kept":0,"cut":false,"hidden":true,"merged":[]}

{"sheet":"AGD_AUTORIAS","index":10,"n_rows":0,"n_cols":0,"rows_kept":0,"cut":false,"hidden":true,"merged":[]}