{"text_format":"1","workbook":"xlsx","n_sheets":16,"sheets":["Registro de cambios","configuracion_finos","configuracion_gruesos","configuracion_amp","DIGITADOR","DATOS_AMP","DATOS_FINOS","DATOS_GRUESOS","referentes","otras referencias","AGD_MUESTREOS","AGD_PARAMETRO","AGD_MUESTRAS","AGD_MUESTRAS_VARIABLES","AGD_AUTORIAS","MUESTRAS"],"not_rendered":{"charts":0,"images":0,"macros":1,"external_links":1,"defined_names":145,"comments":6,"pivot_tables":0},"unopened":[],"bounds":{"document_bytes":16777216,"sheet_cells":100000,"rows_first":2000,"rows_last":500,"rows_between":2000,"halvings":0,"cell_chars":16384,"cell_head_chars":4096},"cells_cut":0,"cells_raw":0,"read":"whole","date_system":"1900"}

{"sheet":"Registro de cambios","index":0,"n_rows":7,"n_cols":7,"rows_kept":7,"cut":false,"hidden":true,"merged":[[1,3,1,6]]}
[]
[null,null,null,"REGISTRO DE CAMBIOS"]
[null,null,null,"VERSIÓN No.","CAMBIO REALIZADO","AUTOR","VIGENTE DESDE"]
[null,null,null,"20250421m","Creación de nuevas parcelas de monitoreo para el proyecto \"Línea Base ambiental ECOPETROL\".","Kevin Moreno","2025-04-21"]
[null,null,null,"20240515i","Actualización del código de la macro.\n\nSe eliminó la URL de la antigua API de portete:\n       http://portete.invemar.org.co:7003/ArgosWebServices-RESTWebService-context-root/rest/1.0\n\nFue reemplazada por la URL de la API de ARGOS:\n       https://argos.invemar.org.co/api/\n\nLa API contiene Endpoints que permiten tener mayor control, facilitan la descarga de referentes (listas de usuarios, estaciones, especies, etc.) que corresponden a criterios específicos como el proyecto usado en la plantilla para evitar descargar data innecesaria.\n\nDel mismo modo, también permite la carga de información a la BDD del INVEMAR.\nLos Endpoints fueron aplicados en las 3 hojas de configuración para AMP, Detritos Finos y Detritos Gruesos.","Kevin Moreno","15/5/2024"]
[null,null,null,"20240214i","1. Actualización de parcelas, se agregaron nuevas parcelas de:\nBahía de Cispatá, Bahía Hondita, Golfo de Urabá, Bahía Málaga.\n\n2. Se agregó una nueva url para los datos de parcelas, la cual, se encuentra en la pestaña; configuracion_finos, celda: B67, está solo es del proyecto 3700, por lo tanto, en el código se no se relacionó con las celdas: C7 de configuracion, es decir, el código se modificó. \n\n3. Se modificó el contenido de la celda B8 en la pestaña DIGITADOR, el cual, se descarga en referentes, se colocó el nombre del proyecto – nombre con el ente que se hace el convenio.\n\n4. Se actualizaron algunos campos debido a los cambios generados.\n\n5. Se agregaron 3 especies nuevas a AMP en referentes.","Luz Parra","14/2/2024"]
[null,null,null,"20231123i","Creación de 3 hojas de datos que abarcan las tres temáticas de Necromasa, las cuales son AMP, Detritos Finos y Detritos Gruesos.\n\nCada hoja tiene su respectiva hoja de consiguración, ajustadas según la estructura de cada temática.\n\nSe validan los datos obligatorios.\n\nSe modifica el código de las macros para la descarga de referentes, generación de tablas y carga de datos al sistema.","Kevin Moreno","23/11/2023"]

{"sheet":"configuracion_finos","index":1,"n_rows":84,"n_cols":11,"rows_kept":84,"cut":false,"hidden":true,"merged":[[74,0,74,2],[28,0,35,0],[37,0,42,0],[45,0,45,1],[0,0,2,0],[3,0,5,0],[7,0,8,0],[9,0,15,0],[17,0,21,0],[23,0,26,0]]}
["general","urlServicio","https://argos.invemar.org.co/api/"]
[null,"fila de inicio",3]
[null,"fila de fin",303]
["metodologias","Metodologias",880]
[null,"Referentes",500]
[null,"Cantidad maxima de referentes ",500]
["estaciones/investigadores","proyectos",3700]
["Lista especies","metodologias"]
{"$rows_left_out":77}
{"sheet":"configuracion_gruesos","index":2,"n_rows":84,"n_cols":17,"rows_kept":84,"cut":false,"hidden":true,"merged":[[74,0,74,2],[28,0,35,0],[37,0,42,0],[45,0,45,1],[0,0,2,0],[3,0,5,0],[7,0,8,0],[9,0,15,0],[17,0,21,0],[23,0,26,0]]}
["general","urlServicio","https://argos.invemar.org.co/api/"]
[null,"fila de inicio",3]
[null,"fila de fin",303]
["metodologias","Metodologias",881]
[null,"Referentes",500]
[null,"Cantidad maxima de referentes ",500]
["estaciones/investigadores","proyectos",3700]
["Lista especies","metodologias"]
{"$rows_left_out":77}
{"sheet":"configuracion_amp","index":3,"n_rows":84,"n_cols":16,"rows_kept":84,"cut":false,"hidden":true,"merged":[[74,0,74,2],[28,0,35,0],[37,0,42,0],[45,0,45,1],[0,0,2,0],[3,0,5,0],[7,0,8,0],[9,0,15,0],[17,0,21,0],[23,0,26,0]]}
["general","urlServicio","https://argos.invemar.org.co/api/"]
[null,"fila de inicio",3]
[null,"fila de fin",303]
["metodologias","Metodologias",882]
[null,"Referentes",500]
[null,"Cantidad maxima de referentes ",500]
["estaciones/investigadores","proyectos",3700]
["Lista especies","metodologias",882]
{"$rows_left_out":77}
{"sheet":"DIGITADOR","index":4,"n_rows":35,"n_cols":22,"rows_kept":35,"cut":false,"hidden":false,"merged":[[25,0,25,1],[3,0,4,0],[0,0,0,1],[0,3,4,10],[22,0,22,1],[5,3,15,10],[16,3,21,10]]}
["Necromasa - Detritos Finos De Madera (DFM)",null,null,"Recomendaciones generales: \n- ¡Precaución! No inserte Filas o Columnas.\n- En los casos en que falte un valor a ingresar que provenga de la hoja de referencias, informe para que el administrador del sistema haga las adiciones necesarias.\nEsta es una plantilla programada. Las columnas de color oscuro se llenan automaticamente, principalmente a partir de los contenidos de la hoja de referencias. \nNO UTILICE PUNTO Y COMA (;) en ningun campo, por ser el separador de variables (columnas). Tampoco escriba las unidades de medida, no son necesarias.\n- Para el correcto funcionamiento de la hoja debe estar activa la opcion de Excel de ejecutar macros (al abrir la hoja acepte la opcion habilitar macros, mensaje de Excel que aparece en la parte superior de la hoja en un recuadro amarillo). La extensión del archivo debe ser .xlsm\n- Se recomienda renombrar el archivo de la siguiente manera: Departamento_proyecto_sustrato-muestreo-año.xlsm",null,null,null,null,null,null,null,null,null,null,null,{"$f":"IF(A1<>\"\",INDEX('otras referencias'!$X$6:$Y$8,MATCH(DIGITADOR!A1,'otras referencias'!$Y$6:$Y$8,0),1),\"\")","v":"DATOS_FINOS"},{"$f":"IF(A1<>\"\",INDEX('otras referencias'!$X$6:$Z$8,MATCH(DIGITADOR!A1,'otras referencias'!$Y$6:$Y$8,0),3),\"\")","v":"configuracion_finos"},null,null,null,null,"http://portete.invemar.org.co:7003/ArgosWebServices-RESTWebService-context-root/rest/1.0/referente?finder=Metodologia;VAR_METODOLOGIA=880&limit=500"]
["Código Digitador",{"$f":"IF(B3<>\"\",IF(P1=\"DATOS_FINOS\",INDEX(referentes!$Z$2:$AA$17,MATCH(B3,referentes!AA$2:AA$17,0),1),IF(P1=\"DATOS_GRUESOS\",INDEX(referentes!$Z$2:$AA$17,MATCH(B3,referentes!$AA$2:$AA$17,0),1),IF(P1=\"DATOS_AMP\",INDEX(referentes!$Z$2:$AA$17,MATCH(B3,referentes!$AA$2:$AA$17,0),1)))),\"\")","v":""}]
["Nombre del Digitador"]
["Fecha en la que ingresa los datos en esta hoja","DD/MM/AAAA"]
[null,"3000-12-12"]
["Versión Plantilla",{"$f":"'Registro de cambios'!$D$4","v":"20250421m"},null,"* Seguir las siguientes instrucciones para el adecuado diligenciamiento y uso de la plantilla:\n\n- En la celda \"A1\", seleccionar la temática que desee.\n- Presionar el botón \"Descargar referentes\" para que el referente de ésta plantilla sean actualizados. \n- Diligenciar los datos en la hoja que se activó.\n- Una vez diligenciados los datos, debe presionar el botón \"Validación de datos\" para corroborar que todo esté en orden.\n- En caso de errores, corregir el error y volver a presionar el botón hasta la aprobación de la validación de datos.\n- Luego presionar el botón \"Generar tablas\" para que los datos sean organizados antes de cargarlos al Sistema de Información.\n- Antes de presionar el botón \"Generar tablas\" verifique que:\na. No haya celdas con valores como \"#N/A\" o \"#¡REF!\".\nb. No se estén aplicando filtros en la hoja de datos.\n- Para finalizar, presione el botón \"Cargar datos\"."]
["Código Proyecto Convenio",{"$f":"IF(B8<>\"\",IF(P1=\"DATOS_FINOS\",INDEX(referentes!D2:E12,MATCH(B8,referentes!E2:E12,0),1),IF(P1=\"DATOS_GRUESOS\",INDEX(referentes!$D$2:$E$45,MATCH(B8,referentes!$E$2:$E$45,0),1),IF(P1=\"DATOS_AMP\",INDEX(referentes!$G$2:$H$45,MATCH(B8,referentes!$H$2:$H$45,0),1)))),\"\")","v":""}]
["Proyecto Convenio"]
{"$rows_left_out":28}
{"sheet":"DATOS_AMP","index":5,"n_rows":303,"n_cols":27,"rows_kept":303,"cut":false,"hidden":true,"merged":[[0,5,0,6],[0,8,0,26]]}
[null,null,null,null,null,"MUESTREO",null,null,"MUESTRA"]
[{"$f":"TEXT(DIGITADOR!$B$5,\"yyyymmdd\")","v":"30001212"},"AGM MUESTREO","ID MUESTREO","ID MUESTRA","ID ESTACION","Parcela","Fecha",null,"Especie",null,"COD Tipo Fisiográfico","Tipo\nfisiográfico","Altura\n(m)",null,"DAP\n(cm)","DAP\n(m)","DAP\n(m2)","Número de golpes","Longitud de penetración (cm)",null,"P (Penetración por golpe)","I\n(Valor de acuerdo a la penetración <1 o >1)","Volumen\n(m^3)","Densidad\n(gr/cm3)","Densidad\n(kg/m3)","Necromasa (kg)","Observaciones"]
[null,{"$f":"IF(C3=\"\",\"\",IF(COUNTIF($C$3:C3, C3)>1, \"\", C3))","v":""},{"$f":"IF(G3=\"\",\"\",IF(F3=\"\",\"\",CONCATENATE(3,DIGITADOR!$M$1,G3,E3)))","v":""},{"$f":"IF(C3=\"\",\"\",CONCATENATE(C3,ROW()-2))","v":""},{"$f":"IF(F3=\"\",\"\",VLOOKUP(F3,referentes!$T$2:$W$200,2,FALSE))","v":""},null,null,{"$f":"IF(I3=\"\", \"\", VLOOKUP(I3,referentes!$J$2:$Q$14,2,FALSE))","v":""},null,null,{"$f":"IF(L3=\"\", \"\", INDEX(referentes!$D$2:$E$17,MATCH(L3,referentes!E$2:E$17,0),1))","v":""},null,null,null,null,{"$f":"IF(O3=\"\",\"\", ROUND(O3/100, 4))","v":""},{"$f":"IF(P3=\"\",\"\", ROUND(P3^2, 4))","v":""},null,null,null,{"$f":"IF(R3=\"\", \"\", IF(R3=20, IF(S3<>\"\", ROUND(S3/R3, 6), \"\"), ROUND(20/(R3-0.5), 6)))","v":""},{"$f":"IF(U3=\"\", \"\", IF(U3 < 1, 0, 1))","v":""},{"$f":"IF(OR(M3=\"\",Q3=\"\"), \"\", ROUND((PI()/4)*Q3*M3, 6))","v":""},{"$f":"IF(AND(U3=\"\",V3=\"\"),\"\",ROUND(IF(V3=0,0.6451-0.388*(LOG10(U3))-0.377*V3+0.3*(LOG10(U3))*V3, 0.6451-0.388*(LOG10(U3))-0.377*V3+0.3*(LOG10(U3))), 6))","v":""},{"$f":"IF(X3=\"\",\"\", ROUND((X3*1000000/1000), 6))","v":""},{"$f":"IF(OR(W3=\"\",Y3=\"\"), \"\", ROUND(W3*Y3, 6))","v":""}]
[null,{"$f":"IF(C4=\"\",\"\",IF(COUNTIF($C$3:C4, C4)>1, \"\", C4))","v":""},{"$f":"IF(G4=\"\",\"\",IF(F4=\"\",\"\",CONCATENATE(3,DIGITADOR!$M$1,G4,E4)))","v":""},{"$f":"IF(C4=\"\",\"\",CONCATENATE(C4,ROW()-2))","v":""},{"$f":"IF(F4=\"\",\"\",VLOOKUP(F4,referentes!$T$2:$W$200,2,FALSE))","v":""},null,null,{"$f":"IF(I4=\"\", \"\", VLOOKUP(I4,referentes!$J$2:$Q$14,2,FALSE))","v":""},null,null,{"$f":"IF(L4=\"\", \"\", INDEX(referentes!$D$2:$E$17,MATCH(L4,referentes!E$2:E$17,0),1))","v":""},null,null,null,null,{"$f":"IF(O4=\"\",\"\", ROUND(O4/100, 4))","v":""},{"$f":"IF(P4=\"\",\"\", ROUND(P4^2, 4))","v":""},null,null,null,{"$f":"IF(R4=\"\", \"\", IF(R4=20, IF(S4<>\"\", ROUND(S4/R4, 6), \"\"), ROUND(20/(R4-0.5), 6)))","v":""},{"$f":"IF(U4=\"\", \"\", IF(U4 < 1, 0, 1))","v":""},{"$f":"IF(OR(M4=\"\",Q4=\"\"), \"\", ROUND((PI()/4)*Q4*M4, 6))","v":""},{"$f":"IF(AND(U4=\"\",V4=\"\"),\"\",ROUND(IF(V4=0,0.6451-0.388*(LOG10(U4))-0.377*V4+0.3*(LOG10(U4))*V4, 0.6451-0.388*(LOG10(U4))-0.377*V4+0.3*(LOG10(U4))), 6))","v":""},{"$f":"IF(X4=\"\",\"\", ROUND((X4*1000000/1000), 6))","v":""},{"$f":"IF(OR(W4=\"\",Y4=\"\"), \"\", ROUND(W4*Y4, 6))","v":""}]
[null,{"$f":"IF(C5=\"\",\"\",IF(COUNTIF($C$3:C5, C5)>1, \"\", C5))","v":""},{"$f":"IF(G5=\"\",\"\",IF(F5=\"\",\"\",CONCATENATE(3,DIGITADOR!$M$1,G5,E5)))","v":""},"",{"$f":"IF(F5=\"\",\"\",VLOOKUP(F5,referentes!$T$2:$W$200,2,FALSE))","v":""},null,null,{"$f":"IF(I5=\"\", \"\", VLOOKUP(I5,referentes!$J$2:$Q$14,2,FALSE))","v":""},null,null,{"$f":"IF(L5=\"\", \"\", INDEX(referentes!$D$2:$E$17,MATCH(L5,referentes!E$2:E$17,0),1))","v":""},null,null,null,null,"","",null,null,null,"","","","","",""]
[null,{"$f":"IF(C6=\"\",\"\",IF(COUNTIF($C$3:C6, C6)>1, \"\", C6))","v":""},{"$f":"IF(G6=\"\",\"\",IF(F6=\"\",\"\",CONCATENATE(3,DIGITADOR!$M$1,G6,E6)))","v":""},"",{"$f":"IF(F6=\"\",\"\",VLOOKUP(F6,referentes!$T$2:$W$200,2,FALSE))","v":""},null,null,{"$f":"IF(I6=\"\", \"\", VLOOKUP(I6,referentes!$J$2:$Q$14,2,FALSE))","v":""},null,null,{"$f":"IF(L6=\"\", \"\", INDEX(referentes!$D$2:$E$17,MATCH(L6,referentes!E$2:E$17,0),1))","v":""},null,null,null,null,"","",null,null,null,"","","","","",""]
[null,{"$f":"IF(C7=\"\",\"\",IF(COUNTIF($C$3:C7, C7)>1, \"\", C7))","v":""},{"$f":"IF(G7=\"\",\"\",IF(F7=\"\",\"\",CONCATENATE(3,DIGITADOR!$M$1,G7,E7)))","v":""},{"$f":"IF(C7=\"\",\"\",CONCATENATE(C7,ROW()-2))","v":""},{"$f":"IF(F7=\"\",\"\",VLOOKUP(F7,referentes!$T$2:$W$200,2,FALSE))","v":""},null,null,{"$f":"IF(I7=\"\", \"\", VLOOKUP(I7,referentes!$J$2:$Q$14,2,FALSE))","v":""},null,null,{"$f":"IF(L7=\"\", \"\", INDEX(referentes!$D$2:$E$17,MATCH(L7,referentes!E$2:E$17,0),1))","v":""},null,null,null,null,"","",null,null,null,"","","","","",""]
[null,{"$f":"IF(C8=\"\",\"\",IF(COUNTIF($C$3:C8, C8)>1, \"\", C8))","v":""},{"$f":"IF(G8=\"\",\"\",IF(F8=\"\",\"\",CONCATENATE(3,DIGITADOR!$M$1,G8,E8)))","v":""},{"$f":"IF(C8=\"\",\"\",CONCATENATE(C8,ROW()-2))","v":""},{"$f":"IF(F8=\"\",\"\",VLOOKUP(F8,referentes!$T$2:$W$200,2,FALSE))","v":""},null,null,{"$f":"IF(I8=\"\", \"\", VLOOKUP(I8,referentes!$J$2:$Q$14,2,FALSE))","v":""},null,null,{"$f":"IF(L8=\"\", \"\", INDEX(referentes!$D$2:$E$17,MATCH(L8,referentes!E$2:E$17,0),1))","v":""},null,null,null,null,{"$f":"IF(O8=\"\",\"\", ROUND(O8/100, 4))","v":""},"",null,null,null,"","","","","",""]
{"$rows_left_out":296}
{"sheet":"DATOS_FINOS","index":6,"n_rows":303,"n_cols":24,"rows_kept":303,"cut":false,"hidden":false,"merged":[[0,0,0,4],[0,5,0,6],[0,8,0,23]]}
[null,null,null,null,null,"MUESTREO",null,null,"MUESTRA"]
[{"$f":"TEXT(DIGITADOR!$B$5,\"yyyymmdd\")","v":"30001212"},"AGM MUESTREO","ID MUESTREO","ID MUESTRA","ID ESTACION","Parcela","Fecha\n(DD/MM/AAAA)",null,"COD Tipo Fisiográfico","Tipo fisiografico ","Transecto","Muestra ",null,"Diámetro\n(cm)","Diámetro\n(m)",null,"Longitud del fragmento (Cm)","Volumen total piezas transecto (m3)",null,"Masa seca\n(g)","Masa seca\n(kg)",null,null,"Observaciones"]
[null,{"$f":"IF(C3=\"\",\"\",IF(COUNTIF($C$3:C3, C3)>1, \"\", C3))","v":""},{"$f":"IF(G3=\"\",\"\",IF(F3=\"\",\"\",CONCATENATE(DIGITADOR!$M$1,G3,E3)))","v":""},{"$f":"IF(C3=\"\",\"\",CONCATENATE(C3,ROW()-2))","v":""},{"$f":"IF(F3=\"\",\"\",VLOOKUP(F3,referentes!$T$2:$W$200,2,FALSE))","v":""},null,null,null,{"$f":"IF(J3=\"\",\"\",VLOOKUP(J3,'otras referencias'!$A$12:$B$15,2,FALSE))","v":""},null,null,{"$f":"IF(F3=\"\",\"\",IF(COUNTIF($F$3:F3, F3)>1, \"\", 1))","v":""},null,null,{"$f":"IF(N3=\"\", \"\", N3/100)","v":""},null,null,null,null,null,{"$f":"IF(T3=\"\",\"\",T3/1000)","v":""}]
[null,{"$f":"IF(C4=\"\",\"\",IF(COUNTIF($C$3:C4, C4)>1, \"\", C4))","v":""},{"$f":"IF(G4=\"\",\"\",IF(F4=\"\",\"\",CONCATENATE(DIGITADOR!$M$1,G4,E4)))","v":""},{"$f":"IF(C4=\"\",\"\",CONCATENATE(C4,ROW()-2))","v":""},{"$f":"IF(F4=\"\",\"\",VLOOKUP(F4,referentes!$T$2:$W$200,2,FALSE))","v":""},null,null,null,{"$f":"IF(J4=\"\",\"\",VLOOKUP(J4,'otras referencias'!$A$12:$B$15,2,FALSE))","v":""},null,null,{"$f":"IF(F4=\"\",\"\",IF(COUNTIF($F$3:F4, F4)>1, L3+1, 1))","v":""},null,null,{"$f":"IF(N4=\"\", \"\", N4/100)","v":""},null,null,null,null,null,{"$f":"IF(T4=\"\",\"\",T4/1000)","v":""}]
[null,{"$f":"IF(C5=\"\",\"\",IF(COUNTIF($C$3:C5, C5)>1, \"\", C5))","v":""},{"$f":"IF(G5=\"\",\"\",IF(F5=\"\",\"\",CONCATENATE(DIGITADOR!$M$1,G5,E5)))","v":""},"",{"$f":"IF(F5=\"\",\"\",VLOOKUP(F5,referentes!$T$2:$W$200,2,FALSE))","v":""},null,null,null,{"$f":"IF(J5=\"\",\"\",VLOOKUP(J5,'otras referencias'!$A$12:$B$15,2,FALSE))","v":""},null,null,{"$f":"IF(F5=\"\",\"\",IF(COUNTIF($F$3:F5, F5)>1, L4+1, 1))","v":""},null,null,"",null,null,null,null,null,""]
[null,{"$f":"IF(C6=\"\",\"\",IF(COUNTIF($C$3:C6, C6)>1, \"\", C6))","v":""},{"$f":"IF(G6=\"\",\"\",IF(F6=\"\",\"\",CONCATENATE(DIGITADOR!$M$1,G6,E6)))","v":""},"",{"$f":"IF(F6=\"\",\"\",VLOOKUP(F6,referentes!$T$2:$W$200,2,FALSE))","v":""},null,null,null,{"$f":"IF(J6=\"\",\"\",VLOOKUP(J6,'otras referencias'!$A$12:$B$15,2,FALSE))","v":""},null,null,{"$f":"IF(F6=\"\",\"\",IF(COUNTIF($F$3:F6, F6)>1, L5+1, 1))","v":""},null,null,"",null,null,null,null,null,""]
[null,{"$f":"IF(C7=\"\",\"\",IF(COUNTIF($C$3:C7, C7)>1, \"\", C7))","v":""},{"$f":"IF(G7=\"\",\"\",IF(F7=\"\",\"\",CONCATENATE(DIGITADOR!$M$1,G7,E7)))","v":""},"",{"$f":"IF(F7=\"\",\"\",VLOOKUP(F7,referentes!$T$2:$W$200,2,FALSE))","v":""},null,null,null,{"$f":"IF(J7=\"\",\"\",VLOOKUP(J7,'otras referencias'!$A$12:$B$15,2,FALSE))","v":""},null,null,{"$f":"IF(F7=\"\",\"\",IF(COUNTIF($F$3:F7, F7)>1, L6+1, 1))","v":""},null,null,"",null,null,null,null,null,""]
[null,{"$f":"IF(C8=\"\",\"\",IF(COUNTIF($C$3:C8, C8)>1, \"\", C8))","v":""},{"$f":"IF(G8=\"\",\"\",IF(F8=\"\",\"\",CONCATENATE(DIGITADOR!$M$1,G8,E8)))","v":""},"",{"$f":"IF(F8=\"\",\"\",VLOOKUP(F8,referentes!$T$2:$W$200,2,FALSE))","v":""},null,null,null,{"$f":"IF(J8=\"\",\"\",VLOOKUP(J8,'otras referencias'!$A$12:$B$15,2,FALSE))","v":""},null,null,{"$f":"IF(F8=\"\",\"\",IF(COUNTIF($F$3:F8, F8)>1, L7+1, 1))","v":""},null,null,"",null,null,null,null,null,""]
{"$rows_left_out":296}
{"sheet":"DATOS_GRUESOS","index":7,"n_rows":301,"n_cols":25,"rows_kept":301,"cut":false,"hidden":true,"merged":[[0,5,0,6],[0,7,0,24],[0,0,0,4]]}
[null,null,null,null,null,"MUESTREO",null,"MUESTRA"]
[{"$f":"TEXT(DIGITADOR!$B$5,\"yyyymmdd\")","v":"30001212"},"AGM MUESTREO","ID MUESTREO","ID MUESTRA","ID ESTACION","Parcela","Fecha\n(DD/MM/AAAA)","COD Tipo Fisiográfico","Tipo Fisiográfico","Transecto","Número\nMuestra","Longitud\n(m)",null,"Diámetro\n(cm)","Diámetro\n(m)","Diámetro al cuadrado (m2)","Número de golpes","Longitud de\npenetración (cm)","P (Penetración por golpe)","I (Valor de acuerdo a la penetración <1 o >1)","Volumen\n(m3)","Densidad\n(gr/cm3)","Densidad\n(kg/m3)","Necromasa\n(Kg)","Observaciones"]
[null,{"$f":"IF(C3=\"\",\"\",IF(COUNTIF($C$3:C3, C3)>1, \"\", C3))","v":""},{"$f":"IF(G3=\"\",\"\",IF(F3=\"\",\"\",CONCATENATE(2,DIGITADOR!$M$1,G3,E3)))","v":""},{"$f":"IF(C3=\"\",\"\",CONCATENATE(C3,ROW()-2))","v":""},{"$f":"IF(F3=\"\",\"\",VLOOKUP(F3,referentes!$T$2:$W$77,2,FALSE))","v":""},null,null,{"$f":"IF(I3=\"\",\"\",VLOOKUP(I3,'otras referencias'!$A$12:$B$15,2,FALSE))","v":""},null,null,null,null,null,null,{"$f":"IF(N3=\"\",\"\",N3/100)","v":""},{"$f":"IF(O3=\"\",\"\",O3^2)","v":""},null,null,{"$f":"IF(OR(Q3=\"\",R3=\"\"), IF(R3<>\"\", \"\", IF(Q3=\"\",\"\", ROUND(20/(Q3-0.5), 4))), R3/Q3)","v":""},{"$f":"IF(S3=\"\",\"\",IF(S3<1,0,1))","v":""},{"$f":"IF(OR(L3=\"\",P3=\"\"),\"\",ROUND((PI()/4)*L3*P3, 4))","v":""},{"$f":"IF(AND(S3=\"\",T3=\"\"),\"\",ROUND(IF(T3=0,0.6451-0.388*(LOG10(S3))-0.377*T3+0.3*(LOG10(S3))*T3, 0.6451-0.388*(LOG10(S3))-0.377*T3+0.3*(LOG10(S3))), 4))","v":""},{"$f":"IF(V3=\"\",\"\",ROUND((V3*1000000/1000), 4))","v":""},{"$f":"IF(OR(U3=\"\",W3=\"\"),\"\",ROUND(U3*W3,4))","v":""}]
[null,{"$f":"IF(C4=\"\",\"\",IF(COUNTIF($C$3:C4, C4)>1, \"\", C4))","v":""},{"$f":"IF(G4=\"\",\"\",IF(F4=\"\",\"\",CONCATENATE(2,DIGITADOR!$M$1,G4,E4)))","v":""},{"$f":"IF(C4=\"\",\"\",CONCATENATE(C4,ROW()-2))","v":""},{"$f":"IF(F4=\"\",\"\",VLOOKUP(F4,referentes!$T$2:$W$77,2,FALSE))","v":""},null,null,{"$f":"IF(I4=\"\",\"\",VLOOKUP(I4,'otras referencias'!$A$12:$B$15,2,FALSE))","v":""},null,null,null,null,null,null,{"$f":"IF(N4=\"\",\"\",N4/100)","v":""},{"$f":"IF(O4=\"\",\"\",O4^2)","v":""},null,null,{"$f":"IF(OR(Q4=\"\",R4=\"\"), IF(R4<>\"\", \"\", IF(Q4=\"\",\"\", ROUND(20/(Q4-0.5), 4))), R4/Q4)","v":""},{"$f":"IF(S4=\"\",\"\",IF(S4<1,0,1))","v":""},{"$f":"IF(OR(L4=\"\",P4=\"\"),\"\",ROUND((PI()/4)*L4*P4, 4))","v":""},{"$f":"IF(AND(S4=\"\",T4=\"\"),\"\",ROUND(IF(T4=0,0.6451-0.388*(LOG10(S4))-0.377*T4+0.3*(LOG10(S4))*T4, 0.6451-0.388*(LOG10(S4))-0.377*T4+0.3*(LOG10(S4))), 4))","v":""},{"$f":"IF(V4=\"\",\"\",ROUND((V4*1000000/1000), 4))","v":""},{"$f":"IF(OR(U4=\"\",W4=\"\"),\"\",ROUND(U4*W4,4))","v":""}]
[null,{"$f":"IF(C5=\"\",\"\",IF(COUNTIF($C$3:C5, C5)>1, \"\", C5))","v":""},{"$f":"IF(G5=\"\",\"\",IF(F5=\"\",\"\",CONCATENATE(2,DIGITADOR!$M$1,G5,E5)))","v":""},"",{"$f":"IF(F5=\"\",\"\",VLOOKUP(F5,referentes!$T$2:$W$77,2,FALSE))","v":""},null,null,{"$f":"IF(I5=\"\",\"\",VLOOKUP(I5,'otras referencias'!$A$12:$B$15,2,FALSE))","v":""},null,null,null,null,null,null,"",{"$f":"IF(O5=\"\",\"\",O5^2)","v":""},null,null,"",{"$f":"IF(S5=\"\",\"\",IF(S5<1,0,1))","v":""},"","","",""]
[null,{"$f":"IF(C6=\"\",\"\",IF(COUNTIF($C$3:C6, C6)>1, \"\", C6))","v":""},{"$f":"IF(G6=\"\",\"\",IF(F6=\"\",\"\",CONCATENATE(2,DIGITADOR!$M$1,G6,E6)))","v":""},"",{"$f":"IF(F6=\"\",\"\",VLOOKUP(F6,referentes!$T$2:$W$77,2,FALSE))","v":""},null,null,{"$f":"IF(I6=\"\",\"\",VLOOKUP(I6,'otras referencias'!$A$12:$B$15,2,FALSE))","v":""},null,null,null,null,null,null,"",{"$f":"IF(O6=\"\",\"\",O6^2)","v":""},null,null,"","","","","",""]
[null,{"$f":"IF(C7=\"\",\"\",IF(COUNTIF($C$3:C7, C7)>1, \"\", C7))","v":""},{"$f":"IF(G7=\"\",\"\",IF(F7=\"\",\"\",CONCATENATE(2,DIGITADOR!$M$1,G7,E7)))","v":""},"",{"$f":"IF(F7=\"\",\"\",VLOOKUP(F7,referentes!$T$2:$W$77,2,FALSE))","v":""},null,null,{"$f":"IF(I7=\"\",\"\",VLOOKUP(I7,'otras referencias'!$A$12:$B$15,2,FALSE))","v":""},null,null,null,null,null,null,"","",null,null,"","","","","",""]
[null,{"$f":"IF(C8=\"\",\"\",IF(COUNTIF($C$3:C8, C8)>1, \"\", C8))","v":""},{"$f":"IF(G8=\"\",\"\",IF(F8=\"\",\"\",CONCATENATE(2,DIGITADOR!$M$1,G8,E8)))","v":""},"",{"$f":"IF(F8=\"\",\"\",VLOOKUP(F8,referentes!$T$2:$W$77,2,FALSE))","v":""},null,null,{"$f":"IF(I8=\"\",\"\",VLOOKUP(I8,'otras referencias'!$A$12:$B$15,2,FALSE))","v":""},null,null,null,null,null,null,"","",null,null,"","","","","",""]
{"$rows_left_out":294}
{"sheet":"referentes","index":8,"n_rows":171,"n_cols":27,"rows_kept":171,"cut":false,"hidden":false,"merged":[]}
[]
[4542,"Borde",null,"Carbono Azul - CORALINA","Carbono Azul - CORALINA",null,null,null,null,null,null,null,null,null,null,null,null,null,null,"Ararca P6",57491,"P",6,null,null,8619,"Juan Pablo Caicedo García"]
[4543,"Cuenca",null,4545,"Carbono Azul - Vida Manglar",null,null,null,null,null,null,null,null,null,null,null,null,null,null,"Ararca P7",57492,"P",7,null,null,8265,"Kevin Samuel Moreno"]
["Interior","Interior",null,"Carbono Azul - Conserv. Internacional","Carbono Azul - Conservación Internacional",null,null,null,null,null,null,null,null,null,null,null,null,null,null,"Bahía Honda P1",57442,"P",1,null,null,8642,"Milena Hernández Ortiz"]
[4552,"Ribereño",null,4548,"Carbono Azul - Fundación Grupo ARGOS",null,null,null,null,null,null,null,null,null,null,null,null,null,null,"Bahía Honda P2",57443,"P",2,null,null,4521,"Sebastian Herrera Fajardo"]
[null,null,null,"Carbono Azul - DAMCRA","Carbono Azul - DAMCRA",null,null,null,null,null,null,null,null,null,null,null,null,null,null,"Bahía Honda P3",57444,"P",3,null,null,8057,"Tania Carolina Hoyos Ruiz"]
[null,null,null,"Carbono Azul - GEF_SAMP","Carbono Azul - GEF_SAMP",null,null,null,null,null,null,null,null,null,null,null,null,null,null,"Bahía Hondita EMH1",57916,"EMH",1,null,null,8266,"Zulay Saudith González Herrera"]
[null,null,null,"Carbono Azul - Bolívar","Carbono Azul - Bolívar",null,null,null,null,null,null,null,null,null,null,null,null,null,null,"Bahía Hondita EMH2",57917,"EMH",2]
{"$rows_left_out":164}
{"sheet":"otras referencias","index":9,"n_rows":96,"n_cols":32,"rows_kept":96,"cut":false,"hidden":false,"merged":[[0,0,2,10],[4,0,4,1],[4,5,4,6],[15,0,15,1],[4,11,4,12],[10,0,10,1],[32,0,32,2],[9,28,9,29],[10,28,10,29],[11,28,11,29],[4,27,4,31],[5,28,5,29],[6,28,6,29],[7,28,7,29],[8,28,8,29],[25,0,25,1],[19,0,19,1],[4,23,4,24],[4,20,4,21],[4,17,4,18],[4,14,4,15]]}
["Estas son listas para variables con valores que no se encuentran codificados, pero que deben manejarse de manera estandarizada. \nSi se requiere agregar un valor nuevo hagalo debajo de la lista correspondiente"]
[]
[]
[]
["TRANSECTOS",null,null,"METODOS",null,"ESTACION",null,null,null,null,null,"UNIDADES_DE_MEDIDA",null,null,"UNIDADES_PESO_MUESTRA",null,null,"ROL USUARIO",null,null,"FORMA",null,null,"TEMATICAS",null,"HOJA CONFIGURACION",null,"Descripción general de Proyecto Convenio\n3700"]
["A",null,null,"NOMBRE_MT","CODIGO","Descripcion","Codigo",null,null,null,null,"Descripcion","Codigo",null,"Descripcion","Codigo",null,"Rol","Id Rol",null,"FILA","Filamento",null,"DATOS_FINOS","Necromasa - Detritos Finos De Madera (DFM)","configuracion_finos",null,"Codigo del proyecto","Proyecto Convenio",null,"Descripción Siglas del convenio","Estaciones pertenecientes "]
["B",null,null,"Manual de métodos de SIMAC: Cadena rotulada cada diez eslabones","Car",{"$f":"CONCATENATE(referentes!AF2,\"-\",referentes!AG2, \" \",referentes!AI2)","v":"- "},{"$f":"referentes!AE2","v":0},null,null,null,null,"unidades/m2",136,null,"g",69,null,"Colectó muestra",10,null,"PELI","Película",null,"DATOS_GRUESOS","Necromasa - Detritos Gruesos de Madera (DGM)","configuracion_gruesos",null,4544,"Carbono Azul - CORALINA",null,"Corporación Coralina ","San Andres, Providencia y Sta Catalina"]
["C",null,null,null,null,{"$f":"CONCATENATE(referentes!AF3,\"-\",referentes!AG3, \" \",referentes!AI3)","v":"- "},{"$f":"referentes!AE3","v":0},null,null,null,null,"unidades/kg p.s",152,null,"kg",116,null,"Procesó muestra",11,null,"ESP","Espuma",null,"DATOS_AMP","Necromasa - Árboles Muertos En Pie (AMP)","configuracion_amp",null,4545,"Carbono Azul - Vida Manglar",null,"Proyecto Vida Manglar","Caimanera Y PNR Guacamayas\nBahía de Cispata"]
{"$rows_left_out":89}
{"sheet":"AGD_MUESTREOS","index":10,"n_rows":0,"n_cols":0,"rows_kept":0,"cut":false,"hidden":true,"merged":[]}

{"sheet":"AGD_PARAMETRO","index":11,"n_rows":0,"n_cols":0,"rows_kept":0,"cut":false,"hidden":true,"merged":[]}

{"sheet":"AGD_MUESTRAS","index":12,"n_rows":0,"n_cols":0,"rows_kept":0,"cut":false,"hidden":true,"merged":[]}

{"sheet":"AGD_MUESTRAS_VARIABLES","index":13,"n_rows":0,"n_cols":0,"rows_kept":0,"cut":false,"hidden":true,"merged":[]}

{"sheet":"AGD_AUTORIAS","index":14,"n_rows":0,"n_cols":0,"rows_kept":0,"cut":false,"hidden":true,"merged":[]}

{"sheet":"MUESTRAS","index":15,"n_rows":0,"n_cols":0,"rows_kept":0,"cut":false,"hidden":true,"merged":[]}