{"text_format":"1","workbook":"xlsx","n_sheets":11,"sheets":["Registro de cambios","configuracion","DIGITADOR","DATOS","referentes","Otras referencias","AGD_MUESTREOS","AGD_PARAMETRO","AGD_MUESTRAS","AGD_MUESTRAS_VARIABLES","AGD_AUTORIAS"],"not_rendered":{"charts":0,"images":0,"macros":1,"external_links":1,"defined_names":22,"comments":3,"pivot_tables":0},"unopened":[],"bounds":{"document_bytes":16777216,"sheet_cells":100000,"rows_first":2000,"rows_last":500,"rows_between":2000,"halvings":0,"cell_chars":16384,"cell_head_chars":4096},"cells_cut":0,"cells_raw":0,"read":"whole","date_system":"1900"}

{"sheet":"Registro de cambios","index":0,"n_rows":8,"n_cols":7,"rows_kept":8,"cut":false,"hidden":true,"merged":[[2,3,2,6]]}
[]
[]
[null,null,null,"REGISTRO DE CAMBIOS"]
[null,null,null,"VERSIÓN No.","CAMBIO REALIZADO","AUTOR","VIGENTE DESDE\n(DD/MM/AAAA)"]
[null,null,null,"20250421m","Creación de nuevas parcelas de monitoreo para el proyecto \"Línea Base ambiental ECOPETROL\".","Kevin Moreno","2025-04-21"]
[null,null,null,"20240515i","Actualización del código de la macro.\n\nSe eliminó la URL de la antigua API de portete:\n       http://portete.invemar.org.co:7003/ArgosWebServices-RESTWebService-context-root/rest/1.0\n\nFue reemplazada por la URL de la API de ARGOS:\n       https://argos.invemar.org.co/api/\n\nLa API contiene End Points que permiten tener mayor control, facilitan la descarga de referentes (listas de usuarios, estaciones, especies, etc.) que corresponden a criterios específicos como el proyecto usado en la plantilla para evitar descargar data innecesaria.\n\nDel mismo modo, también permite la carga de información a la BDD del INVEMAR.\n\nLa macro toma los Endpoints desde la hoja configuracion de una tabla llamada \"Configuración referentes\", a la que se le puede modificar las rutas de la API o agregar nuevas. cabe resaltar que se puede \"quemar\" directamente en la macro los Endpoints que lo requieran.","Kevin Moreno","15/05/2024"]
[null,null,null,"20240212i","1. Actualización de parcelas, se agregaron nuevas parcelas de:\nBahía de Cispatá, Bahía Hondita, Golfo de Urabá, Bahía Málaga.\n\n2. Se agregó una nueva url para los datos de parcelas, la cual, se encuentra en la pestaña; configuracion, celda: B67, está solo es del proyecto 3700, por lo tanto, en el código no se relacionó con las celdas: C7 de configuracion, es decir, el código se modificó.\n\n3. Se modificó el contenido de la celda B8 en la pestaña DIGITADOR, el cual, se descarga en referentes, se colocó el nombre del proyecto – nombre con el ente que se hace el convenio.\n\n4. Se actualizaron algunos campos debido a los cambios generados.\n","Luz Parra","2024-02-12"]
[null,null,null,"20231120i","Se creó la plantilla desde cero (0), los elementos que la componen funcionan para la temática de Físico Químicos.\n\nSe modificó la hoja de DIGITADOR añadiendo listas de valores, entre otros tal como observaciones generales.\n\nSe crearon todas las columnas que componente la hoja de DATOS, se obtienen valores como la fecha, estación, nivel del agua, temperatura, etc .\n\nSe mapeó toda la hoja de CONFIGURACIÓN para tomar los valores de los muestreos y muestras y generar las tablas que sirven para subir la información al sistema.\n","Kevin Moreno","2023-11-20"]

{"sheet":"configuracion","index":1,"n_rows":71,"n_cols":13,"rows_kept":71,"cut":false,"hidden":true,"merged":[[0,0,2,0],[3,0,5,0],[7,0,8,0],[9,0,15,0],[17,0,21,0],[28,0,35,0],[37,0,42,0],[45,0,45,1],[61,0,61,2],[23,0,26,0]]}
["general","urlServicio","https://argos.invemar.org.co/api/"]
[null,"fila de inicio",3]
[null,"fila de fin",503]
["metodologias","Metodologias",{"$f":"DIGITADOR!$B$4","v":885}]
[null,"Referentes",500]
[null,"Cantidad maxima de referentes ",500]
["estaciones/investigadores","proyectos",3700]
["Lista especies","metodologias"]
[null,"proyectos",3700]
["MUESTREOS","ID_MUESTREO","DATOS,B"]
[null,"ID_ESTACION","DATOS,E"]
[null,"ID_PROYECTO",3700]
[null,"ID_METODOLOGIA",{"$f":"$C$4","v":885}]
[null,"ID_TEMATICAS",{"$f":"IF(C4=\"\",\"\",VLOOKUP(C4,'Otras referencias'!N7:P10,2,FALSE))","v":231}]
[null,"FECHA","DATOS,G"]
[null,"NOTAS","DIGITADOR,B,28"]
[null,"cantidad",503]
["parametro muestreo","ID_MUESTREO","DATOS,B","DATOS,B","DATOS,B","DATOS,B"]
[null,"ID_PARAMETRO",1169,1055,1170,127]
[null,"ID_METODOLOGIA",{"$f":"$C$4","v":885},{"$f":"$C$4","v":885},885,885]
{"$rows_left_out":52}
{"sheet":"DIGITADOR","index":2,"n_rows":38,"n_cols":4,"rows_kept":38,"cut":false,"hidden":false,"merged":[[26,0,26,1],[29,0,29,1],[0,0,0,1],[15,3,15,9],[16,3,16,9],[1,3,9,9],[10,3,14,9],[7,0,8,0]]}
["Recolección de Datos Monitoreo\nFISICOQUIMICOS - Carbono Azul"]
["Código Digitador",{"$f":"IF(B3=\"\",\"\",INDEX(referentes!$V$2:$W$60,MATCH(DIGITADOR!B3,referentes!$W$2:$W$60,0),1))","v":""},null,"Recomendaciones generales: \n¡Precaución! No inserte Filas o Columnas.\nEn los casos en que falte un valor a ingresar que provenga de la hoja de referencias, informe para que el administrador del sistema haga las adiciones necesarias.\nEsta es una plantilla programada. Las columnas de color oscuro se llenan automaticamente, principalmente a partir de los contenidos de la hoja de referencias. \nNO UTILICE PUNTO Y COMA (;) en ningun campo, por ser el separador de variables (columnas). Las unidades de medida son las especificadas en la cabecera de la hoja.\nPara el correcto funcionamiento de la hoja debe estar activa la opcion de Excel de ejecutar macros (al abrir la hoja acepte la opcion habilitar macros, mensaje de Excel que aparece en la parte superior de la hoja en un recuadro amarillo). La extensión del archivo debe ser .xlsm.. \nAl finalizar, renombre el archivo de modo que su contenido sea claro, ejemplo:\ncorporacion_estacion_anocuatrodigitosmesmuestreo.xlsm. El nombre no debe tener espacios en blanco vocales tildadas o ñ."]
["Nombre del responsable",null,{"$f":"IF(G3=\"\",\"\",CONCATENATE(DIGITADOR!$M$1,G3,E3))","v":""}]
["Código Monitoreo",{"$f":"IF(B5=\"\",\"\",INDEX('Otras referencias'!$K$7:$L$9,MATCH(DIGITADOR!B5,'Otras referencias'!$L$7:$L$9,0),1))","v":885}]
["Monitoreo","FISICOQUIMICOS"]
["Entidad","Instituto de Investigaciones Marinas y Costeras"]
["Versión de la plantilla",{"$f":"'Registro de cambios'!$D$5","v":"20250421m"}]
["Fecha en la que ingresa los datos en esta hoja","DD/MM/AAAA"]
[null,"3000-12-12"]
[]
["Código del proyecto",{"$f":"IF(B12=\"\",\"\",INDEX(referentes!A2:B12,MATCH(DIGITADOR!B12,referentes!B2:B12,0),1))","v":""},null,"Previamente a iniciar el llenado de la plantilla, debe presionar el botón \"Descargar referentes\" para que los referentes de ésta plantilla sean actualizados. \nLuego de llenar completamente la plantilla verifique que:\na. No haya celdas con valores como \"#N/A\" o \"#¡REF!\".\nb. No se estén aplicando filtros en la hoja de datos.\nEnvíe la plantilla diligenciada al correo kevin.moreno@invemar.org.co"]
["Proyecto Convenio"]
["Nombre del Archivo",{"$f":"MID(CELL(\"FILENAME\",N63),FIND(\"[\",CELL(\"FILENAME\",N63))+1,   FIND(\"]\",CELL(\"FILENAME\",N63))-FIND(\"[\",CELL(\"FILENAME\",N63))-1)","v":"CA_FISICOQUIMICOS_20250421m.xlsm"}]
["DOI Metadato"]
["Fuente Plantilla ","http://cinto.invemar.org.co/download/Plantillas_ARGOS_Plus/"]
[null,null,null,"Si requiere ayuda contacte a:\nKevin S. Moreno (kevin.moreno@invemar.org.co)"]
["ROLES INVOLUCRADOS","NOMBRE DE LA PERSONA",null,"El custodio de los datos es el único autorizado para distribuir este conjunto de datos. El observador y el digitador se comprometen a tomar las medidas necesarias para salvaguardar este conjunto de datos de modo que copia de los mismos no sean obtenidas y/o usadas por terceros no relacionados con el propósito para la cual se recolectó."]
[{"$f":"IF(A19=\"\",\"\",INDEX('Otras referencias'!$H$6:$I$9,MATCH(DIGITADOR!A19,'Otras referencias'!$I$6:$I$9,0),1))","v":""},{"$f":"IF(B19=\"\",\"\",INDEX(referentes!$V$2:$W$60,MATCH(DIGITADOR!B19,referentes!$W$2:$W$60,0),1))","v":""}]
[]
[{"$f":"IF(A21=\"\",\"\",INDEX('Otras referencias'!$H$6:$I$9,MATCH(DIGITADOR!A21,'Otras referencias'!$I$6:$I$9,0),1))","v":""},{"$f":"IF(B21=\"\",\"\",INDEX(referentes!$V$2:$W$60,MATCH(DIGITADOR!B21,referentes!$W$2:$W$60,0),1))","v":""}]
{"$rows_left_out":19}
{"sheet":"DATOS","index":3,"n_rows":502,"n_cols":27,"rows_kept":502,"cut":false,"hidden":false,"merged":[[0,5,0,6],[0,10,0,26]]}
[null,null,null,null,null,"MUESTREO"]
[{"$f":"TEXT(DIGITADOR!$B$9,\"yyyymmdd\")","v":"30001212"},"AGM MUESTREO","ID MUESTREO","ID MUESTRA","ID ESTACION","PARCELA","FECHA","Hora","Fecha + Hora",null,"Nivel Agua (cm)","Temp superficial (°C)","Temp instersticial 0.5m (°C)",null,"Salinidad superficial UPS","Salinidad intersticial 0.5m\n(UPS)",null,"PH superficial\n(unidades)","PH intersticial 0.5 m\n(unidades)",null,"Conductividad superficial\n(mS/cm)","Conductividad\nintersticial 0.5 m\n(mS/cm)",null,"ORP superficial","ORP intersticial 0.5m\n(mV)","Replica","OBSERVACIONES"]
[null,{"$f":"IF(C3=\"\",\"\",IF(COUNTIF($C$3:C3, C3)>1, \"\", C3))","v":""},{"$f":"IF(G3=\"\",\"\",IF(F3=\"\",\"\",CONCATENATE(DIGITADOR!$M$1,G3,E3)))","v":""},{"$f":"IF(C3=\"\",\"\",CONCATENATE(C3,ROW()-2))","v":""},{"$f":"IF(F3=\"\",\"\",VLOOKUP(F3,referentes!$Q$2:$T$200,3,FALSE))","v":""},null,null,null,{"$f":"IF(G3<>\"\", G3 + H3, \"\")","v":""}]
[null,{"$f":"IF(C4=\"\",\"\",IF(COUNTIF($C$3:C4, C4)>1, \"\", C4))","v":""},{"$f":"IF(G4=\"\",\"\",IF(F4=\"\",\"\",CONCATENATE(DIGITADOR!$M$1,G4,E4)))","v":""},{"$f":"IF(C4=\"\",\"\",CONCATENATE(C4,ROW()-2))","v":""},{"$f":"IF(F4=\"\",\"\",VLOOKUP(F4,referentes!$Q$2:$T$200,3,FALSE))","v":""},null,null,null,{"$f":"IF(G4<>\"\", G4 + H4, \"\")","v":""}]
[null,{"$f":"IF(C5=\"\",\"\",IF(COUNTIF($C$3:C5, C5)>1, \"\", C5))","v":""},{"$f":"IF(G5=\"\",\"\",IF(F5=\"\",\"\",CONCATENATE(DIGITADOR!$M$1,G5,E5)))","v":""},"",{"$f":"IF(F5=\"\",\"\",VLOOKUP(F5,referentes!$Q$2:$T$200,3,FALSE))","v":""},null,null,null,""]
[null,{"$f":"IF(C6=\"\",\"\",IF(COUNTIF($C$3:C6, C6)>1, \"\", C6))","v":""},{"$f":"IF(G6=\"\",\"\",IF(F6=\"\",\"\",CONCATENATE(DIGITADOR!$M$1,G6,E6)))","v":""},"",{"$f":"IF(F6=\"\",\"\",VLOOKUP(F6,referentes!$Q$2:$T$200,3,FALSE))","v":""},null,null,null,""]
[null,{"$f":"IF(C7=\"\",\"\",IF(COUNTIF($C$3:C7, C7)>1, \"\", C7))","v":""},{"$f":"IF(G7=\"\",\"\",IF(F7=\"\",\"\",CONCATENATE(DIGITADOR!$M$1,G7,E7)))","v":""},{"$f":"IF(C7=\"\",\"\",CONCATENATE(C7,ROW()-2))","v":""},{"$f":"IF(F7=\"\",\"\",VLOOKUP(F7,referentes!$Q$2:$T$200,3,FALSE))","v":""},null,null,null,""]
[null,{"$f":"IF(C8=\"\",\"\",IF(COUNTIF($C$3:C8, C8)>1, \"\", C8))","v":""},{"$f":"IF(G8=\"\",\"\",IF(F8=\"\",\"\",CONCATENATE(DIGITADOR!$M$1,G8,E8)))","v":""},"",{"$f":"IF(F8=\"\",\"\",VLOOKUP(F8,referentes!$Q$2:$T$200,3,FALSE))","v":""},null,null,null,""]
[null,{"$f":"IF(C9=\"\",\"\",IF(COUNTIF($C$3:C9, C9)>1, \"\", C9))","v":""},{"$f":"IF(G9=\"\",\"\",IF(F9=\"\",\"\",CONCATENATE(DIGITADOR!$M$1,G9,E9)))","v":""},"",{"$f":"IF(F9=\"\",\"\",VLOOKUP(F9,referentes!$Q$2:$T$200,3,FALSE))","v":""},null,null,null,""]
[null,{"$f":"IF(C10=\"\",\"\",IF(COUNTIF($C$3:C10, C10)>1, \"\", C10))","v":""},{"$f":"IF(G10=\"\",\"\",IF(F10=\"\",\"\",CONCATENATE(DIGITADOR!$M$1,G10,E10)))","v":""},"",{"$f":"IF(F10=\"\",\"\",VLOOKUP(F10,referentes!$Q$2:$T$200,3,FALSE))","v":""},null,null,null,""]
[null,{"$f":"IF(C11=\"\",\"\",IF(COUNTIF($C$3:C11, C11)>1, \"\", C11))","v":""},{"$f":"IF(G11=\"\",\"\",IF(F11=\"\",\"\",CONCATENATE(DIGITADOR!$M$1,G11,E11)))","v":""},"",{"$f":"IF(F11=\"\",\"\",VLOOKUP(F11,referentes!$Q$2:$T$200,3,FALSE))","v":""},null,null,null,""]
[null,{"$f":"IF(C12=\"\",\"\",IF(COUNTIF($C$3:C12, C12)>1, \"\", C12))","v":""},{"$f":"IF(G12=\"\",\"\",IF(F12=\"\",\"\",CONCATENATE(DIGITADOR!$M$1,G12,E12)))","v":""},"",{"$f":"IF(F12=\"\",\"\",VLOOKUP(F12,referentes!$Q$2:$T$200,3,FALSE))","v":""},null,null,null,""]
[null,{"$f":"IF(C13=\"\",\"\",IF(COUNTIF($C$3:C13, C13)>1, \"\", C13))","v":""},{"$f":"IF(G13=\"\",\"\",IF(F13=\"\",\"\",CONCATENATE(DIGITADOR!$M$1,G13,E13)))","v":""},"",{"$f":"IF(F13=\"\",\"\",VLOOKUP(F13,referentes!$Q$2:$T$200,3,FALSE))","v":""},null,null,null,""]
[null,{"$f":"IF(C14=\"\",\"\",IF(COUNTIF($C$3:C14, C14)>1, \"\", C14))","v":""},{"$f":"IF(G14=\"\",\"\",IF(F14=\"\",\"\",CONCATENATE(DIGITADOR!$M$1,G14,E14)))","v":""},"",{"$f":"IF(F14=\"\",\"\",VLOOKUP(F14,referentes!$Q$2:$T$200,3,FALSE))","v":""},null,null,null,""]
[null,{"$f":"IF(C15=\"\",\"\",IF(COUNTIF($C$3:C15, C15)>1, \"\", C15))","v":""},{"$f":"IF(G15=\"\",\"\",IF(F15=\"\",\"\",CONCATENATE(DIGITADOR!$M$1,G15,E15)))","v":""},"",{"$f":"IF(F15=\"\",\"\",VLOOKUP(F15,referentes!$Q$2:$T$200,3,FALSE))","v":""},null,null,null,""]
[null,{"$f":"IF(C16=\"\",\"\",IF(COUNTIF($C$3:C16, C16)>1, \"\", C16))","v":""},{"$f":"IF(G16=\"\",\"\",IF(F16=\"\",\"\",CONCATENATE(DIGITADOR!$M$1,G16,E16)))","v":""},"",{"$f":"IF(F16=\"\",\"\",VLOOKUP(F16,referentes!$Q$2:$T$200,3,FALSE))","v":""},null,null,null,""]
[null,{"$f":"IF(C17=\"\",\"\",IF(COUNTIF($C$3:C17, C17)>1, \"\", C17))","v":""},{"$f":"IF(G17=\"\",\"\",IF(F17=\"\",\"\",CONCATENATE(DIGITADOR!$M$1,G17,E17)))","v":""},"",{"$f":"IF(F17=\"\",\"\",VLOOKUP(F17,referentes!$Q$2:$T$200,3,FALSE))","v":""},null,null,null,""]
[null,{"$f":"IF(C18=\"\",\"\",IF(COUNTIF($C$3:C18, C18)>1, \"\", C18))","v":""},{"$f":"IF(G18=\"\",\"\",IF(F18=\"\",\"\",CONCATENATE(DIGITADOR!$M$1,G18,E18)))","v":""},"",{"$f":"IF(F18=\"\",\"\",VLOOKUP(F18,referentes!$Q$2:$T$200,3,FALSE))","v":""},null,null,null,""]
[null,{"$f":"IF(C19=\"\",\"\",IF(COUNTIF($C$3:C19, C19)>1, \"\", C19))","v":""},{"$f":"IF(G19=\"\",\"\",IF(F19=\"\",\"\",CONCATENATE(DIGITADOR!$M$1,G19,E19)))","v":""},"",{"$f":"IF(F19=\"\",\"\",VLOOKUP(F19,referentes!$Q$2:$T$200,3,FALSE))","v":""},null,null,null,""]
[null,{"$f":"IF(C20=\"\",\"\",IF(COUNTIF($C$3:C20, C20)>1, \"\", C20))","v":""},{"$f":"IF(G20=\"\",\"\",IF(F20=\"\",\"\",CONCATENATE(DIGITADOR!$M$1,G20,E20)))","v":""},"",{"$f":"IF(F20=\"\",\"\",VLOOKUP(F20,referentes!$Q$2:$T$200,3,FALSE))","v":""},null,null,null,""]
{"$rows_left_out":483}
{"sheet":"referentes","index":4,"n_rows":171,"n_cols":23,"rows_kept":171,"cut":false,"hidden":false,"merged":[]}
["AG_LOV"]
["Carbono Azul - CORALINA","Carbono Azul - CORALINA",null,null,null,null,null,null,null,null,null,null,null,null,null,null,"Ararca P6","P",57491,6,null,8619,"Juan Pablo Caicedo García"]
[4545,"Carbono Azul - Vida Manglar",null,null,null,null,null,null,null,null,null,null,null,null,null,null,"Ararca P7","P",57492,7,null,8265,"Kevin Samuel Moreno"]
["Carbono Azul - Conserv. Internacional","Carbono Azul - Conservación Internacional",null,null,null,null,null,null,null,null,null,null,null,null,null,null,"Bahía Honda P1","P",57442,1,null,8642,"Milena Hernández Ortiz"]
[4548,"Carbono Azul - Fundación Grupo ARGOS",null,null,null,null,null,null,null,null,null,null,null,null,null,null,"Bahía Honda P2","P",57443,2,null,4521,"Sebastian Herrera Fajardo"]
["Carbono Azul - DAMCRA","Carbono Azul - DAMCRA",null,null,null,null,null,null,null,null,null,null,null,null,null,null,"Bahía Honda P3","P",57444,3,null,8057,"Tania Carolina Hoyos Ruiz"]
["Carbono Azul - GEF_SAMP","Carbono Azul - GEF_SAMP",null,null,null,null,null,null,null,null,null,null,null,null,null,null,"Bahía Hondita EMH1","EMH",57916,1,null,8266,"Zulay Saudith González Herrera"]
["Carbono Azul - Bolívar","Carbono Azul - Bolívar",null,null,null,null,null,null,null,null,null,null,null,null,null,null,"Bahía Hondita EMH2","EMH",57917,2]
["Línea Base ambiental ECOPETROL","Línea Base ambiental ECOPETROL",null,null,null,null,null,null,null,null,null,null,null,null,null,null,"Bahía Hondita EMH3","EMH",57918,3]
[null,null,null,null,null,null,null,null,null,null,null,null,null,null,null,null,"Bahía Hooker P1","P",57438,1]
[null,null,null,null,null,null,null,null,null,null,null,null,null,null,null,null,"Bahía Hooker P2","P",57439,2]
[null,null,null,null,null,null,null,null,null,null,null,null,null,null,null,null,"Bahía Hooker P3","P",57440,3]
[null,null,null,null,null,null,null,null,null,null,null,null,null,null,null,null,"Bahía Hooker P4","P",57441,4]
[null,null,null,null,null,null,null,null,null,null,null,null,null,null,null,null,"Bahía Málaga P1","P",57833,1]
[null,null,null,null,null,null,null,null,null,null,null,null,null,null,null,null,"Bahía Málaga P10","P",57842,10]
[null,null,null,null,null,null,null,null,null,null,null,null,null,null,null,null,"Bahía Málaga P11","P",57843,11]
[null,null,null,null,null,null,null,null,null,null,null,null,null,null,null,null,"Bahía Málaga P12","P",57844,12]
[null,null,null,null,null,null,null,null,null,null,null,null,null,null,null,null,"Bahía Málaga P13","P",57845,13]
[null,null,null,null,null,null,null,null,null,null,null,null,null,null,null,null,"Bahía Málaga P14","P",57846,14]
[null,null,null,null,null,null,null,null,null,null,null,null,null,null,null,null,"Bahía Málaga P15","P",57847,15]
{"$rows_left_out":152}
{"sheet":"Otras referencias","index":5,"n_rows":28,"n_cols":22,"rows_kept":28,"cut":false,"hidden":false,"merged":[[11,18,11,19],[19,0,19,1],[20,7,20,8],[10,7,10,8],[11,13,11,15],[0,0,2,6],[4,0,4,1],[4,10,4,11],[9,18,9,19],[10,18,10,19],[4,17,4,21],[5,18,5,19],[6,18,6,19],[7,18,7,19],[8,18,8,19],[26,0,26,1],[4,13,4,15],[4,3,4,5],[4,7,4,8],[10,10,10,11]]}
["Estas son listas para variables con valores que no se encuentran codificados, pero que deben manejarse de manera estandarizada. \nSi se requiere agregar un valor nuevo hagalo debajo de la lista correspondiente"]
[]
[]
[]
["UNIDADES DE MEDIDA",null,null,"PROYECTO",null,null,null,"ROLES",null,null,"METODOLOGIAS",null,null,"TEMATICAS",null,null,null,"Descripción general de Proyecto Convenio\n3700"]
["CODIGO","DESCRIPCION",null,"COD","PROYECTO","PROYECTO DESC",null,4,"Captura en campo",null,"CODIGO","DESCRIPCION",null,"COD METODOLOGIA","COD TEMATICA","DESCRIPCION",null,"Codigo del proyecto","Proyecto Convenio",null,"Descripción Siglas del convenio","Estaciones pertenecientes "]
[10,"cm",null,3572,"KFW","KFW",null,6,"Revisar datos",null,null,null,null,885,231,"FISICOQUIMICOS",null,4544,"Carbono Azul - CORALINA",null,"Corporación Coralina ","San Andres, Providencia y Sta Catalina"]
[11,"m",null,null,null,null,null,3497,"Coordinador actividad de campo",null,null,null,null,null,null,null,null,4545,"Carbono Azul - Vida Manglar",null,"Proyecto Vida Manglar","Caimanera Y PNR Guacamayas\nBahía de Cispata"]
[69,"g",null,null,null,null,null,4526,"Procesamiento en laboratorio",null,885,"FISICOQUIMICOS",null,null,null,null,null,4551,"Carbono Azul - GEF_SAMP",null,"Proyecto GEF SAMP:\n- Fondo Mundial para el Medio Ambiente o GEF (por sus siglas en inglés) \n- Diseño e implementación de un Subsistema Nacional de Áreas Marinas Protegidas (SAMP) en Colombia.","Bahia Malaga"]
[142,"Ind/Estación",null,null,null,null,null,null,null,null,null,null,null,null,null,null,null,4547,"Carbono Azul - Fundación Grupo ARGOS",null,"Fundación Grupo ARGOS","Bolívar"]
[null,null,null,null,null,null,null,"MICROHABITAT",null,null,"SUBCUADRANTE",null,null,null,null,null,null,4550,"Carbono Azul - DAMCRA",null,"DAMCRA: Grupo de Ordenamiento Ambiental del Territorio y Gestión Sostenible de la Biodiversidad Costero Marina","Bahia hondita\nGolfo de uraba"]
[null,null,null,null,null,null,null,4507,"Madrigueras de cangrejos",null,"CODIGO","DESCRIPCION",null,"CODIGOS LOV",null,null,null,4546,"Carbono Azul - Conservación Internacional",null,"Conservación Internacional","Mallorquín"]
[null,null,null,null,null,null,null,4508,"Nidos",null,null,"A",null,"DESCRIPCIÓN","CÓDIGO","GRUPO"]
[" m²",null,null,null,null,null,null,4509,"Refugios en árboles vivos",null,null,"B",null,"Departamento",10,2]
[132,null,null,null,null,null,null,4510,"Troncos en descomposición",null,null,null,null,"Sector",20,2]
[28,null,null,null,null,null,null,4511,"Caños",null,null,null,null,"Punto",30,2]
[1,null,null,null,null,null,null,4512,"Hormigueros",null,null,null,null,"Parcela",35,2]
[null,null,null,null,null,null,null,4513,"Termiteros",null,null,null,null,"Estaciones",40,2]
[null,null,null,null,null,null,null,null,null,null,null,null,null,"Region",50,2]
[" ESTADO SALUD",null,null,null,null,null,null,null,null,null,null,null,null,"Unidad_de_Manejo",60,2]
{"$rows_left_out":9}
{"sheet":"AGD_MUESTREOS","index":6,"n_rows":0,"n_cols":0,"rows_kept":0,"cut":false,"hidden":true,"merged":[]}

{"sheet":"AGD_PARAMETRO","index":7,"n_rows":0,"n_cols":0,"rows_kept":0,"cut":false,"hidden":true,"merged":[]}

{"sheet":"AGD_MUESTRAS","index":8,"n_rows":0,"n_cols":0,"rows_kept":0,"cut":false,"hidden":true,"merged":[]}

{"sheet":"AGD_MUESTRAS_VARIABLES","index":9,"n_rows":0,"n_cols":0,"rows_kept":0,"cut":false,"hidden":true,"merged":[]}

{"sheet":"AGD_AUTORIAS","index":10,"n_rows":0,"n_cols":0,"rows_kept":0,"cut":false,"hidden":true,"merged":[]}